{
    "uid": "ASM_control_flow",
    "TRN_EVL_ID": "IDF",
    "NETWORK": "Commercial",
    "KSATs": [
        [
            "K0231",
            "B"
        ],
        [
            "K0776",
            "B"
        ],
        [
            "K0777",
            "B"
        ],
        [
            "K0774",
            "B"
        ],
        [
            "K0794",
            "B"
        ],
        [
            "K0795",
            "B"
        ],
        [
            "K0796",
            "B"
        ],
        [
            "K0797",
            "B"
        ],
        [
            "K0811",
            "B"
        ],
        [
            "K0812",
            "B"
        ]
    ],
    "course": "IDF",
    "module": "Assembly",
    "topic": "Assembly_Control_flow",
    "subtopic": "Control_Flow",
    "lecture_time": 0,
    "perf_demo_time": 0,
    "references": [],
    "lesson_objectives": [],
    "performance_objectives": [],
    "workroles": [
        "basic-dev"
    ]
}