{
    "uid": "IDF_Assembly_ASM_Basics",
    "TRN_EVL_ID": "IDF",
    "NETWORK": "Commercial",
    "KSATs": [
        [
            "S0118",
            "2"
        ],
        [
            "K0202",
            "B"
        ],
        [
            "K0205",
            "B"
        ],
        [
            "K0207",
            "B"
        ],
        [
            "K0206",
            "B"
        ],
        [
            "K0209",
            "B"
        ],
        [
            "K0210",
            "B"
        ],
        [
            "K0213",
            "B"
        ],
        [
            "K0214",
            "B"
        ],
        [
            "K0215",
            "B"
        ],
        [
            "K0216",
            "B"
        ],
        [
            "K0217",
            "B"
        ],
        [
            "K0221",
            "B"
        ],
        [
            "K0223",
            "B"
        ],
        [
            "K0224",
            "B"
        ],
        [
            "K0225",
            "B"
        ],
        [
            "K0226",
            "B"
        ],
        [
            "K0227",
            "B"
        ],
        [
            "K0228",
            "B"
        ],
        [
            "K0767",
            "B"
        ],
        [
            "K0770",
            "B"
        ],
        [
            "K0771",
            "B"
        ]
    ],
    "course": "IDF",
    "module": "Assembly",
    "topic": "Intro_to_ASM",
    "subject": "ASM_Basics",
    "lecture_time": 0,
    "perf_demo_time": 0,
    "references": [],
    "lesson_objectives": [],
    "performance_objectives": [],
    "workroles": [
        "basic-dev"
    ]
}