{
    "uid": "BD_PY_ALGO_BIGO",
    "TRN_EVL_ID": "IDF",
    "NETWORK": "COMMERCIAL",
    "KSATs": [
        [
            "K0686",
            "B"
        ]
    ],
    "course": "IDF",
    "module": "Pseudocode",
    "topic": "Overview",
    "subject": "Overview",
    "lecture_time": 0,
    "perf_demo_time": 0,
    "references": [],
    "lesson_objectives": [
        {
            "description": "",
            "proficiency_level": "",
            "KSATs": [],
            "MSBs": []
        }
    ],
    "performance_objectives": [
        {
            "description": "",
            "KSATs": []
        }
    ],
    "workroles": [
        "basic-dev"
    ]
}