%!PS-Adobe-3.0 EPSF-3.0
%%Title: scenario2.py-network-latest-report/animation-mg-0000.eps
%%Creator: matplotlib version 2.0.0, http://matplotlib.org/
%%CreationDate: Sun Jun  2 09:13:27 2019
%%Orientation: portrait
%%BoundingBox: 75 223 536 568
%%EndComments
%%BeginProlog
/mpldict 8 dict def
mpldict begin
/m { moveto } bind def
/l { lineto } bind def
/r { rlineto } bind def
/c { curveto } bind def
/cl { closepath } bind def
/box {
m
1 index 0 r
0 exch r
neg 0 r
cl
} bind def
/clipbox {
box
clip
newpath
} bind def
%!PS-Adobe-3.0 Resource-Font
%%Title: DejaVu Sans
%%Copyright: Copyright (c) 2003 by Bitstream, Inc. All Rights Reserved. Copyright (c) 2006 by Tavmjong Bah. All Rights Reserved. DejaVu changes are in public domain 
%%Creator: Converted from TrueType to type 3 by PPR
25 dict begin
/_d{bind def}bind def
/_m{moveto}_d
/_l{lineto}_d
/_cl{closepath eofill}_d
/_c{curveto}_d
/_sc{7 -1 roll{setcachedevice}{pop pop pop pop pop pop}ifelse}_d
/_e{exec}_d
/FontName /DejaVuSans def
/PaintType 0 def
/FontMatrix[.001 0 0 .001 0 0]def
/FontBBox[-1021 -463 1793 1232]def
/FontType 3 def
/Encoding [ /zero /one /two /three /four /five /six /seven /a /b /c /d /e /i /l /m /n /p /r /s /t /u /v /y /minus ] def
/FontInfo 10 dict dup begin
/FamilyName (DejaVu Sans) def
/FullName (DejaVu Sans) def
/Notice (Copyright (c) 2003 by Bitstream, Inc. All Rights Reserved. Copyright (c) 2006 by Tavmjong Bah. All Rights Reserved. DejaVu changes are in public domain ) def
/Weight (Book) def
/Version (Version 2.35) def
/ItalicAngle 0.0 def
/isFixedPitch false def
/UnderlinePosition -130 def
/UnderlineThickness 90 def
end readonly def
/CharStrings 25 dict dup begin
/zero{636 0 66 -13 570 742 _sc
318 664 _m
267 664 229 639 203 589 _c
177 539 165 464 165 364 _c
165 264 177 189 203 139 _c
229 89 267 64 318 64 _c
369 64 407 89 433 139 _c
458 189 471 264 471 364 _c
471 464 458 539 433 589 _c
407 639 369 664 318 664 _c
318 742 _m
399 742 461 709 505 645 _c
548 580 570 486 570 364 _c
570 241 548 147 505 83 _c
461 19 399 -13 318 -13 _c
236 -13 173 19 130 83 _c
87 147 66 241 66 364 _c
66 486 87 580 130 645 _c
173 709 236 742 318 742 _c
_cl}_d
/one{636 0 110 0 544 729 _sc
124 83 _m
285 83 _l
285 639 _l
110 604 _l
110 694 _l
284 729 _l
383 729 _l
383 83 _l
544 83 _l
544 0 _l
124 0 _l
124 83 _l
_cl}_d
/two{{636 0 73 0 536 742 _sc
192 83 _m
536 83 _l
536 0 _l
73 0 _l
73 83 _l
110 121 161 173 226 239 _c
290 304 331 346 348 365 _c
380 400 402 430 414 455 _c
426 479 433 504 433 528 _c
433 566 419 598 392 622 _c
365 646 330 659 286 659 _c
255 659 222 653 188 643 _c
154 632 117 616 78 594 _c
78 694 _l
118 710 155 722 189 730 _c
223 738 255 742 284 742 _c
}_e{359 742 419 723 464 685 _c
509 647 532 597 532 534 _c
532 504 526 475 515 449 _c
504 422 484 390 454 354 _c
446 344 420 317 376 272 _c
332 227 271 164 192 83 _c
_cl}_e}_d
/three{{636 0 76 -13 556 742 _sc
406 393 _m
453 383 490 362 516 330 _c
542 298 556 258 556 212 _c
556 140 531 84 482 45 _c
432 6 362 -13 271 -13 _c
240 -13 208 -10 176 -4 _c
144 1 110 10 76 22 _c
76 117 _l
103 101 133 89 166 81 _c
198 73 232 69 268 69 _c
330 69 377 81 409 105 _c
441 129 458 165 458 212 _c
458 254 443 288 413 312 _c
383 336 341 349 287 349 _c
}_e{202 349 _l
202 430 _l
291 430 _l
339 430 376 439 402 459 _c
428 478 441 506 441 543 _c
441 580 427 609 401 629 _c
374 649 336 659 287 659 _c
260 659 231 656 200 650 _c
169 644 135 635 98 623 _c
98 711 _l
135 721 170 729 203 734 _c
235 739 266 742 296 742 _c
370 742 429 725 473 691 _c
517 657 539 611 539 553 _c
539 513 527 479 504 451 _c
481 423 448 403 406 393 _c
_cl}_e}_d
/four{636 0 49 0 580 729 _sc
378 643 _m
129 254 _l
378 254 _l
378 643 _l
352 729 _m
476 729 _l
476 254 _l
580 254 _l
580 172 _l
476 172 _l
476 0 _l
378 0 _l
378 172 _l
49 172 _l
49 267 _l
352 729 _l
_cl}_d
/five{{636 0 77 -13 549 729 _sc
108 729 _m
495 729 _l
495 646 _l
198 646 _l
198 467 _l
212 472 227 476 241 478 _c
255 480 270 482 284 482 _c
365 482 429 459 477 415 _c
525 370 549 310 549 234 _c
549 155 524 94 475 51 _c
426 8 357 -13 269 -13 _c
238 -13 207 -10 175 -6 _c
143 -1 111 6 77 17 _c
77 116 _l
106 100 136 88 168 80 _c
199 72 232 69 267 69 _c
}_e{323 69 368 83 401 113 _c
433 143 450 183 450 234 _c
450 284 433 324 401 354 _c
368 384 323 399 267 399 _c
241 399 214 396 188 390 _c
162 384 135 375 108 363 _c
108 729 _l
_cl}_e}_d
/six{{636 0 70 -13 573 742 _sc
330 404 _m
286 404 251 388 225 358 _c
199 328 186 286 186 234 _c
186 181 199 139 225 109 _c
251 79 286 64 330 64 _c
374 64 409 79 435 109 _c
461 139 474 181 474 234 _c
474 286 461 328 435 358 _c
409 388 374 404 330 404 _c
526 713 _m
526 623 _l
501 635 476 644 451 650 _c
425 656 400 659 376 659 _c
310 659 260 637 226 593 _c
}_e{192 549 172 482 168 394 _c
187 422 211 444 240 459 _c
269 474 301 482 336 482 _c
409 482 467 459 509 415 _c
551 371 573 310 573 234 _c
573 159 550 99 506 54 _c
462 9 403 -13 330 -13 _c
246 -13 181 19 137 83 _c
92 147 70 241 70 364 _c
70 479 97 571 152 639 _c
206 707 280 742 372 742 _c
396 742 421 739 447 735 _c
472 730 498 723 526 713 _c
_cl}_e}_d
/seven{636 0 82 0 551 729 _sc
82 729 _m
551 729 _l
551 687 _l
286 0 _l
183 0 _l
432 646 _l
82 646 _l
82 729 _l
_cl}_d
/a{{613 0 60 -13 522 560 _sc
343 275 _m
270 275 220 266 192 250 _c
164 233 150 205 150 165 _c
150 133 160 107 181 89 _c
202 70 231 61 267 61 _c
317 61 357 78 387 114 _c
417 149 432 196 432 255 _c
432 275 _l
343 275 _l
522 312 _m
522 0 _l
432 0 _l
432 83 _l
411 49 385 25 355 10 _c
325 -5 287 -13 243 -13 _c
187 -13 142 2 109 33 _c
76 64 60 106 60 159 _c
}_e{60 220 80 266 122 298 _c
163 329 224 345 306 345 _c
432 345 _l
432 354 _l
432 395 418 427 391 450 _c
364 472 326 484 277 484 _c
245 484 215 480 185 472 _c
155 464 127 453 100 439 _c
100 522 _l
132 534 164 544 195 550 _c
226 556 256 560 286 560 _c
365 560 424 539 463 498 _c
502 457 522 395 522 312 _c
_cl}_e}_d
/b{{635 0 91 -13 580 760 _sc
487 273 _m
487 339 473 390 446 428 _c
418 466 381 485 334 485 _c
286 485 249 466 222 428 _c
194 390 181 339 181 273 _c
181 207 194 155 222 117 _c
249 79 286 61 334 61 _c
381 61 418 79 446 117 _c
473 155 487 207 487 273 _c
181 464 _m
199 496 223 520 252 536 _c
281 552 316 560 356 560 _c
422 560 476 533 518 481 _c
559 428 580 359 580 273 _c
}_e{580 187 559 117 518 65 _c
476 13 422 -13 356 -13 _c
316 -13 281 -5 252 10 _c
223 25 199 49 181 82 _c
181 0 _l
91 0 _l
91 760 _l
181 760 _l
181 464 _l
_cl}_e}_d
/c{{550 0 55 -13 488 560 _sc
488 526 _m
488 442 _l
462 456 437 466 411 473 _c
385 480 360 484 334 484 _c
276 484 230 465 198 428 _c
166 391 150 339 150 273 _c
150 206 166 154 198 117 _c
230 80 276 62 334 62 _c
360 62 385 65 411 72 _c
437 79 462 90 488 104 _c
488 21 _l
462 9 436 0 410 -5 _c
383 -10 354 -13 324 -13 _c
242 -13 176 12 128 64 _c
}_e{79 115 55 185 55 273 _c
55 362 79 432 128 483 _c
177 534 244 560 330 560 _c
358 560 385 557 411 551 _c
437 545 463 537 488 526 _c
_cl}_e}_d
/d{{635 0 55 -13 544 760 _sc
454 464 _m
454 760 _l
544 760 _l
544 0 _l
454 0 _l
454 82 _l
435 49 411 25 382 10 _c
353 -5 319 -13 279 -13 _c
213 -13 159 13 117 65 _c
75 117 55 187 55 273 _c
55 359 75 428 117 481 _c
159 533 213 560 279 560 _c
319 560 353 552 382 536 _c
411 520 435 496 454 464 _c
148 273 _m
148 207 161 155 188 117 _c
215 79 253 61 301 61 _c
}_e{348 61 385 79 413 117 _c
440 155 454 207 454 273 _c
454 339 440 390 413 428 _c
385 466 348 485 301 485 _c
253 485 215 466 188 428 _c
161 390 148 339 148 273 _c
_cl}_e}_d
/e{{615 0 55 -13 562 560 _sc
562 296 _m
562 252 _l
149 252 _l
153 190 171 142 205 110 _c
238 78 284 62 344 62 _c
378 62 412 66 444 74 _c
476 82 509 95 541 113 _c
541 28 _l
509 14 476 3 442 -3 _c
408 -9 373 -13 339 -13 _c
251 -13 182 12 131 62 _c
80 112 55 181 55 268 _c
55 357 79 428 127 481 _c
175 533 241 560 323 560 _c
397 560 455 536 498 489 _c
}_e{540 441 562 377 562 296 _c
472 322 _m
471 371 457 410 431 440 _c
404 469 368 484 324 484 _c
274 484 234 469 204 441 _c
174 413 156 373 152 322 _c
472 322 _l
_cl}_e}_d
/i{278 0 94 0 184 760 _sc
94 547 _m
184 547 _l
184 0 _l
94 0 _l
94 547 _l
94 760 _m
184 760 _l
184 646 _l
94 646 _l
94 760 _l
_cl}_d
/l{278 0 94 0 184 760 _sc
94 760 _m
184 760 _l
184 0 _l
94 0 _l
94 760 _l
_cl}_d
/m{{974 0 91 0 889 560 _sc
520 442 _m
542 482 569 511 600 531 _c
631 550 668 560 711 560 _c
767 560 811 540 842 500 _c
873 460 889 403 889 330 _c
889 0 _l
799 0 _l
799 327 _l
799 379 789 418 771 444 _c
752 469 724 482 686 482 _c
639 482 602 466 575 435 _c
548 404 535 362 535 309 _c
535 0 _l
445 0 _l
445 327 _l
445 379 435 418 417 444 _c
398 469 369 482 331 482 _c
}_e{285 482 248 466 221 435 _c
194 404 181 362 181 309 _c
181 0 _l
91 0 _l
91 547 _l
181 547 _l
181 462 _l
201 495 226 520 255 536 _c
283 552 317 560 357 560 _c
397 560 430 550 458 530 _c
486 510 506 480 520 442 _c
_cl}_e}_d
/n{634 0 91 0 549 560 _sc
549 330 _m
549 0 _l
459 0 _l
459 327 _l
459 379 448 417 428 443 _c
408 469 378 482 338 482 _c
289 482 251 466 223 435 _c
195 404 181 362 181 309 _c
181 0 _l
91 0 _l
91 547 _l
181 547 _l
181 462 _l
202 494 227 519 257 535 _c
286 551 320 560 358 560 _c
420 560 468 540 500 501 _c
532 462 549 405 549 330 _c
_cl}_d
/p{{635 0 91 -207 580 560 _sc
181 82 _m
181 -207 _l
91 -207 _l
91 547 _l
181 547 _l
181 464 _l
199 496 223 520 252 536 _c
281 552 316 560 356 560 _c
422 560 476 533 518 481 _c
559 428 580 359 580 273 _c
580 187 559 117 518 65 _c
476 13 422 -13 356 -13 _c
316 -13 281 -5 252 10 _c
223 25 199 49 181 82 _c
487 273 _m
487 339 473 390 446 428 _c
418 466 381 485 334 485 _c
}_e{286 485 249 466 222 428 _c
194 390 181 339 181 273 _c
181 207 194 155 222 117 _c
249 79 286 61 334 61 _c
381 61 418 79 446 117 _c
473 155 487 207 487 273 _c
_cl}_e}_d
/r{411 0 91 0 411 560 _sc
411 463 _m
401 469 390 473 378 476 _c
366 478 353 480 339 480 _c
288 480 249 463 222 430 _c
194 397 181 350 181 288 _c
181 0 _l
91 0 _l
91 547 _l
181 547 _l
181 462 _l
199 495 224 520 254 536 _c
284 552 321 560 365 560 _c
371 560 378 559 386 559 _c
393 558 401 557 411 555 _c
411 463 _l
_cl}_d
/s{{521 0 54 -13 472 560 _sc
443 531 _m
443 446 _l
417 458 391 468 364 475 _c
336 481 308 485 279 485 _c
234 485 200 478 178 464 _c
156 450 145 430 145 403 _c
145 382 153 366 169 354 _c
185 342 217 330 265 320 _c
296 313 _l
360 299 405 279 432 255 _c
458 230 472 195 472 151 _c
472 100 452 60 412 31 _c
372 1 316 -13 246 -13 _c
216 -13 186 -10 154 -5 _c
}_e{122 0 89 8 54 20 _c
54 113 _l
87 95 120 82 152 74 _c
184 65 216 61 248 61 _c
290 61 323 68 346 82 _c
368 96 380 117 380 144 _c
380 168 371 187 355 200 _c
339 213 303 226 247 238 _c
216 245 _l
160 257 119 275 95 299 _c
70 323 58 356 58 399 _c
58 450 76 490 112 518 _c
148 546 200 560 268 560 _c
301 560 332 557 362 552 _c
391 547 418 540 443 531 _c
}_e{_cl}_e}_d
/t{392 0 27 0 368 702 _sc
183 702 _m
183 547 _l
368 547 _l
368 477 _l
183 477 _l
183 180 _l
183 135 189 106 201 94 _c
213 81 238 75 276 75 _c
368 75 _l
368 0 _l
276 0 _l
206 0 158 13 132 39 _c
106 65 93 112 93 180 _c
93 477 _l
27 477 _l
27 547 _l
93 547 _l
93 702 _l
183 702 _l
_cl}_d
/u{634 0 85 -13 543 560 _sc
85 216 _m
85 547 _l
175 547 _l
175 219 _l
175 167 185 129 205 103 _c
225 77 255 64 296 64 _c
344 64 383 79 411 110 _c
439 141 453 183 453 237 _c
453 547 _l
543 547 _l
543 0 _l
453 0 _l
453 84 _l
431 50 405 26 377 10 _c
348 -5 315 -13 277 -13 _c
214 -13 166 6 134 45 _c
101 83 85 140 85 216 _c
311 560 _m
311 560 _l
_cl}_d
/v{592 0 30 0 562 547 _sc
30 547 _m
125 547 _l
296 88 _l
467 547 _l
562 547 _l
357 0 _l
235 0 _l
30 547 _l
_cl}_d
/y{592 0 30 -207 562 547 _sc
322 -50 _m
296 -114 271 -157 247 -177 _c
223 -197 191 -207 151 -207 _c
79 -207 _l
79 -132 _l
132 -132 _l
156 -132 175 -126 189 -114 _c
203 -102 218 -75 235 -31 _c
251 9 _l
30 547 _l
125 547 _l
296 119 _l
467 547 _l
562 547 _l
322 -50 _l
_cl}_d
/minus{838 0 106 272 732 355 _sc
106 355 _m
732 355 _l
732 272 _l
106 272 _l
106 355 _l
_cl}_d
end readonly def

/BuildGlyph
 {exch begin
 CharStrings exch
 2 copy known not{pop /.notdef}if
 true 3 1 roll get exec
 end}_d

/BuildChar {
 1 index /Encoding get exch get
 1 index /BuildGlyph get exec
}_d

FontName currentdict end definefont pop
end
%%EndProlog
mpldict begin
75.6 223.2 translate
460.8 345.6 0 0 clipbox
gsave
0 0 m
460.8 0 l
460.8 345.6 l
0 345.6 l
cl
1.000 setgray
fill
grestore
gsave
57.6 38.016 m
414.72 38.016 l
414.72 304.128 l
57.6 304.128 l
cl
1.000 setgray
fill
grestore
gsave
357.1 266.1 57.6 38.02 clipbox
78.006857 131.836618 m
88.210286 131.836618 l
88.210286 154.030189 l
78.006857 154.030189 l
cl
1.000 0.000 0.000 setrgbcolor
fill
grestore
gsave
357.1 266.1 57.6 38.02 clipbox
90.761143 131.836618 m
100.964571 131.836618 l
100.964571 154.030189 l
90.761143 154.030189 l
cl
1.000 0.000 0.000 setrgbcolor
fill
grestore
gsave
357.1 266.1 57.6 38.02 clipbox
103.515429 131.836618 m
113.718857 131.836618 l
113.718857 154.030189 l
103.515429 154.030189 l
cl
1.000 0.000 0.000 setrgbcolor
fill
grestore
gsave
357.1 266.1 57.6 38.02 clipbox
116.269714 131.836618 m
126.473143 131.836618 l
126.473143 154.030189 l
116.269714 154.030189 l
cl
1.000 0.000 0.000 setrgbcolor
fill
grestore
gsave
357.1 266.1 57.6 38.02 clipbox
129.024 131.836618 m
139.227429 131.836618 l
139.227429 154.030189 l
129.024 154.030189 l
cl
1.000 0.000 0.000 setrgbcolor
fill
grestore
gsave
357.1 266.1 57.6 38.02 clipbox
141.778286 131.836618 m
151.981714 131.836618 l
151.981714 154.030189 l
141.778286 154.030189 l
cl
1.000 0.000 0.000 setrgbcolor
fill
grestore
gsave
357.1 266.1 57.6 38.02 clipbox
154.532571 131.836618 m
164.736 131.836618 l
164.736 154.030189 l
154.532571 154.030189 l
cl
1.000 0.000 0.000 setrgbcolor
fill
grestore
gsave
357.1 266.1 57.6 38.02 clipbox
167.286857 131.836618 m
177.490286 131.836618 l
177.490286 154.030189 l
167.286857 154.030189 l
cl
1.000 0.000 0.000 setrgbcolor
fill
grestore
gsave
357.1 266.1 57.6 38.02 clipbox
180.041143 131.836618 m
190.244571 131.836618 l
190.244571 154.030189 l
180.041143 154.030189 l
cl
1.000 0.000 0.000 setrgbcolor
fill
grestore
gsave
357.1 266.1 57.6 38.02 clipbox
192.795429 131.836618 m
202.998857 131.836618 l
202.998857 154.030189 l
192.795429 154.030189 l
cl
1.000 0.000 0.000 setrgbcolor
fill
grestore
gsave
357.1 266.1 57.6 38.02 clipbox
205.549714 131.836618 m
215.753143 131.836618 l
215.753143 154.030189 l
205.549714 154.030189 l
cl
1.000 0.000 0.000 setrgbcolor
fill
grestore
gsave
357.1 266.1 57.6 38.02 clipbox
218.304 131.836618 m
228.507429 131.836618 l
228.507429 154.030189 l
218.304 154.030189 l
cl
1.000 0.000 0.000 setrgbcolor
fill
grestore
gsave
357.1 266.1 57.6 38.02 clipbox
231.058286 131.836618 m
241.261714 131.836618 l
241.261714 154.030189 l
231.058286 154.030189 l
cl
1.000 0.000 0.000 setrgbcolor
fill
grestore
gsave
357.1 266.1 57.6 38.02 clipbox
243.812571 131.836618 m
254.016 131.836618 l
254.016 154.030189 l
243.812571 154.030189 l
cl
1.000 0.000 0.000 setrgbcolor
fill
grestore
gsave
357.1 266.1 57.6 38.02 clipbox
256.566857 131.836618 m
266.770286 131.836618 l
266.770286 154.030189 l
256.566857 154.030189 l
cl
1.000 0.000 0.000 setrgbcolor
fill
grestore
gsave
357.1 266.1 57.6 38.02 clipbox
269.321143 131.836618 m
279.524571 131.836618 l
279.524571 154.030189 l
269.321143 154.030189 l
cl
1.000 0.000 0.000 setrgbcolor
fill
grestore
gsave
357.1 266.1 57.6 38.02 clipbox
282.075429 131.836618 m
292.278857 131.836618 l
292.278857 154.030189 l
282.075429 154.030189 l
cl
1.000 0.000 0.000 setrgbcolor
fill
grestore
gsave
357.1 266.1 57.6 38.02 clipbox
294.829714 131.836618 m
305.033143 131.836618 l
305.033143 154.030189 l
294.829714 154.030189 l
cl
1.000 0.000 0.000 setrgbcolor
fill
grestore
gsave
357.1 266.1 57.6 38.02 clipbox
307.584 131.836618 m
317.787429 131.836618 l
317.787429 154.030189 l
307.584 154.030189 l
cl
1.000 0.000 0.000 setrgbcolor
fill
grestore
gsave
357.1 266.1 57.6 38.02 clipbox
320.338286 131.836618 m
330.541714 131.836618 l
330.541714 154.030189 l
320.338286 154.030189 l
cl
1.000 0.000 0.000 setrgbcolor
fill
grestore
gsave
357.1 266.1 57.6 38.02 clipbox
333.092571 131.836618 m
343.296 131.836618 l
343.296 154.030189 l
333.092571 154.030189 l
cl
1.000 0.000 0.000 setrgbcolor
fill
grestore
gsave
357.1 266.1 57.6 38.02 clipbox
345.846857 131.836618 m
356.050286 131.836618 l
356.050286 154.030189 l
345.846857 154.030189 l
cl
1.000 0.000 0.000 setrgbcolor
fill
grestore
gsave
357.1 266.1 57.6 38.02 clipbox
358.601143 131.836618 m
368.804571 131.836618 l
368.804571 154.030189 l
358.601143 154.030189 l
cl
1.000 0.000 0.000 setrgbcolor
fill
grestore
gsave
357.1 266.1 57.6 38.02 clipbox
371.355429 131.836618 m
381.558857 131.836618 l
381.558857 154.030189 l
371.355429 154.030189 l
cl
1.000 0.000 0.000 setrgbcolor
fill
grestore
gsave
357.1 266.1 57.6 38.02 clipbox
78.006857 131.559199 m
88.210286 131.559199 l
88.210286 131.836618 l
78.006857 131.836618 l
cl
1.000 0.647 0.000 setrgbcolor
fill
grestore
gsave
357.1 266.1 57.6 38.02 clipbox
90.761143 131.559199 m
100.964571 131.559199 l
100.964571 131.836618 l
90.761143 131.836618 l
cl
1.000 0.647 0.000 setrgbcolor
fill
grestore
gsave
357.1 266.1 57.6 38.02 clipbox
103.515429 131.559199 m
113.718857 131.559199 l
113.718857 131.836618 l
103.515429 131.836618 l
cl
1.000 0.647 0.000 setrgbcolor
fill
grestore
gsave
357.1 266.1 57.6 38.02 clipbox
116.269714 131.531457 m
126.473143 131.531457 l
126.473143 131.836618 l
116.269714 131.836618 l
cl
1.000 0.647 0.000 setrgbcolor
fill
grestore
gsave
357.1 266.1 57.6 38.02 clipbox
129.024 130.810166 m
139.227429 130.810166 l
139.227429 131.836618 l
129.024 131.836618 l
cl
1.000 0.647 0.000 setrgbcolor
fill
grestore
gsave
357.1 266.1 57.6 38.02 clipbox
141.778286 126.232742 m
151.981714 126.232742 l
151.981714 131.836618 l
141.778286 131.836618 l
cl
1.000 0.647 0.000 setrgbcolor
fill
grestore
gsave
357.1 266.1 57.6 38.02 clipbox
154.532571 119.130799 m
164.736 119.130799 l
164.736 131.836618 l
154.532571 131.836618 l
cl
1.000 0.647 0.000 setrgbcolor
fill
grestore
gsave
357.1 266.1 57.6 38.02 clipbox
167.286857 111.612727 m
177.490286 111.612727 l
177.490286 131.836618 l
167.286857 131.836618 l
cl
1.000 0.647 0.000 setrgbcolor
fill
grestore
gsave
357.1 266.1 57.6 38.02 clipbox
180.041143 104.87143 m
190.244571 104.87143 l
190.244571 131.836618 l
180.041143 131.836618 l
cl
1.000 0.647 0.000 setrgbcolor
fill
grestore
gsave
357.1 266.1 57.6 38.02 clipbox
192.795429 100.654651 m
202.998857 100.654651 l
202.998857 131.836618 l
192.795429 131.836618 l
cl
1.000 0.647 0.000 setrgbcolor
fill
grestore
gsave
357.1 266.1 57.6 38.02 clipbox
205.549714 98.823682 m
215.753143 98.823682 l
215.753143 131.836618 l
205.549714 131.836618 l
cl
1.000 0.647 0.000 setrgbcolor
fill
grestore
gsave
357.1 266.1 57.6 38.02 clipbox
218.304 99.128843 m
228.507429 99.128843 l
228.507429 131.836618 l
218.304 131.836618 l
cl
1.000 0.647 0.000 setrgbcolor
fill
grestore
gsave
357.1 266.1 57.6 38.02 clipbox
231.058286 100.404974 m
241.261714 100.404974 l
241.261714 131.836618 l
231.058286 131.836618 l
cl
1.000 0.647 0.000 setrgbcolor
fill
grestore
gsave
357.1 266.1 57.6 38.02 clipbox
243.812571 101.847556 m
254.016 101.847556 l
254.016 131.836618 l
243.812571 131.836618 l
cl
1.000 0.647 0.000 setrgbcolor
fill
grestore
gsave
357.1 266.1 57.6 38.02 clipbox
256.566857 106.591431 m
266.770286 106.591431 l
266.770286 131.836618 l
256.566857 131.836618 l
cl
1.000 0.647 0.000 setrgbcolor
fill
grestore
gsave
357.1 266.1 57.6 38.02 clipbox
269.321143 109.587564 m
279.524571 109.587564 l
279.524571 131.836618 l
269.321143 131.836618 l
cl
1.000 0.647 0.000 setrgbcolor
fill
grestore
gsave
357.1 266.1 57.6 38.02 clipbox
282.075429 114.608859 m
292.278857 114.608859 l
292.278857 131.836618 l
282.075429 131.836618 l
cl
1.000 0.647 0.000 setrgbcolor
fill
grestore
gsave
357.1 266.1 57.6 38.02 clipbox
294.829714 119.047573 m
305.033143 119.047573 l
305.033143 131.836618 l
294.829714 131.836618 l
cl
1.000 0.647 0.000 setrgbcolor
fill
grestore
gsave
357.1 266.1 57.6 38.02 clipbox
307.584 124.179836 m
317.787429 124.179836 l
317.787429 131.836618 l
307.584 131.836618 l
cl
1.000 0.647 0.000 setrgbcolor
fill
grestore
gsave
357.1 266.1 57.6 38.02 clipbox
320.338286 128.452099 m
330.541714 128.452099 l
330.541714 131.836618 l
320.338286 131.836618 l
cl
1.000 0.647 0.000 setrgbcolor
fill
grestore
gsave
357.1 266.1 57.6 38.02 clipbox
333.092571 128.729518 m
343.296 128.729518 l
343.296 131.836618 l
333.092571 131.836618 l
cl
1.000 0.647 0.000 setrgbcolor
fill
grestore
gsave
357.1 266.1 57.6 38.02 clipbox
345.846857 129.284358 m
356.050286 129.284358 l
356.050286 131.836618 l
345.846857 131.836618 l
cl
1.000 0.647 0.000 setrgbcolor
fill
grestore
gsave
357.1 266.1 57.6 38.02 clipbox
358.601143 131.392747 m
368.804571 131.392747 l
368.804571 131.836618 l
358.601143 131.836618 l
cl
1.000 0.647 0.000 setrgbcolor
fill
grestore
gsave
357.1 266.1 57.6 38.02 clipbox
371.355429 131.586941 m
381.558857 131.586941 l
381.558857 131.836618 l
371.355429 131.836618 l
cl
1.000 0.647 0.000 setrgbcolor
fill
grestore
gsave
357.1 266.1 57.6 38.02 clipbox
78.006857 154.030189 m
88.210286 154.030189 l
88.210286 154.030189 l
78.006857 154.030189 l
cl
1.000 1.000 0.000 setrgbcolor
fill
grestore
gsave
357.1 266.1 57.6 38.02 clipbox
90.761143 154.030189 m
100.964571 154.030189 l
100.964571 154.030189 l
90.761143 154.030189 l
cl
1.000 1.000 0.000 setrgbcolor
fill
grestore
gsave
357.1 266.1 57.6 38.02 clipbox
103.515429 154.030189 m
113.718857 154.030189 l
113.718857 154.030189 l
103.515429 154.030189 l
cl
1.000 1.000 0.000 setrgbcolor
fill
grestore
gsave
357.1 266.1 57.6 38.02 clipbox
116.269714 154.030189 m
126.473143 154.030189 l
126.473143 154.030189 l
116.269714 154.030189 l
cl
1.000 1.000 0.000 setrgbcolor
fill
grestore
gsave
357.1 266.1 57.6 38.02 clipbox
129.024 154.030189 m
139.227429 154.030189 l
139.227429 154.030189 l
129.024 154.030189 l
cl
1.000 1.000 0.000 setrgbcolor
fill
grestore
gsave
357.1 266.1 57.6 38.02 clipbox
141.778286 154.030189 m
151.981714 154.030189 l
151.981714 154.030189 l
141.778286 154.030189 l
cl
1.000 1.000 0.000 setrgbcolor
fill
grestore
gsave
357.1 266.1 57.6 38.02 clipbox
154.532571 154.030189 m
164.736 154.030189 l
164.736 154.030189 l
154.532571 154.030189 l
cl
1.000 1.000 0.000 setrgbcolor
fill
grestore
gsave
357.1 266.1 57.6 38.02 clipbox
167.286857 154.030189 m
177.490286 154.030189 l
177.490286 154.030189 l
167.286857 154.030189 l
cl
1.000 1.000 0.000 setrgbcolor
fill
grestore
gsave
357.1 266.1 57.6 38.02 clipbox
180.041143 154.030189 m
190.244571 154.030189 l
190.244571 154.030189 l
180.041143 154.030189 l
cl
1.000 1.000 0.000 setrgbcolor
fill
grestore
gsave
357.1 266.1 57.6 38.02 clipbox
192.795429 154.030189 m
202.998857 154.030189 l
202.998857 154.030189 l
192.795429 154.030189 l
cl
1.000 1.000 0.000 setrgbcolor
fill
grestore
gsave
357.1 266.1 57.6 38.02 clipbox
205.549714 154.030189 m
215.753143 154.030189 l
215.753143 154.030189 l
205.549714 154.030189 l
cl
1.000 1.000 0.000 setrgbcolor
fill
grestore
gsave
357.1 266.1 57.6 38.02 clipbox
218.304 154.030189 m
228.507429 154.030189 l
228.507429 154.030189 l
218.304 154.030189 l
cl
1.000 1.000 0.000 setrgbcolor
fill
grestore
gsave
357.1 266.1 57.6 38.02 clipbox
231.058286 154.030189 m
241.261714 154.030189 l
241.261714 154.030189 l
231.058286 154.030189 l
cl
1.000 1.000 0.000 setrgbcolor
fill
grestore
gsave
357.1 266.1 57.6 38.02 clipbox
243.812571 154.030189 m
254.016 154.030189 l
254.016 154.030189 l
243.812571 154.030189 l
cl
1.000 1.000 0.000 setrgbcolor
fill
grestore
gsave
357.1 266.1 57.6 38.02 clipbox
256.566857 154.030189 m
266.770286 154.030189 l
266.770286 154.030189 l
256.566857 154.030189 l
cl
1.000 1.000 0.000 setrgbcolor
fill
grestore
gsave
357.1 266.1 57.6 38.02 clipbox
269.321143 154.030189 m
279.524571 154.030189 l
279.524571 154.030189 l
269.321143 154.030189 l
cl
1.000 1.000 0.000 setrgbcolor
fill
grestore
gsave
357.1 266.1 57.6 38.02 clipbox
282.075429 154.030189 m
292.278857 154.030189 l
292.278857 154.030189 l
282.075429 154.030189 l
cl
1.000 1.000 0.000 setrgbcolor
fill
grestore
gsave
357.1 266.1 57.6 38.02 clipbox
294.829714 154.030189 m
305.033143 154.030189 l
305.033143 154.030189 l
294.829714 154.030189 l
cl
1.000 1.000 0.000 setrgbcolor
fill
grestore
gsave
357.1 266.1 57.6 38.02 clipbox
307.584 154.030189 m
317.787429 154.030189 l
317.787429 154.030189 l
307.584 154.030189 l
cl
1.000 1.000 0.000 setrgbcolor
fill
grestore
gsave
357.1 266.1 57.6 38.02 clipbox
320.338286 154.030189 m
330.541714 154.030189 l
330.541714 154.030189 l
320.338286 154.030189 l
cl
1.000 1.000 0.000 setrgbcolor
fill
grestore
gsave
357.1 266.1 57.6 38.02 clipbox
333.092571 154.030189 m
343.296 154.030189 l
343.296 154.030189 l
333.092571 154.030189 l
cl
1.000 1.000 0.000 setrgbcolor
fill
grestore
gsave
357.1 266.1 57.6 38.02 clipbox
345.846857 154.030189 m
356.050286 154.030189 l
356.050286 154.030189 l
345.846857 154.030189 l
cl
1.000 1.000 0.000 setrgbcolor
fill
grestore
gsave
357.1 266.1 57.6 38.02 clipbox
358.601143 154.030189 m
368.804571 154.030189 l
368.804571 154.030189 l
358.601143 154.030189 l
cl
1.000 1.000 0.000 setrgbcolor
fill
grestore
gsave
357.1 266.1 57.6 38.02 clipbox
371.355429 154.030189 m
381.558857 154.030189 l
381.558857 154.030189 l
371.355429 154.030189 l
cl
1.000 1.000 0.000 setrgbcolor
fill
grestore
gsave
357.1 266.1 57.6 38.02 clipbox
78.006857 154.030189 m
88.210286 154.030189 l
88.210286 161.414253 l
78.006857 161.414253 l
cl
0.502 0.000 0.502 setrgbcolor
fill
grestore
gsave
357.1 266.1 57.6 38.02 clipbox
90.761143 154.030189 m
100.964571 154.030189 l
100.964571 161.414144 l
90.761143 161.414144 l
cl
0.502 0.000 0.502 setrgbcolor
fill
grestore
gsave
357.1 266.1 57.6 38.02 clipbox
103.515429 154.030189 m
113.718857 154.030189 l
113.718857 161.414003 l
103.515429 161.414003 l
cl
0.502 0.000 0.502 setrgbcolor
fill
grestore
gsave
357.1 266.1 57.6 38.02 clipbox
116.269714 154.030189 m
126.473143 154.030189 l
126.473143 161.413955 l
116.269714 161.413955 l
cl
0.502 0.000 0.502 setrgbcolor
fill
grestore
gsave
357.1 266.1 57.6 38.02 clipbox
129.024 154.030189 m
139.227429 154.030189 l
139.227429 161.41409 l
129.024 161.41409 l
cl
0.502 0.000 0.502 setrgbcolor
fill
grestore
gsave
357.1 266.1 57.6 38.02 clipbox
141.778286 154.030189 m
151.981714 154.030189 l
151.981714 155.361617 l
141.778286 155.361617 l
cl
0.502 0.000 0.502 setrgbcolor
fill
grestore
gsave
357.1 266.1 57.6 38.02 clipbox
154.532571 154.030189 m
164.736 154.030189 l
164.736 155.362041 l
154.532571 155.362041 l
cl
0.502 0.000 0.502 setrgbcolor
fill
grestore
gsave
357.1 266.1 57.6 38.02 clipbox
167.286857 154.030189 m
177.490286 154.030189 l
177.490286 158.13664 l
167.286857 158.13664 l
cl
0.502 0.000 0.502 setrgbcolor
fill
grestore
gsave
357.1 266.1 57.6 38.02 clipbox
180.041143 154.030189 m
190.244571 154.030189 l
190.244571 165.534762 l
180.041143 165.534762 l
cl
0.502 0.000 0.502 setrgbcolor
fill
grestore
gsave
357.1 266.1 57.6 38.02 clipbox
192.795429 154.030189 m
202.998857 154.030189 l
202.998857 166.644499 l
192.795429 166.644499 l
cl
0.502 0.000 0.502 setrgbcolor
fill
grestore
gsave
357.1 266.1 57.6 38.02 clipbox
205.549714 154.030189 m
215.753143 154.030189 l
215.753143 162.760493 l
205.549714 162.760493 l
cl
0.502 0.000 0.502 setrgbcolor
fill
grestore
gsave
357.1 266.1 57.6 38.02 clipbox
218.304 154.030189 m
228.507429 154.030189 l
228.507429 162.760266 l
218.304 162.760266 l
cl
0.502 0.000 0.502 setrgbcolor
fill
grestore
gsave
357.1 266.1 57.6 38.02 clipbox
231.058286 154.030189 m
241.261714 154.030189 l
241.261714 171.637507 l
231.058286 171.637507 l
cl
0.502 0.000 0.502 setrgbcolor
fill
grestore
gsave
357.1 266.1 57.6 38.02 clipbox
243.812571 154.030189 m
254.016 154.030189 l
254.016 171.637457 l
243.812571 171.637457 l
cl
0.502 0.000 0.502 setrgbcolor
fill
grestore
gsave
357.1 266.1 57.6 38.02 clipbox
256.566857 154.030189 m
266.770286 154.030189 l
266.770286 171.637533 l
256.566857 171.637533 l
cl
0.502 0.000 0.502 setrgbcolor
fill
grestore
gsave
357.1 266.1 57.6 38.02 clipbox
269.321143 154.030189 m
279.524571 154.030189 l
279.524571 171.637597 l
269.321143 171.637597 l
cl
0.502 0.000 0.502 setrgbcolor
fill
grestore
gsave
357.1 266.1 57.6 38.02 clipbox
282.075429 154.030189 m
292.278857 154.030189 l
292.278857 171.63745 l
282.075429 171.63745 l
cl
0.502 0.000 0.502 setrgbcolor
fill
grestore
gsave
357.1 266.1 57.6 38.02 clipbox
294.829714 154.030189 m
305.033143 154.030189 l
305.033143 173.856323 l
294.829714 173.856323 l
cl
0.502 0.000 0.502 setrgbcolor
fill
grestore
gsave
357.1 266.1 57.6 38.02 clipbox
307.584 154.030189 m
317.787429 154.030189 l
317.787429 179.908465 l
307.584 179.908465 l
cl
0.502 0.000 0.502 setrgbcolor
fill
grestore
gsave
357.1 266.1 57.6 38.02 clipbox
320.338286 154.030189 m
330.541714 154.030189 l
330.541714 179.908069 l
320.338286 179.908069 l
cl
0.502 0.000 0.502 setrgbcolor
fill
grestore
gsave
357.1 266.1 57.6 38.02 clipbox
333.092571 154.030189 m
343.296 154.030189 l
343.296 166.96212 l
333.092571 166.96212 l
cl
0.502 0.000 0.502 setrgbcolor
fill
grestore
gsave
357.1 266.1 57.6 38.02 clipbox
345.846857 154.030189 m
356.050286 154.030189 l
356.050286 166.961962 l
345.846857 166.961962 l
cl
0.502 0.000 0.502 setrgbcolor
fill
grestore
gsave
357.1 266.1 57.6 38.02 clipbox
358.601143 154.030189 m
368.804571 154.030189 l
368.804571 168.072717 l
358.601143 168.072717 l
cl
0.502 0.000 0.502 setrgbcolor
fill
grestore
gsave
357.1 266.1 57.6 38.02 clipbox
371.355429 154.030189 m
381.558857 154.030189 l
381.558857 162.524095 l
371.355429 162.524095 l
cl
0.502 0.000 0.502 setrgbcolor
fill
grestore
gsave
357.1 266.1 57.6 38.02 clipbox
78.006857 161.414253 m
88.210286 161.414253 l
88.210286 168.798318 l
78.006857 168.798318 l
cl
1.000 0.000 1.000 setrgbcolor
fill
grestore
gsave
357.1 266.1 57.6 38.02 clipbox
90.761143 161.414144 m
100.964571 161.414144 l
100.964571 168.798099 l
90.761143 168.798099 l
cl
1.000 0.000 1.000 setrgbcolor
fill
grestore
gsave
357.1 266.1 57.6 38.02 clipbox
103.515429 161.414003 m
113.718857 161.414003 l
113.718857 168.797817 l
103.515429 168.797817 l
cl
1.000 0.000 1.000 setrgbcolor
fill
grestore
gsave
357.1 266.1 57.6 38.02 clipbox
116.269714 161.413955 m
126.473143 161.413955 l
126.473143 168.79772 l
116.269714 168.79772 l
cl
1.000 0.000 1.000 setrgbcolor
fill
grestore
gsave
357.1 266.1 57.6 38.02 clipbox
129.024 161.41409 m
139.227429 161.41409 l
139.227429 168.79799 l
129.024 168.79799 l
cl
1.000 0.000 1.000 setrgbcolor
fill
grestore
gsave
357.1 266.1 57.6 38.02 clipbox
141.778286 155.361617 m
151.981714 155.361617 l
151.981714 165.520034 l
141.778286 165.520034 l
cl
1.000 0.000 1.000 setrgbcolor
fill
grestore
gsave
357.1 266.1 57.6 38.02 clipbox
154.532571 155.362041 m
164.736 155.362041 l
164.736 165.52088 l
154.532571 165.52088 l
cl
1.000 0.000 1.000 setrgbcolor
fill
grestore
gsave
357.1 266.1 57.6 38.02 clipbox
167.286857 158.13664 m
177.490286 158.13664 l
177.490286 163.352769 l
167.286857 163.352769 l
cl
1.000 0.000 1.000 setrgbcolor
fill
grestore
gsave
357.1 266.1 57.6 38.02 clipbox
180.041143 165.534762 m
190.244571 165.534762 l
190.244571 172.785566 l
180.041143 172.785566 l
cl
1.000 0.000 1.000 setrgbcolor
fill
grestore
gsave
357.1 266.1 57.6 38.02 clipbox
192.795429 166.644499 m
202.998857 166.644499 l
202.998857 173.895363 l
192.795429 173.895363 l
cl
1.000 0.000 1.000 setrgbcolor
fill
grestore
gsave
357.1 266.1 57.6 38.02 clipbox
205.549714 162.760493 m
215.753143 162.760493 l
215.753143 170.011224 l
205.549714 170.011224 l
cl
1.000 0.000 1.000 setrgbcolor
fill
grestore
gsave
357.1 266.1 57.6 38.02 clipbox
218.304 162.760266 m
228.507429 162.760266 l
228.507429 170.010771 l
218.304 170.010771 l
cl
1.000 0.000 1.000 setrgbcolor
fill
grestore
gsave
357.1 266.1 57.6 38.02 clipbox
231.058286 171.637507 m
241.261714 171.637507 l
241.261714 178.887825 l
231.058286 178.887825 l
cl
1.000 0.000 1.000 setrgbcolor
fill
grestore
gsave
357.1 266.1 57.6 38.02 clipbox
243.812571 171.637457 m
254.016 171.637457 l
254.016 178.887725 l
243.812571 178.887725 l
cl
1.000 0.000 1.000 setrgbcolor
fill
grestore
gsave
357.1 266.1 57.6 38.02 clipbox
256.566857 171.637533 m
266.770286 171.637533 l
266.770286 178.887878 l
256.566857 178.887878 l
cl
1.000 0.000 1.000 setrgbcolor
fill
grestore
gsave
357.1 266.1 57.6 38.02 clipbox
269.321143 171.637597 m
279.524571 171.637597 l
279.524571 178.888005 l
269.321143 178.888005 l
cl
1.000 0.000 1.000 setrgbcolor
fill
grestore
gsave
357.1 266.1 57.6 38.02 clipbox
282.075429 171.63745 m
292.278857 171.63745 l
292.278857 178.88771 l
282.075429 178.88771 l
cl
1.000 0.000 1.000 setrgbcolor
fill
grestore
gsave
357.1 266.1 57.6 38.02 clipbox
294.829714 173.856323 m
305.033143 173.856323 l
305.033143 181.106115 l
294.829714 181.106115 l
cl
1.000 0.000 1.000 setrgbcolor
fill
grestore
gsave
357.1 266.1 57.6 38.02 clipbox
307.584 179.908465 m
317.787429 179.908465 l
317.787429 192.705983 l
307.584 192.705983 l
cl
1.000 0.000 1.000 setrgbcolor
fill
grestore
gsave
357.1 266.1 57.6 38.02 clipbox
320.338286 179.908069 m
330.541714 179.908069 l
330.541714 192.705193 l
320.338286 192.705193 l
cl
1.000 0.000 1.000 setrgbcolor
fill
grestore
gsave
357.1 266.1 57.6 38.02 clipbox
333.092571 166.96212 m
343.296 166.96212 l
343.296 181.00373 l
333.092571 181.00373 l
cl
1.000 0.000 1.000 setrgbcolor
fill
grestore
gsave
357.1 266.1 57.6 38.02 clipbox
345.846857 166.961962 m
356.050286 166.961962 l
356.050286 177.674377 l
345.846857 177.674377 l
cl
1.000 0.000 1.000 setrgbcolor
fill
grestore
gsave
357.1 266.1 57.6 38.02 clipbox
358.601143 168.072717 m
368.804571 168.072717 l
368.804571 177.67653 l
358.601143 177.67653 l
cl
1.000 0.000 1.000 setrgbcolor
fill
grestore
gsave
357.1 266.1 57.6 38.02 clipbox
371.355429 162.524095 m
381.558857 162.524095 l
381.558857 172.127665 l
371.355429 172.127665 l
cl
1.000 0.000 1.000 setrgbcolor
fill
grestore
gsave
357.1 266.1 57.6 38.02 clipbox
78.006857 168.798318 m
88.210286 168.798318 l
88.210286 176.182382 l
78.006857 176.182382 l
cl
0.000 1.000 0.000 setrgbcolor
fill
grestore
gsave
357.1 266.1 57.6 38.02 clipbox
90.761143 168.798099 m
100.964571 168.798099 l
100.964571 176.182054 l
90.761143 176.182054 l
cl
0.000 1.000 0.000 setrgbcolor
fill
grestore
gsave
357.1 266.1 57.6 38.02 clipbox
103.515429 168.797817 m
113.718857 168.797817 l
113.718857 176.181631 l
103.515429 176.181631 l
cl
0.000 1.000 0.000 setrgbcolor
fill
grestore
gsave
357.1 266.1 57.6 38.02 clipbox
116.269714 168.79772 m
126.473143 168.79772 l
126.473143 176.181485 l
116.269714 176.181485 l
cl
0.000 1.000 0.000 setrgbcolor
fill
grestore
gsave
357.1 266.1 57.6 38.02 clipbox
129.024 168.79799 m
139.227429 168.79799 l
139.227429 176.18189 l
129.024 176.18189 l
cl
0.000 1.000 0.000 setrgbcolor
fill
grestore
gsave
357.1 266.1 57.6 38.02 clipbox
141.778286 165.520034 m
151.981714 165.520034 l
151.981714 166.851462 l
141.778286 166.851462 l
cl
0.000 1.000 0.000 setrgbcolor
fill
grestore
gsave
357.1 266.1 57.6 38.02 clipbox
154.532571 165.52088 m
164.736 165.52088 l
164.736 172.955963 l
154.532571 172.955963 l
cl
0.000 1.000 0.000 setrgbcolor
fill
grestore
gsave
357.1 266.1 57.6 38.02 clipbox
167.286857 163.352769 m
177.490286 163.352769 l
177.490286 168.014059 l
167.286857 168.014059 l
cl
0.000 1.000 0.000 setrgbcolor
fill
grestore
gsave
357.1 266.1 57.6 38.02 clipbox
180.041143 172.785566 m
190.244571 172.785566 l
190.244571 174.118085 l
180.041143 174.118085 l
cl
0.000 1.000 0.000 setrgbcolor
fill
grestore
gsave
357.1 266.1 57.6 38.02 clipbox
192.795429 173.895363 m
202.998857 173.895363 l
202.998857 175.227941 l
192.795429 175.227941 l
cl
0.000 1.000 0.000 setrgbcolor
fill
grestore
gsave
357.1 266.1 57.6 38.02 clipbox
205.549714 170.011224 m
215.753143 170.011224 l
215.753143 171.343671 l
205.549714 171.343671 l
cl
0.000 1.000 0.000 setrgbcolor
fill
grestore
gsave
357.1 266.1 57.6 38.02 clipbox
218.304 170.010771 m
228.507429 170.010771 l
228.507429 171.342991 l
218.304 171.342991 l
cl
0.000 1.000 0.000 setrgbcolor
fill
grestore
gsave
357.1 266.1 57.6 38.02 clipbox
231.058286 178.887825 m
241.261714 178.887825 l
241.261714 189.097286 l
231.058286 189.097286 l
cl
0.000 1.000 0.000 setrgbcolor
fill
grestore
gsave
357.1 266.1 57.6 38.02 clipbox
243.812571 178.887725 m
254.016 178.887725 l
254.016 189.097135 l
243.812571 189.097135 l
cl
0.000 1.000 0.000 setrgbcolor
fill
grestore
gsave
357.1 266.1 57.6 38.02 clipbox
256.566857 178.887878 m
266.770286 178.887878 l
266.770286 189.097365 l
256.566857 189.097365 l
cl
0.000 1.000 0.000 setrgbcolor
fill
grestore
gsave
357.1 266.1 57.6 38.02 clipbox
269.321143 178.888005 m
279.524571 178.888005 l
279.524571 189.097556 l
269.321143 189.097556 l
cl
0.000 1.000 0.000 setrgbcolor
fill
grestore
gsave
357.1 266.1 57.6 38.02 clipbox
282.075429 178.88771 m
292.278857 178.88771 l
292.278857 189.097113 l
282.075429 189.097113 l
cl
0.000 1.000 0.000 setrgbcolor
fill
grestore
gsave
357.1 266.1 57.6 38.02 clipbox
294.829714 181.106115 m
305.033143 181.106115 l
305.033143 193.534392 l
294.829714 193.534392 l
cl
0.000 1.000 0.000 setrgbcolor
fill
grestore
gsave
357.1 266.1 57.6 38.02 clipbox
307.584 192.705983 m
317.787429 192.705983 l
317.787429 213.960598 l
307.584 213.960598 l
cl
0.000 1.000 0.000 setrgbcolor
fill
grestore
gsave
357.1 266.1 57.6 38.02 clipbox
320.338286 192.705193 m
330.541714 192.705193 l
330.541714 214.514252 l
320.338286 214.514252 l
cl
0.000 1.000 0.000 setrgbcolor
fill
grestore
gsave
357.1 266.1 57.6 38.02 clipbox
333.092571 181.00373 m
343.296 181.00373 l
343.296 193.935661 l
333.092571 193.935661 l
cl
0.000 1.000 0.000 setrgbcolor
fill
grestore
gsave
357.1 266.1 57.6 38.02 clipbox
345.846857 177.674377 m
356.050286 177.674377 l
356.050286 187.388082 l
345.846857 187.388082 l
cl
0.000 1.000 0.000 setrgbcolor
fill
grestore
gsave
357.1 266.1 57.6 38.02 clipbox
358.601143 177.67653 m
368.804571 177.67653 l
368.804571 188.390022 l
358.601143 188.390022 l
cl
0.000 1.000 0.000 setrgbcolor
fill
grestore
gsave
357.1 266.1 57.6 38.02 clipbox
371.355429 172.127665 m
381.558857 172.127665 l
381.558857 179.511893 l
371.355429 179.511893 l
cl
0.000 1.000 0.000 setrgbcolor
fill
grestore
gsave
357.1 266.1 57.6 38.02 clipbox
78.006857 176.182382 m
88.210286 176.182382 l
88.210286 183.788381 l
78.006857 183.788381 l
cl
0.000 0.502 0.000 setrgbcolor
fill
grestore
gsave
357.1 266.1 57.6 38.02 clipbox
90.761143 176.182054 m
100.964571 176.182054 l
100.964571 183.787945 l
90.761143 183.787945 l
cl
0.000 0.502 0.000 setrgbcolor
fill
grestore
gsave
357.1 266.1 57.6 38.02 clipbox
103.515429 176.181631 m
113.718857 176.181631 l
113.718857 183.787381 l
103.515429 183.787381 l
cl
0.000 0.502 0.000 setrgbcolor
fill
grestore
gsave
357.1 266.1 57.6 38.02 clipbox
116.269714 176.181485 m
126.473143 176.181485 l
126.473143 183.787186 l
116.269714 183.787186 l
cl
0.000 0.502 0.000 setrgbcolor
fill
grestore
gsave
357.1 266.1 57.6 38.02 clipbox
129.024 176.18189 m
139.227429 176.18189 l
139.227429 186.339987 l
129.024 186.339987 l
cl
0.000 0.502 0.000 setrgbcolor
fill
grestore
gsave
357.1 266.1 57.6 38.02 clipbox
141.778286 166.851462 m
151.981714 166.851462 l
151.981714 172.066764 l
141.778286 172.066764 l
cl
0.000 0.502 0.000 setrgbcolor
fill
grestore
gsave
357.1 266.1 57.6 38.02 clipbox
154.532571 172.955963 m
164.736 172.955963 l
164.736 174.50975 l
154.532571 174.50975 l
cl
0.000 0.502 0.000 setrgbcolor
fill
grestore
gsave
357.1 266.1 57.6 38.02 clipbox
167.286857 168.014059 m
177.490286 168.014059 l
177.490286 169.568249 l
167.286857 169.568249 l
cl
0.000 0.502 0.000 setrgbcolor
fill
grestore
gsave
357.1 266.1 57.6 38.02 clipbox
180.041143 174.118085 m
190.244571 174.118085 l
190.244571 188.988682 l
180.041143 188.988682 l
cl
0.000 0.502 0.000 setrgbcolor
fill
grestore
gsave
357.1 266.1 57.6 38.02 clipbox
192.795429 175.227941 m
202.998857 175.227941 l
202.998857 190.098597 l
192.795429 190.098597 l
cl
0.000 0.502 0.000 setrgbcolor
fill
grestore
gsave
357.1 266.1 57.6 38.02 clipbox
205.549714 171.343671 m
215.753143 171.343671 l
215.753143 186.214195 l
205.549714 186.214195 l
cl
0.000 0.502 0.000 setrgbcolor
fill
grestore
gsave
357.1 266.1 57.6 38.02 clipbox
218.304 171.342991 m
228.507429 171.342991 l
228.507429 186.213289 l
218.304 186.213289 l
cl
0.000 0.502 0.000 setrgbcolor
fill
grestore
gsave
357.1 266.1 57.6 38.02 clipbox
231.058286 189.097286 m
241.261714 189.097286 l
241.261714 205.964818 l
231.058286 205.964818 l
cl
0.000 0.502 0.000 setrgbcolor
fill
grestore
gsave
357.1 266.1 57.6 38.02 clipbox
243.812571 189.097135 m
254.016 189.097135 l
254.016 203.967196 l
243.812571 203.967196 l
cl
0.000 0.502 0.000 setrgbcolor
fill
grestore
gsave
357.1 266.1 57.6 38.02 clipbox
256.566857 189.097365 m
266.770286 189.097365 l
266.770286 203.967502 l
256.566857 203.967502 l
cl
0.000 0.502 0.000 setrgbcolor
fill
grestore
gsave
357.1 266.1 57.6 38.02 clipbox
269.321143 189.097556 m
279.524571 189.097556 l
279.524571 209.849054 l
269.321143 209.849054 l
cl
0.000 0.502 0.000 setrgbcolor
fill
grestore
gsave
357.1 266.1 57.6 38.02 clipbox
282.075429 189.097113 m
292.278857 189.097113 l
292.278857 207.074266 l
282.075429 207.074266 l
cl
0.000 0.502 0.000 setrgbcolor
fill
grestore
gsave
357.1 266.1 57.6 38.02 clipbox
294.829714 193.534392 m
305.033143 193.534392 l
305.033143 212.620741 l
294.829714 212.620741 l
cl
0.000 0.502 0.000 setrgbcolor
fill
grestore
gsave
357.1 266.1 57.6 38.02 clipbox
307.584 213.960598 m
317.787429 213.960598 l
317.787429 237.101666 l
307.584 237.101666 l
cl
0.000 0.502 0.000 setrgbcolor
fill
grestore
gsave
357.1 266.1 57.6 38.02 clipbox
320.338286 214.514252 m
330.541714 214.514252 l
330.541714 237.654925 l
320.338286 237.654925 l
cl
0.000 0.502 0.000 setrgbcolor
fill
grestore
gsave
357.1 266.1 57.6 38.02 clipbox
333.092571 193.935661 m
343.296 193.935661 l
343.296 203.760492 l
333.092571 203.760492 l
cl
0.000 0.502 0.000 setrgbcolor
fill
grestore
gsave
357.1 266.1 57.6 38.02 clipbox
345.846857 187.388082 m
356.050286 187.388082 l
356.050286 197.212754 l
345.846857 197.212754 l
cl
0.000 0.502 0.000 setrgbcolor
fill
grestore
gsave
357.1 266.1 57.6 38.02 clipbox
358.601143 188.390022 m
368.804571 188.390022 l
368.804571 198.215771 l
358.601143 198.215771 l
cl
0.000 0.502 0.000 setrgbcolor
fill
grestore
gsave
357.1 266.1 57.6 38.02 clipbox
371.355429 179.511893 m
381.558857 179.511893 l
381.558857 187.118056 l
371.355429 187.118056 l
cl
0.000 0.502 0.000 setrgbcolor
fill
grestore
gsave
357.1 266.1 57.6 38.02 clipbox
78.006857 183.788381 m
88.210286 183.788381 l
88.210286 193.391788 l
78.006857 193.391788 l
cl
0.000 0.000 1.000 setrgbcolor
fill
grestore
gsave
357.1 266.1 57.6 38.02 clipbox
90.761143 183.787945 m
100.964571 183.787945 l
100.964571 191.1719 l
90.761143 191.1719 l
cl
0.000 0.000 1.000 setrgbcolor
fill
grestore
gsave
357.1 266.1 57.6 38.02 clipbox
103.515429 183.787381 m
113.718857 183.787381 l
113.718857 191.171195 l
103.515429 191.171195 l
cl
0.000 0.000 1.000 setrgbcolor
fill
grestore
gsave
357.1 266.1 57.6 38.02 clipbox
116.269714 183.787186 m
126.473143 183.787186 l
126.473143 191.170951 l
116.269714 191.170951 l
cl
0.000 0.000 1.000 setrgbcolor
fill
grestore
gsave
357.1 266.1 57.6 38.02 clipbox
129.024 186.339987 m
139.227429 186.339987 l
139.227429 193.723887 l
129.024 193.723887 l
cl
0.000 0.000 1.000 setrgbcolor
fill
grestore
gsave
357.1 266.1 57.6 38.02 clipbox
141.778286 172.066764 m
151.981714 172.066764 l
151.981714 179.450984 l
141.778286 179.450984 l
cl
0.000 0.000 1.000 setrgbcolor
fill
grestore
gsave
357.1 266.1 57.6 38.02 clipbox
154.532571 174.50975 m
164.736 174.50975 l
164.736 184.66859 l
154.532571 184.66859 l
cl
0.000 0.000 1.000 setrgbcolor
fill
grestore
gsave
357.1 266.1 57.6 38.02 clipbox
167.286857 169.568249 m
177.490286 169.568249 l
177.490286 183.056527 l
167.286857 183.056527 l
cl
0.000 0.000 1.000 setrgbcolor
fill
grestore
gsave
357.1 266.1 57.6 38.02 clipbox
180.041143 188.988682 m
190.244571 188.988682 l
190.244571 198.038511 l
180.041143 198.038511 l
cl
0.000 0.000 1.000 setrgbcolor
fill
grestore
gsave
357.1 266.1 57.6 38.02 clipbox
192.795429 190.098597 m
202.998857 190.098597 l
202.998857 192.540853 l
192.795429 192.540853 l
cl
0.000 0.000 1.000 setrgbcolor
fill
grestore
gsave
357.1 266.1 57.6 38.02 clipbox
205.549714 186.214195 m
215.753143 186.214195 l
215.753143 188.65632 l
205.549714 188.65632 l
cl
0.000 0.000 1.000 setrgbcolor
fill
grestore
gsave
357.1 266.1 57.6 38.02 clipbox
218.304 186.213289 m
228.507429 186.213289 l
228.507429 189.764865 l
218.304 189.764865 l
cl
0.000 0.000 1.000 setrgbcolor
fill
grestore
gsave
357.1 266.1 57.6 38.02 clipbox
231.058286 205.964818 m
241.261714 205.964818 l
241.261714 216.174278 l
231.058286 216.174278 l
cl
0.000 0.000 1.000 setrgbcolor
fill
grestore
gsave
357.1 266.1 57.6 38.02 clipbox
243.812571 203.967196 m
254.016 203.967196 l
254.016 214.176606 l
243.812571 214.176606 l
cl
0.000 0.000 1.000 setrgbcolor
fill
grestore
gsave
357.1 266.1 57.6 38.02 clipbox
256.566857 203.967502 m
266.770286 203.967502 l
266.770286 214.176989 l
256.566857 214.176989 l
cl
0.000 0.000 1.000 setrgbcolor
fill
grestore
gsave
357.1 266.1 57.6 38.02 clipbox
269.321143 209.849054 m
279.524571 209.849054 l
279.524571 220.058604 l
269.321143 220.058604 l
cl
0.000 0.000 1.000 setrgbcolor
fill
grestore
gsave
357.1 266.1 57.6 38.02 clipbox
282.075429 207.074266 m
292.278857 207.074266 l
292.278857 218.393348 l
282.075429 218.393348 l
cl
0.000 0.000 1.000 setrgbcolor
fill
grestore
gsave
357.1 266.1 57.6 38.02 clipbox
294.829714 212.620741 m
305.033143 212.620741 l
305.033143 224.494193 l
294.829714 224.494193 l
cl
0.000 0.000 1.000 setrgbcolor
fill
grestore
gsave
357.1 266.1 57.6 38.02 clipbox
307.584 237.101666 m
317.787429 237.101666 l
317.787429 248.419628 l
307.584 248.419628 l
cl
0.000 0.000 1.000 setrgbcolor
fill
grestore
gsave
357.1 266.1 57.6 38.02 clipbox
320.338286 237.654925 m
330.541714 237.654925 l
330.541714 252.301513 l
320.338286 252.301513 l
cl
0.000 0.000 1.000 setrgbcolor
fill
grestore
gsave
357.1 266.1 57.6 38.02 clipbox
333.092571 203.760492 m
343.296 203.760492 l
343.296 210.639631 l
333.092571 210.639631 l
cl
0.000 0.000 1.000 setrgbcolor
fill
grestore
gsave
357.1 266.1 57.6 38.02 clipbox
345.846857 197.212754 m
356.050286 197.212754 l
356.050286 201.872377 l
345.846857 201.872377 l
cl
0.000 0.000 1.000 setrgbcolor
fill
grestore
gsave
357.1 266.1 57.6 38.02 clipbox
358.601143 198.215771 m
368.804571 198.215771 l
368.804571 207.819584 l
358.601143 207.819584 l
cl
0.000 0.000 1.000 setrgbcolor
fill
grestore
gsave
357.1 266.1 57.6 38.02 clipbox
371.355429 187.118056 m
381.558857 187.118056 l
381.558857 196.721626 l
371.355429 196.721626 l
cl
0.000 0.000 1.000 setrgbcolor
fill
grestore
gsave
357.1 266.1 57.6 38.02 clipbox
78.006857 193.391788 m
88.210286 193.391788 l
88.210286 205.769987 l
78.006857 205.769987 l
cl
0.000 0.000 0.502 setrgbcolor
fill
grestore
gsave
357.1 266.1 57.6 38.02 clipbox
90.761143 191.1719 m
100.964571 191.1719 l
100.964571 201.330752 l
90.761143 201.330752 l
cl
0.000 0.000 0.502 setrgbcolor
fill
grestore
gsave
357.1 266.1 57.6 38.02 clipbox
103.515429 191.171195 m
113.718857 191.171195 l
113.718857 201.329639 l
103.515429 201.329639 l
cl
0.000 0.000 0.502 setrgbcolor
fill
grestore
gsave
357.1 266.1 57.6 38.02 clipbox
116.269714 191.170951 m
126.473143 191.170951 l
126.473143 201.329277 l
116.269714 201.329277 l
cl
0.000 0.000 0.502 setrgbcolor
fill
grestore
gsave
357.1 266.1 57.6 38.02 clipbox
129.024 193.723887 m
139.227429 193.723887 l
139.227429 203.882693 l
129.024 203.882693 l
cl
0.000 0.000 0.502 setrgbcolor
fill
grestore
gsave
357.1 266.1 57.6 38.02 clipbox
141.778286 179.450984 m
151.981714 179.450984 l
151.981714 189.609961 l
141.778286 189.609961 l
cl
0.000 0.000 0.502 setrgbcolor
fill
grestore
gsave
357.1 266.1 57.6 38.02 clipbox
154.532571 184.66859 m
164.736 184.66859 l
164.736 194.827997 l
154.532571 194.827997 l
cl
0.000 0.000 0.502 setrgbcolor
fill
grestore
gsave
357.1 266.1 57.6 38.02 clipbox
167.286857 183.056527 m
177.490286 183.056527 l
177.490286 196.545568 l
167.286857 196.545568 l
cl
0.000 0.000 0.502 setrgbcolor
fill
grestore
gsave
357.1 266.1 57.6 38.02 clipbox
180.041143 198.038511 m
190.244571 198.038511 l
190.244571 208.197968 l
180.041143 208.197968 l
cl
0.000 0.000 0.502 setrgbcolor
fill
grestore
gsave
357.1 266.1 57.6 38.02 clipbox
192.795429 192.540853 m
202.998857 192.540853 l
202.998857 196.645509 l
192.795429 196.645509 l
cl
0.000 0.000 0.502 setrgbcolor
fill
grestore
gsave
357.1 266.1 57.6 38.02 clipbox
205.549714 188.65632 m
215.753143 188.65632 l
215.753143 192.760598 l
205.549714 192.760598 l
cl
0.000 0.000 0.502 setrgbcolor
fill
grestore
gsave
357.1 266.1 57.6 38.02 clipbox
218.304 189.764865 m
228.507429 189.764865 l
228.507429 193.870593 l
218.304 193.870593 l
cl
0.000 0.000 0.502 setrgbcolor
fill
grestore
gsave
357.1 266.1 57.6 38.02 clipbox
231.058286 216.174278 m
241.261714 216.174278 l
241.261714 230.267479 l
231.058286 230.267479 l
cl
0.000 0.000 0.502 setrgbcolor
fill
grestore
gsave
357.1 266.1 57.6 38.02 clipbox
243.812571 214.176606 m
254.016 214.176606 l
254.016 231.599011 l
243.812571 231.599011 l
cl
0.000 0.000 0.502 setrgbcolor
fill
grestore
gsave
357.1 266.1 57.6 38.02 clipbox
256.566857 214.176989 m
266.770286 214.176989 l
266.770286 229.935027 l
256.566857 229.935027 l
cl
0.000 0.000 0.502 setrgbcolor
fill
grestore
gsave
357.1 266.1 57.6 38.02 clipbox
269.321143 220.058604 m
279.524571 220.058604 l
279.524571 233.043129 l
269.321143 233.043129 l
cl
0.000 0.000 0.502 setrgbcolor
fill
grestore
gsave
357.1 266.1 57.6 38.02 clipbox
282.075429 218.393348 m
292.278857 218.393348 l
292.278857 231.377924 l
282.075429 231.377924 l
cl
0.000 0.000 0.502 setrgbcolor
fill
grestore
gsave
357.1 266.1 57.6 38.02 clipbox
294.829714 224.494193 m
305.033143 224.494193 l
305.033143 240.252583 l
294.829714 240.252583 l
cl
0.000 0.000 0.502 setrgbcolor
fill
grestore
gsave
357.1 266.1 57.6 38.02 clipbox
307.584 248.419628 m
317.787429 248.419628 l
317.787429 264.729497 l
307.584 264.729497 l
cl
0.000 0.000 0.502 setrgbcolor
fill
grestore
gsave
357.1 266.1 57.6 38.02 clipbox
320.338286 252.301513 m
330.541714 252.301513 l
330.541714 271.386526 l
320.338286 271.386526 l
cl
0.000 0.000 0.502 setrgbcolor
fill
grestore
gsave
357.1 266.1 57.6 38.02 clipbox
333.092571 210.639631 m
343.296 210.639631 l
343.296 218.076078 l
333.092571 218.076078 l
cl
0.000 0.000 0.502 setrgbcolor
fill
grestore
gsave
357.1 266.1 57.6 38.02 clipbox
345.846857 201.872377 m
356.050286 201.872377 l
356.050286 208.197758 l
345.846857 208.197758 l
cl
0.000 0.000 0.502 setrgbcolor
fill
grestore
gsave
357.1 266.1 57.6 38.02 clipbox
358.601143 207.819584 m
368.804571 207.819584 l
368.804571 220.196318 l
358.601143 220.196318 l
cl
0.000 0.000 0.502 setrgbcolor
fill
grestore
gsave
357.1 266.1 57.6 38.02 clipbox
371.355429 196.721626 m
381.558857 196.721626 l
381.558857 209.100223 l
371.355429 209.100223 l
cl
0.000 0.000 0.502 setrgbcolor
fill
grestore
gsave
357.1 266.1 57.6 38.02 clipbox
78.006857 205.769987 m
88.210286 205.769987 l
88.210286 213.154051 l
78.006857 213.154051 l
cl
0.000 setgray
fill
grestore
gsave
357.1 266.1 57.6 38.02 clipbox
90.761143 201.330752 m
100.964571 201.330752 l
100.964571 208.714706 l
90.761143 208.714706 l
cl
0.000 setgray
fill
grestore
gsave
357.1 266.1 57.6 38.02 clipbox
103.515429 201.329639 m
113.718857 201.329639 l
113.718857 208.713453 l
103.515429 208.713453 l
cl
0.000 setgray
fill
grestore
gsave
357.1 266.1 57.6 38.02 clipbox
116.269714 201.329277 m
126.473143 201.329277 l
126.473143 208.713043 l
116.269714 208.713043 l
cl
0.000 setgray
fill
grestore
gsave
357.1 266.1 57.6 38.02 clipbox
129.024 203.882693 m
139.227429 203.882693 l
139.227429 211.266594 l
129.024 211.266594 l
cl
0.000 setgray
fill
grestore
gsave
357.1 266.1 57.6 38.02 clipbox
141.778286 189.609961 m
151.981714 189.609961 l
151.981714 196.994181 l
141.778286 196.994181 l
cl
0.000 setgray
fill
grestore
gsave
357.1 266.1 57.6 38.02 clipbox
154.532571 194.827997 m
164.736 194.827997 l
164.736 202.21264 l
154.532571 202.21264 l
cl
0.000 setgray
fill
grestore
gsave
357.1 266.1 57.6 38.02 clipbox
167.286857 196.545568 m
177.490286 196.545568 l
177.490286 203.981054 l
167.286857 203.981054 l
cl
0.000 setgray
fill
grestore
gsave
357.1 266.1 57.6 38.02 clipbox
180.041143 208.197968 m
190.244571 208.197968 l
190.244571 218.777808 l
180.041143 218.777808 l
cl
0.000 setgray
fill
grestore
gsave
357.1 266.1 57.6 38.02 clipbox
192.795429 196.645509 m
202.998857 196.645509 l
202.998857 203.896372 l
192.795429 203.896372 l
cl
0.000 setgray
fill
grestore
gsave
357.1 266.1 57.6 38.02 clipbox
205.549714 192.760598 m
215.753143 192.760598 l
215.753143 200.01133 l
205.549714 200.01133 l
cl
0.000 setgray
fill
grestore
gsave
357.1 266.1 57.6 38.02 clipbox
218.304 193.870593 m
228.507429 193.870593 l
228.507429 201.121098 l
218.304 201.121098 l
cl
0.000 setgray
fill
grestore
gsave
357.1 266.1 57.6 38.02 clipbox
231.058286 230.267479 m
241.261714 230.267479 l
241.261714 237.517797 l
231.058286 237.517797 l
cl
0.000 setgray
fill
grestore
gsave
357.1 266.1 57.6 38.02 clipbox
243.812571 231.599011 m
254.016 231.599011 l
254.016 238.849279 l
243.812571 238.849279 l
cl
0.000 setgray
fill
grestore
gsave
357.1 266.1 57.6 38.02 clipbox
256.566857 229.935027 m
266.770286 229.935027 l
266.770286 237.185371 l
256.566857 237.185371 l
cl
0.000 setgray
fill
grestore
gsave
357.1 266.1 57.6 38.02 clipbox
269.321143 233.043129 m
279.524571 233.043129 l
279.524571 240.293537 l
269.321143 240.293537 l
cl
0.000 setgray
fill
grestore
gsave
357.1 266.1 57.6 38.02 clipbox
282.075429 231.377924 m
292.278857 231.377924 l
292.278857 238.628185 l
282.075429 238.628185 l
cl
0.000 setgray
fill
grestore
gsave
357.1 266.1 57.6 38.02 clipbox
294.829714 240.252583 m
305.033143 240.252583 l
305.033143 247.502374 l
294.829714 247.502374 l
cl
0.000 setgray
fill
grestore
gsave
357.1 266.1 57.6 38.02 clipbox
307.584 264.729497 m
317.787429 264.729497 l
317.787429 274.19798 l
307.584 274.19798 l
cl
0.000 setgray
fill
grestore
gsave
357.1 266.1 57.6 38.02 clipbox
320.338286 271.386526 m
330.541714 271.386526 l
330.541714 283.628811 l
320.338286 283.628811 l
cl
0.000 setgray
fill
grestore
gsave
357.1 266.1 57.6 38.02 clipbox
333.092571 218.076078 m
343.296 218.076078 l
343.296 231.008009 l
333.092571 231.008009 l
cl
0.000 setgray
fill
grestore
gsave
357.1 266.1 57.6 38.02 clipbox
345.846857 208.197758 m
356.050286 208.197758 l
356.050286 221.129531 l
345.846857 221.129531 l
cl
0.000 setgray
fill
grestore
gsave
357.1 266.1 57.6 38.02 clipbox
358.601143 220.196318 m
368.804571 220.196318 l
368.804571 229.911099 l
358.601143 229.911099 l
cl
0.000 setgray
fill
grestore
gsave
357.1 266.1 57.6 38.02 clipbox
371.355429 209.100223 m
381.558857 209.100223 l
381.558857 219.813471 l
371.355429 219.813471 l
cl
0.000 setgray
fill
grestore
gsave
357.1 266.1 57.6 38.02 clipbox
78.006857 213.154051 m
88.210286 213.154051 l
88.210286 226.08709 l
78.006857 226.08709 l
cl
1.000 0.000 0.000 setrgbcolor
fill
grestore
gsave
357.1 266.1 57.6 38.02 clipbox
90.761143 208.714706 m
100.964571 208.714706 l
100.964571 219.428397 l
90.761143 219.428397 l
cl
1.000 0.000 0.000 setrgbcolor
fill
grestore
gsave
357.1 266.1 57.6 38.02 clipbox
103.515429 208.713453 m
113.718857 208.713453 l
113.718857 219.426736 l
103.515429 219.426736 l
cl
1.000 0.000 0.000 setrgbcolor
fill
grestore
gsave
357.1 266.1 57.6 38.02 clipbox
116.269714 208.713043 m
126.473143 208.713043 l
126.473143 219.426208 l
116.269714 219.426208 l
cl
1.000 0.000 0.000 setrgbcolor
fill
grestore
gsave
357.1 266.1 57.6 38.02 clipbox
129.024 211.266594 m
139.227429 211.266594 l
139.227429 221.980239 l
129.024 221.980239 l
cl
1.000 0.000 0.000 setrgbcolor
fill
grestore
gsave
357.1 266.1 57.6 38.02 clipbox
141.778286 196.994181 m
151.981714 196.994181 l
151.981714 209.372514 l
141.778286 209.372514 l
cl
1.000 0.000 0.000 setrgbcolor
fill
grestore
gsave
357.1 266.1 57.6 38.02 clipbox
154.532571 202.21264 m
164.736 202.21264 l
164.736 212.926886 l
154.532571 212.926886 l
cl
1.000 0.000 0.000 setrgbcolor
fill
grestore
gsave
357.1 266.1 57.6 38.02 clipbox
167.286857 203.981054 m
177.490286 203.981054 l
177.490286 216.360416 l
167.286857 216.360416 l
cl
1.000 0.000 0.000 setrgbcolor
fill
grestore
gsave
357.1 266.1 57.6 38.02 clipbox
180.041143 218.777808 m
190.244571 218.777808 l
190.244571 234.855551 l
180.041143 234.855551 l
cl
1.000 0.000 0.000 setrgbcolor
fill
grestore
gsave
357.1 266.1 57.6 38.02 clipbox
192.795429 203.896372 m
202.998857 203.896372 l
202.998857 213.919313 l
192.795429 213.919313 l
cl
1.000 0.000 0.000 setrgbcolor
fill
grestore
gsave
357.1 266.1 57.6 38.02 clipbox
205.549714 200.01133 m
215.753143 200.01133 l
215.753143 210.033893 l
205.549714 210.033893 l
cl
1.000 0.000 0.000 setrgbcolor
fill
grestore
gsave
357.1 266.1 57.6 38.02 clipbox
218.304 201.121098 m
228.507429 201.121098 l
228.507429 212.25479 l
218.304 212.25479 l
cl
1.000 0.000 0.000 setrgbcolor
fill
grestore
gsave
357.1 266.1 57.6 38.02 clipbox
231.058286 237.517797 m
241.261714 237.517797 l
241.261714 248.651854 l
231.058286 248.651854 l
cl
1.000 0.000 0.000 setrgbcolor
fill
grestore
gsave
357.1 266.1 57.6 38.02 clipbox
243.812571 238.849279 m
254.016 238.849279 l
254.016 248.873826 l
243.812571 248.873826 l
cl
1.000 0.000 0.000 setrgbcolor
fill
grestore
gsave
357.1 266.1 57.6 38.02 clipbox
256.566857 237.185371 m
266.770286 237.185371 l
266.770286 247.210071 l
256.566857 247.210071 l
cl
1.000 0.000 0.000 setrgbcolor
fill
grestore
gsave
357.1 266.1 57.6 38.02 clipbox
269.321143 240.293537 m
279.524571 240.293537 l
279.524571 250.318918 l
269.321143 250.318918 l
cl
1.000 0.000 0.000 setrgbcolor
fill
grestore
gsave
357.1 266.1 57.6 38.02 clipbox
282.075429 238.628185 m
292.278857 238.628185 l
292.278857 249.763297 l
282.075429 249.763297 l
cl
1.000 0.000 0.000 setrgbcolor
fill
grestore
gsave
357.1 266.1 57.6 38.02 clipbox
294.829714 247.502374 m
305.033143 247.502374 l
305.033143 263.630657 l
294.829714 263.630657 l
cl
1.000 0.000 0.000 setrgbcolor
fill
grestore
gsave
357.1 266.1 57.6 38.02 clipbox
307.584 274.19798 m
317.787429 274.19798 l
317.787429 284.21967 l
307.584 284.21967 l
cl
1.000 0.000 0.000 setrgbcolor
fill
grestore
gsave
357.1 266.1 57.6 38.02 clipbox
320.338286 283.628811 m
330.541714 283.628811 l
330.541714 296.980485 l
320.338286 296.980485 l
cl
1.000 0.000 0.000 setrgbcolor
fill
grestore
gsave
357.1 266.1 57.6 38.02 clipbox
333.092571 231.008009 m
343.296 231.008009 l
343.296 238.444457 l
333.092571 238.444457 l
cl
1.000 0.000 0.000 setrgbcolor
fill
grestore
gsave
357.1 266.1 57.6 38.02 clipbox
345.846857 221.129531 m
356.050286 221.129531 l
356.050286 229.11943 l
345.846857 229.11943 l
cl
1.000 0.000 0.000 setrgbcolor
fill
grestore
gsave
357.1 266.1 57.6 38.02 clipbox
358.601143 229.911099 m
368.804571 229.911099 l
368.804571 245.062029 l
358.601143 245.062029 l
cl
1.000 0.000 0.000 setrgbcolor
fill
grestore
gsave
357.1 266.1 57.6 38.02 clipbox
371.355429 219.813471 m
381.558857 219.813471 l
381.558857 232.192068 l
371.355429 232.192068 l
cl
1.000 0.000 0.000 setrgbcolor
fill
grestore
0.800 setlinewidth
1 setlinejoin
0 setlinecap
[] 0 setdash
0.000 setgray
gsave
/o {
gsave
newpath
translate
0.8 setlinewidth
1 setlinejoin
0 setlinecap
0 0 m
0 -3.5 l

gsave
0.000 setgray
fill
grestore
stroke
grestore
} bind def
83.1086 38.016 o
grestore
/DejaVuSans findfont
10.000 scalefont
setfont
gsave
79.928884 23.422250 translate
0.000000 rotate
0.000000 0.000000 m /zero glyphshow
grestore
gsave
/o {
gsave
newpath
translate
0.8 setlinewidth
1 setlinejoin
0 setlinecap
0 0 m
0 -3.5 l

gsave
0.000 setgray
fill
grestore
stroke
grestore
} bind def
146.88 38.016 o
grestore
gsave
143.700312 23.422250 translate
0.000000 rotate
0.000000 0.000000 m /five glyphshow
grestore
gsave
/o {
gsave
newpath
translate
0.8 setlinewidth
1 setlinejoin
0 setlinecap
0 0 m
0 -3.5 l

gsave
0.000 setgray
fill
grestore
stroke
grestore
} bind def
210.651 38.016 o
grestore
gsave
204.292054 23.422250 translate
0.000000 rotate
0.000000 0.000000 m /one glyphshow
6.362305 0.000000 m /zero glyphshow
grestore
gsave
/o {
gsave
newpath
translate
0.8 setlinewidth
1 setlinejoin
0 setlinecap
0 0 m
0 -3.5 l

gsave
0.000 setgray
fill
grestore
stroke
grestore
} bind def
274.423 38.016 o
grestore
gsave
268.063482 23.422250 translate
0.000000 rotate
0.000000 0.000000 m /one glyphshow
6.362305 0.000000 m /five glyphshow
grestore
gsave
/o {
gsave
newpath
translate
0.8 setlinewidth
1 setlinejoin
0 setlinecap
0 0 m
0 -3.5 l

gsave
0.000 setgray
fill
grestore
stroke
grestore
} bind def
338.194 38.016 o
grestore
gsave
331.834911 23.422250 translate
0.000000 rotate
0.000000 0.000000 m /two glyphshow
6.362305 0.000000 m /zero glyphshow
grestore
gsave
/o {
gsave
newpath
translate
0.8 setlinewidth
1 setlinejoin
0 setlinecap
0 0 m
0 -3.5 l

gsave
0.000 setgray
fill
grestore
stroke
grestore
} bind def
401.966 38.016 o
grestore
gsave
395.606339 23.422250 translate
0.000000 rotate
0.000000 0.000000 m /two glyphshow
6.362305 0.000000 m /five glyphshow
grestore
gsave
/o {
gsave
newpath
translate
0.8 setlinewidth
1 setlinejoin
0 setlinecap
0 0 m
-3.5 0 l

gsave
0.000 setgray
fill
grestore
stroke
grestore
} bind def
57.6 43.0623 o
grestore
gsave
29.506250 39.265459 translate
0.000000 rotate
0.000000 0.000000 m /minus glyphshow
8.378906 0.000000 m /one glyphshow
14.741211 0.000000 m /zero glyphshow
grestore
gsave
/o {
gsave
newpath
translate
0.8 setlinewidth
1 setlinejoin
0 setlinecap
0 0 m
-3.5 0 l

gsave
0.000 setgray
fill
grestore
stroke
grestore
} bind def
57.6 98.5463 o
grestore
gsave
35.865625 94.749387 translate
0.000000 rotate
0.000000 0.000000 m /minus glyphshow
8.378906 0.000000 m /five glyphshow
grestore
gsave
/o {
gsave
newpath
translate
0.8 setlinewidth
1 setlinejoin
0 setlinecap
0 0 m
-3.5 0 l

gsave
0.000 setgray
fill
grestore
stroke
grestore
} bind def
57.6 154.03 o
grestore
gsave
44.240625 150.233314 translate
0.000000 rotate
0.000000 0.000000 m /zero glyphshow
grestore
gsave
/o {
gsave
newpath
translate
0.8 setlinewidth
1 setlinejoin
0 setlinecap
0 0 m
-3.5 0 l

gsave
0.000 setgray
fill
grestore
stroke
grestore
} bind def
57.6 209.514 o
grestore
gsave
44.240625 205.717242 translate
0.000000 rotate
0.000000 0.000000 m /five glyphshow
grestore
gsave
/o {
gsave
newpath
translate
0.8 setlinewidth
1 setlinejoin
0 setlinecap
0 0 m
-3.5 0 l

gsave
0.000 setgray
fill
grestore
stroke
grestore
} bind def
57.6 264.998 o
grestore
gsave
37.881250 261.201169 translate
0.000000 rotate
0.000000 0.000000 m /one glyphshow
6.362305 0.000000 m /zero glyphshow
grestore
1.500 setlinewidth
2 setlinecap
0.000 0.000 1.000 setrgbcolor
gsave
357.1 266.1 57.6 38.02 clipbox
83.108571 154.030189 m
95.862857 154.030189 l
108.617143 154.030189 l
121.371429 154.030189 l
134.125714 154.030189 l
146.88 154.030189 l
159.634286 154.030189 l
172.388571 154.030189 l
185.142857 154.030189 l
197.897143 154.030189 l
210.651429 154.030189 l
223.405714 154.030189 l
236.16 154.030189 l
248.914286 154.030189 l
261.668571 154.030189 l
274.422857 154.030189 l
287.177143 154.030189 l
299.931429 154.030189 l
312.685714 154.030189 l
325.44 154.030189 l
338.194286 154.030189 l
350.948571 154.030189 l
363.702857 154.030189 l
376.457143 154.030189 l
stroke
grestore
1.000 0.000 0.000 setrgbcolor
gsave
357.1 266.1 57.6 38.02 clipbox
83.108571 203.616099 m
95.862857 196.957407 l
108.617143 196.955746 l
121.371429 196.927476 l
134.125714 198.760216 l
146.88 181.575066 l
159.634286 178.027496 l
172.388571 173.942954 l
185.142857 185.696791 l
197.897143 160.543775 l
210.651429 154.827385 l
223.405714 157.353444 l
236.16 195.026638 l
248.914286 196.691192 l
261.668571 199.771313 l
274.422857 205.876292 l
287.177143 210.341967 l
299.931429 228.648041 l
312.685714 254.369317 l
325.44 271.402395 l
338.194286 213.143786 l
350.948571 204.373598 l
363.702857 222.424586 l
376.457143 209.748819 l
stroke
grestore
0.800 setlinewidth
0 setlinejoin
[] 0 setdash
0.000 setgray
gsave
57.6 38.016 m
57.6 304.128 l
stroke
grestore
gsave
414.72 38.016 m
414.72 304.128 l
stroke
grestore
gsave
57.6 38.016 m
414.72 38.016 l
stroke
grestore
gsave
57.6 304.128 m
414.72 304.128 l
stroke
grestore
1.000 setlinewidth
0 setlinecap
0.800 setgray
gsave
360.623125 107.403 m
448.32 107.403 l
449.92 107.403 450.72 108.203 450.72 109.803 c
450.72 337.728 l
450.72 339.328 449.92 340.128 448.32 340.128 c
360.623125 340.128 l
359.023125 340.128 358.223125 339.328 358.223125 337.728 c
358.223125 109.803 l
358.223125 108.203 359.023125 107.403 360.623125 107.403 c
cl
gsave
1.000 setgray
fill
grestore
stroke
grestore
1.500 setlinewidth
1 setlinejoin
2 setlinecap
[] 0 setdash
0.000 0.000 1.000 setrgbcolor
gsave
363.023125 330.403 m
387.023125 330.403 l
stroke
grestore
0.000 setgray
/DejaVuSans findfont
12.000 scalefont
setfont
gsave
396.623125 326.203000 translate
0.000000 rotate
0.000000 0.000000 m /p glyphshow
7.617188 0.000000 m /r glyphshow
12.550781 0.000000 m /i glyphshow
15.884766 0.000000 m /c glyphshow
22.482422 0.000000 m /e glyphshow
grestore
1.000 0.000 0.000 setrgbcolor
gsave
363.023125 312.778 m
387.023125 312.778 l
stroke
grestore
0.000 setgray
gsave
396.623125 308.578000 translate
0.000000 rotate
0.000000 0.000000 m /d glyphshow
7.617188 0.000000 m /e glyphshow
15.000000 0.000000 m /m glyphshow
26.689453 0.000000 m /a glyphshow
34.042969 0.000000 m /n glyphshow
41.648438 0.000000 m /d glyphshow
grestore
gsave
363.023125 290.953 m
387.023125 290.953 l
387.023125 299.353 l
363.023125 299.353 l
cl
1.000 0.000 0.000 setrgbcolor
fill
grestore
gsave
396.623125 290.953000 translate
0.000000 rotate
0.000000 0.000000 m /s glyphshow
6.251953 0.000000 m /u glyphshow
13.857422 0.000000 m /p glyphshow
21.474609 0.000000 m /p glyphshow
29.091797 0.000000 m /l glyphshow
32.425781 0.000000 m /y glyphshow
grestore
gsave
363.023125 273.328 m
387.023125 273.328 l
387.023125 281.728 l
363.023125 281.728 l
cl
1.000 0.647 0.000 setrgbcolor
fill
grestore
gsave
396.623125 273.328000 translate
0.000000 rotate
0.000000 0.000000 m /p glyphshow
7.617188 0.000000 m /v glyphshow
grestore
gsave
363.023125 255.703 m
387.023125 255.703 l
387.023125 264.103 l
363.023125 264.103 l
cl
1.000 1.000 0.000 setrgbcolor
fill
grestore
gsave
396.623125 255.703000 translate
0.000000 rotate
0.000000 0.000000 m /b glyphshow
7.617188 0.000000 m /a glyphshow
14.970703 0.000000 m /t glyphshow
19.675781 0.000000 m /t glyphshow
24.380859 0.000000 m /e glyphshow
31.763672 0.000000 m /r glyphshow
36.697266 0.000000 m /y glyphshow
grestore
gsave
363.023125 238.078 m
387.023125 238.078 l
387.023125 246.478 l
363.023125 246.478 l
cl
0.502 0.000 0.502 setrgbcolor
fill
grestore
gsave
396.623125 238.078000 translate
0.000000 rotate
0.000000 0.000000 m /s glyphshow
6.251953 0.000000 m /i glyphshow
9.585938 0.000000 m /t glyphshow
14.291016 0.000000 m /e glyphshow
21.673828 0.000000 m /four glyphshow
grestore
gsave
363.023125 220.453 m
387.023125 220.453 l
387.023125 228.853 l
363.023125 228.853 l
cl
1.000 0.000 1.000 setrgbcolor
fill
grestore
gsave
396.623125 220.453000 translate
0.000000 rotate
0.000000 0.000000 m /s glyphshow
6.251953 0.000000 m /i glyphshow
9.585938 0.000000 m /t glyphshow
14.291016 0.000000 m /e glyphshow
21.673828 0.000000 m /one glyphshow
grestore
gsave
363.023125 202.828 m
387.023125 202.828 l
387.023125 211.228 l
363.023125 211.228 l
cl
0.000 1.000 0.000 setrgbcolor
fill
grestore
gsave
396.623125 202.828000 translate
0.000000 rotate
0.000000 0.000000 m /s glyphshow
6.251953 0.000000 m /i glyphshow
9.585938 0.000000 m /t glyphshow
14.291016 0.000000 m /e glyphshow
21.673828 0.000000 m /zero glyphshow
grestore
gsave
363.023125 185.203 m
387.023125 185.203 l
387.023125 193.603 l
363.023125 193.603 l
cl
0.000 0.502 0.000 setrgbcolor
fill
grestore
gsave
396.623125 185.203000 translate
0.000000 rotate
0.000000 0.000000 m /s glyphshow
6.251953 0.000000 m /i glyphshow
9.585938 0.000000 m /t glyphshow
14.291016 0.000000 m /e glyphshow
21.673828 0.000000 m /five glyphshow
grestore
gsave
363.023125 167.578 m
387.023125 167.578 l
387.023125 175.978 l
363.023125 175.978 l
cl
0.000 0.000 1.000 setrgbcolor
fill
grestore
gsave
396.623125 167.578000 translate
0.000000 rotate
0.000000 0.000000 m /s glyphshow
6.251953 0.000000 m /i glyphshow
9.585938 0.000000 m /t glyphshow
14.291016 0.000000 m /e glyphshow
21.673828 0.000000 m /two glyphshow
grestore
gsave
363.023125 149.953 m
387.023125 149.953 l
387.023125 158.353 l
363.023125 158.353 l
cl
0.000 0.000 0.502 setrgbcolor
fill
grestore
gsave
396.623125 149.953000 translate
0.000000 rotate
0.000000 0.000000 m /s glyphshow
6.251953 0.000000 m /i glyphshow
9.585938 0.000000 m /t glyphshow
14.291016 0.000000 m /e glyphshow
21.673828 0.000000 m /six glyphshow
grestore
gsave
363.023125 132.328 m
387.023125 132.328 l
387.023125 140.728 l
363.023125 140.728 l
cl
fill
grestore
gsave
396.623125 132.328000 translate
0.000000 rotate
0.000000 0.000000 m /s glyphshow
6.251953 0.000000 m /i glyphshow
9.585938 0.000000 m /t glyphshow
14.291016 0.000000 m /e glyphshow
21.673828 0.000000 m /three glyphshow
grestore
gsave
363.023125 114.703 m
387.023125 114.703 l
387.023125 123.103 l
363.023125 123.103 l
cl
1.000 0.000 0.000 setrgbcolor
fill
grestore
gsave
396.623125 114.703000 translate
0.000000 rotate
0.000000 0.000000 m /s glyphshow
6.251953 0.000000 m /i glyphshow
9.585938 0.000000 m /t glyphshow
14.291016 0.000000 m /e glyphshow
21.673828 0.000000 m /seven glyphshow
grestore

end
showpage
