%!PS-Adobe-3.0 EPSF-3.0
%%Creator: graphviz version 2.38.0 (20140413.2041)
%%Title: %3
%%Pages: 1
%%BoundingBox: 36 36 2115 1909
%%EndComments
save
%%BeginProlog
/DotDict 200 dict def
DotDict begin

/setupLatin1 {
mark
/EncodingVector 256 array def
 EncodingVector 0

ISOLatin1Encoding 0 255 getinterval putinterval
EncodingVector 45 /hyphen put

% Set up ISO Latin 1 character encoding
/starnetISO {
        dup dup findfont dup length dict begin
        { 1 index /FID ne { def }{ pop pop } ifelse
        } forall
        /Encoding EncodingVector def
        currentdict end definefont
} def
/Times-Roman starnetISO def
/Times-Italic starnetISO def
/Times-Bold starnetISO def
/Times-BoldItalic starnetISO def
/Helvetica starnetISO def
/Helvetica-Oblique starnetISO def
/Helvetica-Bold starnetISO def
/Helvetica-BoldOblique starnetISO def
/Courier starnetISO def
/Courier-Oblique starnetISO def
/Courier-Bold starnetISO def
/Courier-BoldOblique starnetISO def
cleartomark
} bind def

%%BeginResource: procset graphviz 0 0
/coord-font-family /Times-Roman def
/default-font-family /Times-Roman def
/coordfont coord-font-family findfont 8 scalefont def

/InvScaleFactor 1.0 def
/set_scale {
       dup 1 exch div /InvScaleFactor exch def
       scale
} bind def

% styles
/solid { [] 0 setdash } bind def
/dashed { [9 InvScaleFactor mul dup ] 0 setdash } bind def
/dotted { [1 InvScaleFactor mul 6 InvScaleFactor mul] 0 setdash } bind def
/invis {/fill {newpath} def /stroke {newpath} def /show {pop newpath} def} bind def
/bold { 2 setlinewidth } bind def
/filled { } bind def
/unfilled { } bind def
/rounded { } bind def
/diagonals { } bind def
/tapered { } bind def

% hooks for setting color 
/nodecolor { sethsbcolor } bind def
/edgecolor { sethsbcolor } bind def
/graphcolor { sethsbcolor } bind def
/nopcolor {pop pop pop} bind def

/beginpage {	% i j npages
	/npages exch def
	/j exch def
	/i exch def
	/str 10 string def
	npages 1 gt {
		gsave
			coordfont setfont
			0 0 moveto
			(\() show i str cvs show (,) show j str cvs show (\)) show
		grestore
	} if
} bind def

/set_font {
	findfont exch
	scalefont setfont
} def

% draw text fitted to its expected width
/alignedtext {			% width text
	/text exch def
	/width exch def
	gsave
		width 0 gt {
			[] 0 setdash
			text stringwidth pop width exch sub text length div 0 text ashow
		} if
	grestore
} def

/boxprim {				% xcorner ycorner xsize ysize
		4 2 roll
		moveto
		2 copy
		exch 0 rlineto
		0 exch rlineto
		pop neg 0 rlineto
		closepath
} bind def

/ellipse_path {
	/ry exch def
	/rx exch def
	/y exch def
	/x exch def
	matrix currentmatrix
	newpath
	x y translate
	rx ry scale
	0 0 1 0 360 arc
	setmatrix
} bind def

/endpage { showpage } bind def
/showpage { } def

/layercolorseq
	[	% layer color sequence - darkest to lightest
		[0 0 0]
		[.2 .8 .8]
		[.4 .8 .8]
		[.6 .8 .8]
		[.8 .8 .8]
	]
def

/layerlen layercolorseq length def

/setlayer {/maxlayer exch def /curlayer exch def
	layercolorseq curlayer 1 sub layerlen mod get
	aload pop sethsbcolor
	/nodecolor {nopcolor} def
	/edgecolor {nopcolor} def
	/graphcolor {nopcolor} def
} bind def

/onlayer { curlayer ne {invis} if } def

/onlayers {
	/myupper exch def
	/mylower exch def
	curlayer mylower lt
	curlayer myupper gt
	or
	{invis} if
} def

/curlayer 0 def

%%EndResource
%%EndProlog
%%BeginSetup
14 default-font-family set_font
1 setmiterlimit
% /arrowlength 10 def
% /arrowwidth 5 def

% make sure pdfmark is harmless for PS-interpreters other than Distiller
/pdfmark where {pop} {userdict /pdfmark /cleartomark load put} ifelse
% make '<<' and '>>' safe on PS Level 1 devices
/languagelevel where {pop languagelevel}{1} ifelse
2 lt {
    userdict (<<) cvn ([) cvn load put
    userdict (>>) cvn ([) cvn load put
} if

%%EndSetup
setupLatin1
%%Page: 1 1
%%PageBoundingBox: 36 36 2115 1909
%%PageOrientation: Portrait
0 0 1 beginpage
gsave
36 36 2079 1873 boxprim clip newpath
1 1 set_scale 0 rotate 40 40 translate
% LO
gsave
0 1 1 nodecolor
990.53 789.23 180 180 ellipse_path fill
1 setlinewidth
filled
0 0 0 nodecolor
990.53 789.23 180 180 ellipse_path stroke
0 0 0 nodecolor
38 /Arial-Bold set_font
945.03 779.83 moveto 91 (MGC) alignedtext
grestore
% L11
gsave
0 0 0.6 nodecolor
1656.53 789.23 126 126 ellipse_path fill
1 setlinewidth
filled
0 0 0 nodecolor
1656.53 789.23 126 126 ellipse_path stroke
0 0 0 nodecolor
38 /Arial-Bold set_font
1630.53 779.83 moveto 52 (RA) alignedtext
grestore
% LO->L11
gsave
3 setlinewidth
0 0 0 edgecolor
newpath 1201.08 789.23 moveto
1298.03 789.23 1411.07 789.23 1500.28 789.23 curveto
stroke
0 0 0 edgecolor
newpath 1200.76 778.73 moveto
1170.76 789.23 lineto
1200.76 799.73 lineto
closepath fill
3 setlinewidth
solid
0 0 0 edgecolor
newpath 1200.76 778.73 moveto
1170.76 789.23 lineto
1200.76 799.73 lineto
closepath stroke
0 0 0 edgecolor
newpath 1500.47 799.73 moveto
1530.47 789.23 lineto
1500.47 778.73 lineto
closepath fill
3 setlinewidth
solid
0 0 0 edgecolor
newpath 1500.47 799.73 moveto
1530.47 789.23 lineto
1500.47 778.73 lineto
closepath stroke
grestore
% L12
gsave
0 0 0.6 nodecolor
1051.16 1452.47 126 126 ellipse_path fill
1 setlinewidth
filled
0 0 0 nodecolor
1051.16 1452.47 126 126 ellipse_path stroke
0 0 0 nodecolor
38 /Arial-Bold set_font
1025.16 1443.07 moveto 52 (RA) alignedtext
grestore
% LO->L12
gsave
3 setlinewidth
0 0 0 edgecolor
newpath 1009.7 998.91 moveto
1018.52 1095.46 1028.81 1208.03 1036.93 1296.87 curveto
stroke
0 0 0 edgecolor
newpath 1020.12 997.63 moveto
1006.93 968.71 lineto
999.21 999.55 lineto
closepath fill
3 setlinewidth
solid
0 0 0 edgecolor
newpath 1020.12 997.63 moveto
1006.93 968.71 lineto
999.21 999.55 lineto
closepath stroke
0 0 0 edgecolor
newpath 1026.5 1298.02 moveto
1039.68 1326.94 lineto
1047.41 1296.11 lineto
closepath fill
3 setlinewidth
solid
0 0 0 edgecolor
newpath 1026.5 1298.02 moveto
1039.68 1326.94 lineto
1047.41 1296.11 lineto
closepath stroke
grestore
% DERS
gsave
0 0 0.6 nodecolor
446.47 1173.36 126 126 ellipse_path fill
1 setlinewidth
filled
0 0 0 nodecolor
446.47 1173.36 126 126 ellipse_path stroke
0 0 0 nodecolor
38 /Arial-Bold set_font
420.47 1163.96 moveto 52 (RA) alignedtext
grestore
% LO->DERS
gsave
3 setlinewidth
0 0 0 edgecolor
newpath 818.52 910.67 moveto
739.41 966.53 647.18 1031.65 574.34 1083.08 curveto
stroke
0 0 0 edgecolor
newpath 824.84 919.07 moveto
843.3 893.18 lineto
812.73 901.91 lineto
closepath fill
3 setlinewidth
solid
0 0 0 edgecolor
newpath 824.84 919.07 moveto
843.3 893.18 lineto
812.73 901.91 lineto
closepath stroke
0 0 0 edgecolor
newpath 567.89 1074.78 moveto
549.44 1100.66 lineto
580 1091.93 lineto
closepath fill
3 setlinewidth
solid
0 0 0 edgecolor
newpath 567.89 1074.78 moveto
549.44 1100.66 lineto
580 1091.93 lineto
closepath stroke
grestore
% L13
gsave
0 0 0.6 nodecolor
385.83 510.13 126 126 ellipse_path fill
1 setlinewidth
filled
0 0 0 nodecolor
385.83 510.13 126 126 ellipse_path stroke
0 0 0 nodecolor
38 /Arial-Bold set_font
359.83 500.73 moveto 52 (RA) alignedtext
grestore
% LO->L13
gsave
3 setlinewidth
0 0 0 edgecolor
newpath 799.36 701 moveto
711.33 660.37 608.69 612.99 527.7 575.61 curveto
stroke
0 0 0 edgecolor
newpath 795.25 710.66 moveto
826.89 713.7 lineto
804.05 691.6 lineto
closepath fill
3 setlinewidth
solid
0 0 0 edgecolor
newpath 795.25 710.66 moveto
826.89 713.7 lineto
804.05 691.6 lineto
closepath stroke
0 0 0 edgecolor
newpath 531.92 565.99 moveto
500.28 562.95 lineto
523.12 585.06 lineto
closepath fill
3 setlinewidth
solid
0 0 0 edgecolor
newpath 531.92 565.99 moveto
500.28 562.95 lineto
523.12 585.06 lineto
closepath stroke
grestore
% L11B
gsave
0 0 0.93333 nodecolor
1408.97 609.37 108 108 ellipse_path fill
1 setlinewidth
filled
0 0 0.8 nodecolor
1408.97 609.37 108 108 ellipse_path stroke
grestore
% L11->L11B
gsave
3 setlinewidth
0 0 0.8 edgecolor
newpath 1529.89 697.23 moveto
1526.91 695.06 1523.92 692.89 1520.95 690.73 curveto
stroke
0 0 0.8 edgecolor
newpath 1523.96 705.9 moveto
1554.41 715.04 lineto
1536.31 688.91 lineto
closepath fill
3 setlinewidth
solid
0 0 0.8 edgecolor
newpath 1523.96 705.9 moveto
1554.41 715.04 lineto
1536.31 688.91 lineto
closepath stroke
0 0 0.8 edgecolor
newpath 1527.08 682.21 moveto
1496.64 673.07 lineto
1514.74 699.2 lineto
closepath fill
3 setlinewidth
solid
0 0 0.8 edgecolor
newpath 1527.08 682.21 moveto
1496.64 673.07 lineto
1514.74 699.2 lineto
closepath stroke
grestore
% L11V
gsave
0 0 0.93333 nodecolor
1751.09 498.21 108 108 ellipse_path fill
1 setlinewidth
filled
0 0 0.8 nodecolor
1751.09 498.21 108 108 ellipse_path stroke
grestore
% L11->L11V
gsave
3 setlinewidth
0 0 0.8 edgecolor
newpath 1704.81 640.64 moveto
1705.96 637.1 1707.1 633.57 1708.25 630.05 curveto
stroke
0 0 0.8 edgecolor
newpath 1694.82 637.41 moveto
1695.53 669.18 lineto
1714.79 643.9 lineto
closepath fill
3 setlinewidth
solid
0 0 0.8 edgecolor
newpath 1694.82 637.41 moveto
1695.53 669.18 lineto
1714.79 643.9 lineto
closepath stroke
0 0 0.8 edgecolor
newpath 1718.31 633.05 moveto
1717.6 601.28 lineto
1698.34 626.56 lineto
closepath fill
3 setlinewidth
solid
0 0 0.8 edgecolor
newpath 1718.31 633.05 moveto
1717.6 601.28 lineto
1698.34 626.56 lineto
closepath stroke
grestore
% L11W
gsave
0 0 0.93333 nodecolor
1962.53 789.23 108 108 ellipse_path fill
1 setlinewidth
filled
0 0 0.8 nodecolor
1962.53 789.23 108 108 ellipse_path stroke
grestore
% L11->L11W
gsave
3 setlinewidth
0 0 0.8 edgecolor
newpath 1812.77 789.23 moveto
1816.49 789.23 1820.2 789.23 1823.9 789.23 curveto
stroke
0 0 0.8 edgecolor
newpath 1812.76 778.73 moveto
1782.76 789.23 lineto
1812.76 799.73 lineto
closepath fill
3 setlinewidth
solid
0 0 0.8 edgecolor
newpath 1812.76 778.73 moveto
1782.76 789.23 lineto
1812.76 799.73 lineto
closepath stroke
0 0 0.8 edgecolor
newpath 1824.16 799.73 moveto
1854.16 789.23 lineto
1824.16 778.73 lineto
closepath fill
3 setlinewidth
solid
0 0 0.8 edgecolor
newpath 1824.16 799.73 moveto
1854.16 789.23 lineto
1824.16 778.73 lineto
closepath stroke
grestore
% L11A
gsave
0 0 0.93333 nodecolor
1751.09 1080.26 108 108 ellipse_path fill
1 setlinewidth
filled
0 0 0.8 nodecolor
1751.09 1080.26 108 108 ellipse_path stroke
grestore
% L11->L11A
gsave
3 setlinewidth
0 0 0.8 edgecolor
newpath 1704.81 937.83 moveto
1705.96 941.37 1707.1 944.9 1708.25 948.42 curveto
stroke
0 0 0.8 edgecolor
newpath 1714.79 934.57 moveto
1695.53 909.28 lineto
1694.82 941.06 lineto
closepath fill
3 setlinewidth
solid
0 0 0.8 edgecolor
newpath 1714.79 934.57 moveto
1695.53 909.28 lineto
1694.82 941.06 lineto
closepath stroke
0 0 0.8 edgecolor
newpath 1698.34 951.91 moveto
1717.6 977.19 lineto
1718.31 945.42 lineto
closepath fill
3 setlinewidth
solid
0 0 0.8 edgecolor
newpath 1698.34 951.91 moveto
1717.6 977.19 lineto
1718.31 945.42 lineto
closepath stroke
grestore
% L12B
gsave
0 0 0.93333 nodecolor
1207.74 1189.56 108 108 ellipse_path fill
1 setlinewidth
filled
0 0 0.8 nodecolor
1207.74 1189.56 108 108 ellipse_path stroke
grestore
% L12->L12B
gsave
3 setlinewidth
0 0 0.8 edgecolor
newpath 1131.25 1317.99 moveto
1133.14 1314.81 1135.03 1311.65 1136.91 1308.49 curveto
stroke
0 0 0.8 edgecolor
newpath 1122.08 1312.87 moveto
1115.75 1344.02 lineto
1140.12 1323.61 lineto
closepath fill
3 setlinewidth
solid
0 0 0.8 edgecolor
newpath 1122.08 1312.87 moveto
1115.75 1344.02 lineto
1140.12 1323.61 lineto
closepath stroke
0 0 0.8 edgecolor
newpath 1145.96 1313.82 moveto
1152.29 1282.67 lineto
1127.91 1303.07 lineto
closepath fill
3 setlinewidth
solid
0 0 0.8 edgecolor
newpath 1145.96 1313.82 moveto
1152.29 1282.67 lineto
1127.91 1303.07 lineto
closepath stroke
grestore
% L12V
gsave
0 0 0.93333 nodecolor
1349.58 1520.14 108 108 ellipse_path fill
1 setlinewidth
filled
0 0 0.8 nodecolor
1349.58 1520.14 108 108 ellipse_path stroke
grestore
% L12->L12V
gsave
3 setlinewidth
0 0 0.8 edgecolor
newpath 1203.54 1487.02 moveto
1207.16 1487.84 1210.78 1488.66 1214.39 1489.48 curveto
stroke
0 0 0.8 edgecolor
newpath 1205.84 1476.78 moveto
1174.26 1480.38 lineto
1201.2 1497.26 lineto
closepath fill
3 setlinewidth
solid
0 0 0.8 edgecolor
newpath 1205.84 1476.78 moveto
1174.26 1480.38 lineto
1201.2 1497.26 lineto
closepath stroke
0 0 0.8 edgecolor
newpath 1212.32 1499.78 moveto
1243.9 1496.17 lineto
1216.96 1479.3 lineto
closepath fill
3 setlinewidth
solid
0 0 0.8 edgecolor
newpath 1212.32 1499.78 moveto
1243.9 1496.17 lineto
1216.96 1479.3 lineto
closepath stroke
grestore
% L12W
gsave
0 0 0.93333 nodecolor
1079.02 1757.2 108 108 ellipse_path fill
1 setlinewidth
filled
0 0 0.8 nodecolor
1079.02 1757.2 108 108 ellipse_path stroke
grestore
% L12->L12W
gsave
3 setlinewidth
0 0 0.8 edgecolor
newpath 1065.38 1608.07 moveto
1065.72 1611.77 1066.06 1615.46 1066.4 1619.15 curveto
stroke
0 0 0.8 edgecolor
newpath 1075.84 1607.09 moveto
1062.65 1578.17 lineto
1054.93 1609 lineto
closepath fill
3 setlinewidth
solid
0 0 0.8 edgecolor
newpath 1075.84 1607.09 moveto
1062.65 1578.17 lineto
1054.93 1609 lineto
closepath stroke
0 0 0.8 edgecolor
newpath 1055.96 1620.36 moveto
1069.15 1649.28 lineto
1076.88 1618.45 lineto
closepath fill
3 setlinewidth
solid
0 0 0.8 edgecolor
newpath 1055.96 1620.36 moveto
1069.15 1649.28 lineto
1076.88 1618.45 lineto
closepath stroke
grestore
% L12A
gsave
0 0 0.93333 nodecolor
769.95 1573.13 108 108 ellipse_path fill
1 setlinewidth
filled
0 0 0.8 nodecolor
769.95 1573.13 108 108 ellipse_path stroke
grestore
% L12->L12A
gsave
3 setlinewidth
0 0 0.8 edgecolor
newpath 907.57 1514.08 moveto
904.16 1515.54 900.75 1517.01 897.35 1518.47 curveto
stroke
0 0 0.8 edgecolor
newpath 911.73 1523.72 moveto
935.16 1502.24 lineto
903.45 1504.42 lineto
closepath fill
3 setlinewidth
solid
0 0 0.8 edgecolor
newpath 911.73 1523.72 moveto
935.16 1502.24 lineto
903.45 1504.42 lineto
closepath stroke
0 0 0.8 edgecolor
newpath 892.97 1508.92 moveto
869.54 1530.4 lineto
901.25 1528.22 lineto
closepath fill
3 setlinewidth
solid
0 0 0.8 edgecolor
newpath 892.97 1508.92 moveto
869.54 1530.4 lineto
901.25 1528.22 lineto
closepath stroke
grestore
% DERG
gsave
0 0 0.6 nodecolor
929.89 126 126 126 ellipse_path fill
1 setlinewidth
filled
0 0 0 nodecolor
929.89 126 126 126 ellipse_path stroke
0 0 0 nodecolor
38 /Arial-Bold set_font
903.89 116.6 moveto 52 (RA) alignedtext
grestore
% DERG->LO
gsave
3 setlinewidth
0 0 0 edgecolor
newpath 944.13 281.69 moveto
952.25 370.55 962.54 483.13 971.37 579.68 curveto
stroke
0 0 0 edgecolor
newpath 954.56 280.45 moveto
941.37 251.53 lineto
933.64 282.36 lineto
closepath fill
3 setlinewidth
solid
0 0 0 edgecolor
newpath 954.56 280.45 moveto
941.37 251.53 lineto
933.64 282.36 lineto
closepath stroke
0 0 0 edgecolor
newpath 960.93 580.82 moveto
974.12 609.74 lineto
981.84 578.91 lineto
closepath fill
3 setlinewidth
solid
0 0 0 edgecolor
newpath 960.93 580.82 moveto
974.12 609.74 lineto
981.84 578.91 lineto
closepath stroke
grestore
% DERC
gsave
0 0 0.6 nodecolor
1323.53 212.46 126 126 ellipse_path fill
1 setlinewidth
filled
0 0 0 nodecolor
1323.53 212.46 126 126 ellipse_path stroke
0 0 0 nodecolor
38 /Arial-Bold set_font
1297.53 203.06 moveto 52 (RA) alignedtext
grestore
% DERC->LO
gsave
3 setlinewidth
0 0 0 edgecolor
newpath 1245.36 347.85 moveto
1200.74 425.13 1144.22 523.04 1095.74 606.99 curveto
stroke
0 0 0 edgecolor
newpath 1254.59 352.86 moveto
1260.5 321.63 lineto
1236.41 342.36 lineto
closepath fill
3 setlinewidth
solid
0 0 0 edgecolor
newpath 1254.59 352.86 moveto
1260.5 321.63 lineto
1236.41 342.36 lineto
closepath stroke
0 0 0 edgecolor
newpath 1086.55 601.91 moveto
1080.65 633.14 lineto
1104.74 612.41 lineto
closepath fill
3 setlinewidth
solid
0 0 0 edgecolor
newpath 1086.55 601.91 moveto
1080.65 633.14 lineto
1104.74 612.41 lineto
closepath stroke
grestore
% L13W
gsave
0 0 0.93333 nodecolor
413.69 814.86 108 108 ellipse_path fill
1 setlinewidth
filled
0 0 0.8 nodecolor
413.69 814.86 108 108 ellipse_path stroke
grestore
% L13->L13W
gsave
3 setlinewidth
0 0 0.8 edgecolor
newpath 400.06 665.72 moveto
400.4 669.42 400.73 673.12 401.07 676.81 curveto
stroke
0 0 0.8 edgecolor
newpath 410.51 664.75 moveto
397.32 635.83 lineto
389.6 666.66 lineto
closepath fill
3 setlinewidth
solid
0 0 0.8 edgecolor
newpath 410.51 664.75 moveto
397.32 635.83 lineto
389.6 666.66 lineto
closepath stroke
0 0 0.8 edgecolor
newpath 390.64 678.02 moveto
403.82 706.94 lineto
411.55 676.11 lineto
closepath fill
3 setlinewidth
solid
0 0 0.8 edgecolor
newpath 390.64 678.02 moveto
403.82 706.94 lineto
411.55 676.11 lineto
closepath stroke
grestore
% L13A
gsave
0 0 0.93333 nodecolor
108 381.89 108 108 ellipse_path fill
1 setlinewidth
filled
0 0 0.8 nodecolor
108 381.89 108 108 ellipse_path stroke
grestore
% L13->L13A
gsave
3 setlinewidth
0 0 0.8 edgecolor
newpath 243.97 444.65 moveto
240.6 443.09 237.23 441.53 233.86 439.98 curveto
stroke
0 0 0.8 edgecolor
newpath 239.58 454.19 moveto
271.22 457.23 lineto
248.39 435.12 lineto
closepath fill
3 setlinewidth
solid
0 0 0.8 edgecolor
newpath 239.58 454.19 moveto
271.22 457.23 lineto
248.39 435.12 lineto
closepath stroke
0 0 0.8 edgecolor
newpath 238.03 430.34 moveto
206.39 427.3 lineto
229.23 449.41 lineto
closepath fill
3 setlinewidth
solid
0 0 0.8 edgecolor
newpath 238.03 430.34 moveto
206.39 427.3 lineto
229.23 449.41 lineto
closepath stroke
grestore
% L11P
gsave
0 0 0.93333 nodecolor
1408.97 969.1 108 108 ellipse_path fill
1 setlinewidth
filled
0 0 0.8 nodecolor
1408.97 969.1 108 108 ellipse_path stroke
grestore
% L11P->L11
gsave
3 setlinewidth
0 0 0.8 edgecolor
newpath 1521.13 887.6 moveto
1523.97 885.54 1526.82 883.47 1529.67 881.4 curveto
stroke
0 0 0.8 edgecolor
newpath 1514.69 879.3 moveto
1496.6 905.43 lineto
1527.04 896.29 lineto
closepath fill
3 setlinewidth
solid
0 0 0.8 edgecolor
newpath 1514.69 879.3 moveto
1496.6 905.43 lineto
1527.04 896.29 lineto
closepath stroke
0 0 0.8 edgecolor
newpath 1536.1 889.71 moveto
1554.2 863.58 lineto
1523.76 872.72 lineto
closepath fill
3 setlinewidth
solid
0 0 0.8 edgecolor
newpath 1536.1 889.71 moveto
1554.2 863.58 lineto
1523.76 872.72 lineto
closepath stroke
grestore
% L12P
gsave
0 0 0.93333 nodecolor
849.51 1222.31 108 108 ellipse_path fill
1 setlinewidth
filled
0 0 0.8 nodecolor
849.51 1222.31 108 108 ellipse_path stroke
grestore
% L12P->L12
gsave
3 setlinewidth
0 0 0.8 edgecolor
newpath 940.87 1326.59 moveto
943.12 1329.15 945.37 1331.72 947.62 1334.29 curveto
stroke
0 0 0.8 edgecolor
newpath 948.55 1319.43 moveto
920.89 1303.78 lineto
932.76 1333.26 lineto
closepath fill
3 setlinewidth
solid
0 0 0.8 edgecolor
newpath 948.55 1319.43 moveto
920.89 1303.78 lineto
932.76 1333.26 lineto
closepath stroke
0 0 0.8 edgecolor
newpath 940.14 1341.69 moveto
967.81 1357.34 lineto
955.94 1327.85 lineto
closepath fill
3 setlinewidth
solid
0 0 0.8 edgecolor
newpath 940.14 1341.69 moveto
967.81 1357.34 lineto
955.94 1327.85 lineto
closepath stroke
grestore
% L13P
gsave
0 0 0.93333 nodecolor
635.81 333.64 108 108 ellipse_path fill
1 setlinewidth
filled
0 0 0.8 nodecolor
635.81 333.64 108 108 ellipse_path stroke
grestore
% L13P->L13
gsave
3 setlinewidth
0 0 0.8 edgecolor
newpath 522.54 413.6 moveto
519.68 415.63 516.8 417.66 513.92 419.69 curveto
stroke
0 0 0.8 edgecolor
newpath 528.87 421.99 moveto
547.32 396.11 lineto
516.76 404.83 lineto
closepath fill
3 setlinewidth
solid
0 0 0.8 edgecolor
newpath 528.87 421.99 moveto
547.32 396.11 lineto
516.76 404.83 lineto
closepath stroke
0 0 0.8 edgecolor
newpath 507.61 411.3 moveto
489.15 437.18 lineto
519.72 428.45 lineto
closepath fill
3 setlinewidth
solid
0 0 0.8 edgecolor
newpath 507.61 411.3 moveto
489.15 437.18 lineto
519.72 428.45 lineto
closepath stroke
grestore
endpage
showpage
grestore
%%PageTrailer
%%EndPage: 1
%%Trailer
end
restore
%%EOF
