%!PS-Adobe-3.0 EPSF-3.0
%%Creator: graphviz version 2.38.0 (20140413.2041)
%%Title: %3
%%Pages: 1
%%BoundingBox: 150 150 2177 1471
%%EndComments
save
%%BeginProlog
/DotDict 200 dict def
DotDict begin

/setupLatin1 {
mark
/EncodingVector 256 array def
 EncodingVector 0

ISOLatin1Encoding 0 255 getinterval putinterval
EncodingVector 45 /hyphen put

% Set up ISO Latin 1 character encoding
/starnetISO {
        dup dup findfont dup length dict begin
        { 1 index /FID ne { def }{ pop pop } ifelse
        } forall
        /Encoding EncodingVector def
        currentdict end definefont
} def
/Times-Roman starnetISO def
/Times-Italic starnetISO def
/Times-Bold starnetISO def
/Times-BoldItalic starnetISO def
/Helvetica starnetISO def
/Helvetica-Oblique starnetISO def
/Helvetica-Bold starnetISO def
/Helvetica-BoldOblique starnetISO def
/Courier starnetISO def
/Courier-Oblique starnetISO def
/Courier-Bold starnetISO def
/Courier-BoldOblique starnetISO def
cleartomark
} bind def

%%BeginResource: procset graphviz 0 0
/coord-font-family /Times-Roman def
/default-font-family /Times-Roman def
/coordfont coord-font-family findfont 8 scalefont def

/InvScaleFactor 1.0 def
/set_scale {
       dup 1 exch div /InvScaleFactor exch def
       scale
} bind def

% styles
/solid { [] 0 setdash } bind def
/dashed { [9 InvScaleFactor mul dup ] 0 setdash } bind def
/dotted { [1 InvScaleFactor mul 6 InvScaleFactor mul] 0 setdash } bind def
/invis {/fill {newpath} def /stroke {newpath} def /show {pop newpath} def} bind def
/bold { 2 setlinewidth } bind def
/filled { } bind def
/unfilled { } bind def
/rounded { } bind def
/diagonals { } bind def
/tapered { } bind def

% hooks for setting color 
/nodecolor { sethsbcolor } bind def
/edgecolor { sethsbcolor } bind def
/graphcolor { sethsbcolor } bind def
/nopcolor {pop pop pop} bind def

/beginpage {	% i j npages
	/npages exch def
	/j exch def
	/i exch def
	/str 10 string def
	npages 1 gt {
		gsave
			coordfont setfont
			0 0 moveto
			(\() show i str cvs show (,) show j str cvs show (\)) show
		grestore
	} if
} bind def

/set_font {
	findfont exch
	scalefont setfont
} def

% draw text fitted to its expected width
/alignedtext {			% width text
	/text exch def
	/width exch def
	gsave
		width 0 gt {
			[] 0 setdash
			text stringwidth pop width exch sub text length div 0 text ashow
		} if
	grestore
} def

/boxprim {				% xcorner ycorner xsize ysize
		4 2 roll
		moveto
		2 copy
		exch 0 rlineto
		0 exch rlineto
		pop neg 0 rlineto
		closepath
} bind def

/ellipse_path {
	/ry exch def
	/rx exch def
	/y exch def
	/x exch def
	matrix currentmatrix
	newpath
	x y translate
	rx ry scale
	0 0 1 0 360 arc
	setmatrix
} bind def

/endpage { showpage } bind def
/showpage { } def

/layercolorseq
	[	% layer color sequence - darkest to lightest
		[0 0 0]
		[.2 .8 .8]
		[.4 .8 .8]
		[.6 .8 .8]
		[.8 .8 .8]
	]
def

/layerlen layercolorseq length def

/setlayer {/maxlayer exch def /curlayer exch def
	layercolorseq curlayer 1 sub layerlen mod get
	aload pop sethsbcolor
	/nodecolor {nopcolor} def
	/edgecolor {nopcolor} def
	/graphcolor {nopcolor} def
} bind def

/onlayer { curlayer ne {invis} if } def

/onlayers {
	/myupper exch def
	/mylower exch def
	curlayer mylower lt
	curlayer myupper gt
	or
	{invis} if
} def

/curlayer 0 def

%%EndResource
%%EndProlog
%%BeginSetup
14 default-font-family set_font
1 setmiterlimit
% /arrowlength 10 def
% /arrowwidth 5 def

% make sure pdfmark is harmless for PS-interpreters other than Distiller
/pdfmark where {pop} {userdict /pdfmark /cleartomark load put} ifelse
% make '<<' and '>>' safe on PS Level 1 devices
/languagelevel where {pop languagelevel}{1} ifelse
2 lt {
    userdict (<<) cvn ([) cvn load put
    userdict (>>) cvn ([) cvn load put
} if

%%EndSetup
setupLatin1
%%Page: 1 1
%%PageBoundingBox: 150 150 2177 1471
%%PageOrientation: Portrait
0 0 1 beginpage
gsave
150 150 2027 1321 boxprim clip newpath
4.16667 4.16667 set_scale 0 rotate 40 40 translate
% a
gsave
0 0 0.75294 nodecolor
29.9 154.47 29.8 18 ellipse_path fill
1 setlinewidth
filled
0 0 0 nodecolor
29.9 154.47 29.8 18 ellipse_path stroke
0 0 0 nodecolor
14 /Times-Roman set_font
14.9 150.77 moveto 30 (Node) alignedtext
grestore
% s
gsave
0 0 0.75294 nodecolor
305.19 154.47 41.69 18 ellipse_path fill
1 setlinewidth
filled
0 0 0 nodecolor
305.19 154.47 41.69 18 ellipse_path stroke
0 0 0 nodecolor
14 /Times-Roman set_font
281.19 150.77 moveto 48 (Network) alignedtext
grestore
% a->s
gsave
1 setlinewidth
0 0 0 edgecolor
newpath 69.98 154.47 moveto
118.31 154.47 199.66 154.47 252.89 154.47 curveto
stroke
0 0 0 edgecolor
newpath 69.88 150.97 moveto
59.88 154.47 lineto
69.88 157.97 lineto
closepath fill
1 setlinewidth
solid
0 0 0 edgecolor
newpath 69.88 150.97 moveto
59.88 154.47 lineto
69.88 157.97 lineto
closepath stroke
0 0 0 edgecolor
newpath 253.14 157.97 moveto
263.14 154.47 lineto
253.14 150.97 lineto
closepath fill
1 setlinewidth
solid
0 0 0 edgecolor
newpath 253.14 157.97 moveto
263.14 154.47 lineto
253.14 150.97 lineto
closepath stroke
0 0 0 edgecolor
14 /Times-Roman set_font
94.43 158.27 moveto 67 (energy-flow) alignedtext
grestore
% b
gsave
0 0 0.75294 nodecolor
189.1 70.13 29.8 18 ellipse_path fill
1 setlinewidth
filled
0 0 0 nodecolor
189.1 70.13 29.8 18 ellipse_path stroke
0 0 0 nodecolor
14 /Times-Roman set_font
174.1 66.43 moveto 30 (Node) alignedtext
grestore
% b->s
gsave
1 setlinewidth
0 0 0 edgecolor
newpath 216.57 90.09 moveto
234.19 102.89 257.07 119.51 275.16 132.66 curveto
stroke
0 0 0 edgecolor
newpath 218.41 87.1 moveto
208.27 84.05 lineto
214.3 92.76 lineto
closepath fill
1 setlinewidth
solid
0 0 0 edgecolor
newpath 218.41 87.1 moveto
208.27 84.05 lineto
214.3 92.76 lineto
closepath stroke
0 0 0 edgecolor
newpath 273.47 135.75 moveto
283.62 138.8 lineto
277.59 130.09 lineto
closepath fill
1 setlinewidth
solid
0 0 0 edgecolor
newpath 273.47 135.75 moveto
283.62 138.8 lineto
277.59 130.09 lineto
closepath stroke
grestore
% c
gsave
0 0 0.75294 nodecolor
349.53 18 29.8 18 ellipse_path fill
1 setlinewidth
filled
0 0 0 nodecolor
349.53 18 29.8 18 ellipse_path stroke
0 0 0 nodecolor
14 /Times-Roman set_font
334.53 14.3 moveto 30 (Node) alignedtext
grestore
% c->s
gsave
1 setlinewidth
0 0 0 edgecolor
newpath 340.58 45.52 moveto
332.9 69.19 321.86 103.15 314.16 126.85 curveto
stroke
0 0 0 edgecolor
newpath 343.97 46.43 moveto
343.73 35.84 lineto
337.31 44.27 lineto
closepath fill
1 setlinewidth
solid
0 0 0 edgecolor
newpath 343.97 46.43 moveto
343.73 35.84 lineto
337.31 44.27 lineto
closepath stroke
0 0 0 edgecolor
newpath 310.75 126.03 moveto
310.98 136.63 lineto
317.4 128.2 lineto
closepath fill
1 setlinewidth
solid
0 0 0 edgecolor
newpath 310.75 126.03 moveto
310.98 136.63 lineto
317.4 128.2 lineto
closepath stroke
grestore
% d
gsave
0 0 0.75294 nodecolor
448.68 154.47 29.8 18 ellipse_path fill
1 setlinewidth
filled
0 0 0 nodecolor
448.68 154.47 29.8 18 ellipse_path stroke
0 0 0 nodecolor
14 /Times-Roman set_font
433.68 150.77 moveto 30 (Node) alignedtext
grestore
% d->s
gsave
1 setlinewidth
0 0 0 edgecolor
newpath 408.38 154.47 moveto
392.49 154.47 374.05 154.47 357.19 154.47 curveto
stroke
0 0 0 edgecolor
newpath 408.6 157.97 moveto
418.6 154.47 lineto
408.6 150.97 lineto
closepath fill
1 setlinewidth
solid
0 0 0 edgecolor
newpath 408.6 157.97 moveto
418.6 154.47 lineto
408.6 150.97 lineto
closepath stroke
0 0 0 edgecolor
newpath 356.93 150.97 moveto
346.93 154.47 lineto
356.93 157.97 lineto
closepath fill
1 setlinewidth
solid
0 0 0 edgecolor
newpath 356.93 150.97 moveto
346.93 154.47 lineto
356.93 157.97 lineto
closepath stroke
grestore
% e
gsave
0 0 0.75294 nodecolor
349.53 290.94 29.8 18 ellipse_path fill
1 setlinewidth
filled
0 0 0 nodecolor
349.53 290.94 29.8 18 ellipse_path stroke
0 0 0 nodecolor
14 /Times-Roman set_font
334.53 287.24 moveto 30 (Node) alignedtext
grestore
% e->s
gsave
1 setlinewidth
0 0 0 edgecolor
newpath 340.58 263.42 moveto
332.9 239.75 321.86 205.79 314.16 182.09 curveto
stroke
0 0 0 edgecolor
newpath 337.31 264.67 moveto
343.73 273.1 lineto
343.97 262.51 lineto
closepath fill
1 setlinewidth
solid
0 0 0 edgecolor
newpath 337.31 264.67 moveto
343.73 273.1 lineto
343.97 262.51 lineto
closepath stroke
0 0 0 edgecolor
newpath 317.4 180.75 moveto
310.98 172.32 lineto
310.75 182.91 lineto
closepath fill
1 setlinewidth
solid
0 0 0 edgecolor
newpath 317.4 180.75 moveto
310.98 172.32 lineto
310.75 182.91 lineto
closepath stroke
grestore
% f
gsave
0 0 0.75294 nodecolor
189.1 238.81 29.8 18 ellipse_path fill
1 setlinewidth
filled
0 0 0 nodecolor
189.1 238.81 29.8 18 ellipse_path stroke
0 0 0 nodecolor
14 /Times-Roman set_font
174.1 235.11 moveto 30 (Node) alignedtext
grestore
% f->s
gsave
1 setlinewidth
0 0 0 edgecolor
newpath 216.57 218.85 moveto
234.19 206.05 257.07 189.43 275.16 176.28 curveto
stroke
0 0 0 edgecolor
newpath 214.3 216.18 moveto
208.27 224.89 lineto
218.41 221.84 lineto
closepath fill
1 setlinewidth
solid
0 0 0 edgecolor
newpath 214.3 216.18 moveto
208.27 224.89 lineto
218.41 221.84 lineto
closepath stroke
0 0 0 edgecolor
newpath 277.59 178.85 moveto
283.62 170.14 lineto
273.47 173.19 lineto
closepath fill
1 setlinewidth
solid
0 0 0 edgecolor
newpath 277.59 178.85 moveto
283.62 170.14 lineto
273.47 173.19 lineto
closepath stroke
grestore
endpage
showpage
grestore
%%PageTrailer
%%EndPage: 1
%%Trailer
end
restore
%%EOF
