%!PS-Adobe-3.0 EPSF-3.0
%%Title: scenario2.py-network-latest-report/animation-site4-0000.eps
%%Creator: matplotlib version 2.0.0, http://matplotlib.org/
%%CreationDate: Sun Jun  2 09:13:31 2019
%%Orientation: portrait
%%BoundingBox: 75 223 536 568
%%EndComments
%%BeginProlog
/mpldict 8 dict def
mpldict begin
/m { moveto } bind def
/l { lineto } bind def
/r { rlineto } bind def
/c { curveto } bind def
/cl { closepath } bind def
/box {
m
1 index 0 r
0 exch r
neg 0 r
cl
} bind def
/clipbox {
box
clip
newpath
} bind def
%!PS-Adobe-3.0 Resource-Font
%%Title: DejaVu Sans
%%Copyright: Copyright (c) 2003 by Bitstream, Inc. All Rights Reserved. Copyright (c) 2006 by Tavmjong Bah. All Rights Reserved. DejaVu changes are in public domain 
%%Creator: Converted from TrueType to type 3 by PPR
25 dict begin
/_d{bind def}bind def
/_m{moveto}_d
/_l{lineto}_d
/_cl{closepath eofill}_d
/_c{curveto}_d
/_sc{7 -1 roll{setcachedevice}{pop pop pop pop pop pop}ifelse}_d
/_e{exec}_d
/FontName /DejaVuSans def
/PaintType 0 def
/FontMatrix[.001 0 0 .001 0 0]def
/FontBBox[-1021 -463 1793 1232]def
/FontType 3 def
/Encoding [ /period /zero /one /two /four /five /a /c /d /e /f /g /h /i /l /m /n /p /r /s /t /u /v /w ] def
/FontInfo 10 dict dup begin
/FamilyName (DejaVu Sans) def
/FullName (DejaVu Sans) def
/Notice (Copyright (c) 2003 by Bitstream, Inc. All Rights Reserved. Copyright (c) 2006 by Tavmjong Bah. All Rights Reserved. DejaVu changes are in public domain ) def
/Weight (Book) def
/Version (Version 2.35) def
/ItalicAngle 0.0 def
/isFixedPitch false def
/UnderlinePosition -130 def
/UnderlineThickness 90 def
end readonly def
/CharStrings 24 dict dup begin
/period{318 0 107 0 210 124 _sc
107 124 _m
210 124 _l
210 0 _l
107 0 _l
107 124 _l
_cl}_d
/zero{636 0 66 -13 570 742 _sc
318 664 _m
267 664 229 639 203 589 _c
177 539 165 464 165 364 _c
165 264 177 189 203 139 _c
229 89 267 64 318 64 _c
369 64 407 89 433 139 _c
458 189 471 264 471 364 _c
471 464 458 539 433 589 _c
407 639 369 664 318 664 _c
318 742 _m
399 742 461 709 505 645 _c
548 580 570 486 570 364 _c
570 241 548 147 505 83 _c
461 19 399 -13 318 -13 _c
236 -13 173 19 130 83 _c
87 147 66 241 66 364 _c
66 486 87 580 130 645 _c
173 709 236 742 318 742 _c
_cl}_d
/one{636 0 110 0 544 729 _sc
124 83 _m
285 83 _l
285 639 _l
110 604 _l
110 694 _l
284 729 _l
383 729 _l
383 83 _l
544 83 _l
544 0 _l
124 0 _l
124 83 _l
_cl}_d
/two{{636 0 73 0 536 742 _sc
192 83 _m
536 83 _l
536 0 _l
73 0 _l
73 83 _l
110 121 161 173 226 239 _c
290 304 331 346 348 365 _c
380 400 402 430 414 455 _c
426 479 433 504 433 528 _c
433 566 419 598 392 622 _c
365 646 330 659 286 659 _c
255 659 222 653 188 643 _c
154 632 117 616 78 594 _c
78 694 _l
118 710 155 722 189 730 _c
223 738 255 742 284 742 _c
}_e{359 742 419 723 464 685 _c
509 647 532 597 532 534 _c
532 504 526 475 515 449 _c
504 422 484 390 454 354 _c
446 344 420 317 376 272 _c
332 227 271 164 192 83 _c
_cl}_e}_d
/four{636 0 49 0 580 729 _sc
378 643 _m
129 254 _l
378 254 _l
378 643 _l
352 729 _m
476 729 _l
476 254 _l
580 254 _l
580 172 _l
476 172 _l
476 0 _l
378 0 _l
378 172 _l
49 172 _l
49 267 _l
352 729 _l
_cl}_d
/five{{636 0 77 -13 549 729 _sc
108 729 _m
495 729 _l
495 646 _l
198 646 _l
198 467 _l
212 472 227 476 241 478 _c
255 480 270 482 284 482 _c
365 482 429 459 477 415 _c
525 370 549 310 549 234 _c
549 155 524 94 475 51 _c
426 8 357 -13 269 -13 _c
238 -13 207 -10 175 -6 _c
143 -1 111 6 77 17 _c
77 116 _l
106 100 136 88 168 80 _c
199 72 232 69 267 69 _c
}_e{323 69 368 83 401 113 _c
433 143 450 183 450 234 _c
450 284 433 324 401 354 _c
368 384 323 399 267 399 _c
241 399 214 396 188 390 _c
162 384 135 375 108 363 _c
108 729 _l
_cl}_e}_d
/a{{613 0 60 -13 522 560 _sc
343 275 _m
270 275 220 266 192 250 _c
164 233 150 205 150 165 _c
150 133 160 107 181 89 _c
202 70 231 61 267 61 _c
317 61 357 78 387 114 _c
417 149 432 196 432 255 _c
432 275 _l
343 275 _l
522 312 _m
522 0 _l
432 0 _l
432 83 _l
411 49 385 25 355 10 _c
325 -5 287 -13 243 -13 _c
187 -13 142 2 109 33 _c
76 64 60 106 60 159 _c
}_e{60 220 80 266 122 298 _c
163 329 224 345 306 345 _c
432 345 _l
432 354 _l
432 395 418 427 391 450 _c
364 472 326 484 277 484 _c
245 484 215 480 185 472 _c
155 464 127 453 100 439 _c
100 522 _l
132 534 164 544 195 550 _c
226 556 256 560 286 560 _c
365 560 424 539 463 498 _c
502 457 522 395 522 312 _c
_cl}_e}_d
/c{{550 0 55 -13 488 560 _sc
488 526 _m
488 442 _l
462 456 437 466 411 473 _c
385 480 360 484 334 484 _c
276 484 230 465 198 428 _c
166 391 150 339 150 273 _c
150 206 166 154 198 117 _c
230 80 276 62 334 62 _c
360 62 385 65 411 72 _c
437 79 462 90 488 104 _c
488 21 _l
462 9 436 0 410 -5 _c
383 -10 354 -13 324 -13 _c
242 -13 176 12 128 64 _c
}_e{79 115 55 185 55 273 _c
55 362 79 432 128 483 _c
177 534 244 560 330 560 _c
358 560 385 557 411 551 _c
437 545 463 537 488 526 _c
_cl}_e}_d
/d{{635 0 55 -13 544 760 _sc
454 464 _m
454 760 _l
544 760 _l
544 0 _l
454 0 _l
454 82 _l
435 49 411 25 382 10 _c
353 -5 319 -13 279 -13 _c
213 -13 159 13 117 65 _c
75 117 55 187 55 273 _c
55 359 75 428 117 481 _c
159 533 213 560 279 560 _c
319 560 353 552 382 536 _c
411 520 435 496 454 464 _c
148 273 _m
148 207 161 155 188 117 _c
215 79 253 61 301 61 _c
}_e{348 61 385 79 413 117 _c
440 155 454 207 454 273 _c
454 339 440 390 413 428 _c
385 466 348 485 301 485 _c
253 485 215 466 188 428 _c
161 390 148 339 148 273 _c
_cl}_e}_d
/e{{615 0 55 -13 562 560 _sc
562 296 _m
562 252 _l
149 252 _l
153 190 171 142 205 110 _c
238 78 284 62 344 62 _c
378 62 412 66 444 74 _c
476 82 509 95 541 113 _c
541 28 _l
509 14 476 3 442 -3 _c
408 -9 373 -13 339 -13 _c
251 -13 182 12 131 62 _c
80 112 55 181 55 268 _c
55 357 79 428 127 481 _c
175 533 241 560 323 560 _c
397 560 455 536 498 489 _c
}_e{540 441 562 377 562 296 _c
472 322 _m
471 371 457 410 431 440 _c
404 469 368 484 324 484 _c
274 484 234 469 204 441 _c
174 413 156 373 152 322 _c
472 322 _l
_cl}_e}_d
/f{352 0 23 0 371 760 _sc
371 760 _m
371 685 _l
285 685 _l
253 685 230 678 218 665 _c
205 652 199 629 199 595 _c
199 547 _l
347 547 _l
347 477 _l
199 477 _l
199 0 _l
109 0 _l
109 477 _l
23 477 _l
23 547 _l
109 547 _l
109 585 _l
109 645 123 690 151 718 _c
179 746 224 760 286 760 _c
371 760 _l
_cl}_d
/g{{635 0 55 -207 544 560 _sc
454 280 _m
454 344 440 395 414 431 _c
387 467 349 485 301 485 _c
253 485 215 467 188 431 _c
161 395 148 344 148 280 _c
148 215 161 165 188 129 _c
215 93 253 75 301 75 _c
349 75 387 93 414 129 _c
440 165 454 215 454 280 _c
544 68 _m
544 -24 523 -93 482 -139 _c
440 -184 377 -207 292 -207 _c
260 -207 231 -204 203 -200 _c
175 -195 147 -188 121 -178 _c
}_e{121 -91 _l
147 -105 173 -115 199 -122 _c
225 -129 251 -133 278 -133 _c
336 -133 380 -117 410 -87 _c
439 -56 454 -10 454 52 _c
454 96 _l
435 64 411 40 382 24 _c
353 8 319 0 279 0 _c
211 0 157 25 116 76 _c
75 127 55 195 55 280 _c
55 364 75 432 116 483 _c
157 534 211 560 279 560 _c
319 560 353 552 382 536 _c
411 520 435 496 454 464 _c
454 547 _l
544 547 _l
}_e{544 68 _l
_cl}_e}_d
/h{634 0 91 0 549 760 _sc
549 330 _m
549 0 _l
459 0 _l
459 327 _l
459 379 448 417 428 443 _c
408 469 378 482 338 482 _c
289 482 251 466 223 435 _c
195 404 181 362 181 309 _c
181 0 _l
91 0 _l
91 760 _l
181 760 _l
181 462 _l
202 494 227 519 257 535 _c
286 551 320 560 358 560 _c
420 560 468 540 500 501 _c
532 462 549 405 549 330 _c
_cl}_d
/i{278 0 94 0 184 760 _sc
94 547 _m
184 547 _l
184 0 _l
94 0 _l
94 547 _l
94 760 _m
184 760 _l
184 646 _l
94 646 _l
94 760 _l
_cl}_d
/l{278 0 94 0 184 760 _sc
94 760 _m
184 760 _l
184 0 _l
94 0 _l
94 760 _l
_cl}_d
/m{{974 0 91 0 889 560 _sc
520 442 _m
542 482 569 511 600 531 _c
631 550 668 560 711 560 _c
767 560 811 540 842 500 _c
873 460 889 403 889 330 _c
889 0 _l
799 0 _l
799 327 _l
799 379 789 418 771 444 _c
752 469 724 482 686 482 _c
639 482 602 466 575 435 _c
548 404 535 362 535 309 _c
535 0 _l
445 0 _l
445 327 _l
445 379 435 418 417 444 _c
398 469 369 482 331 482 _c
}_e{285 482 248 466 221 435 _c
194 404 181 362 181 309 _c
181 0 _l
91 0 _l
91 547 _l
181 547 _l
181 462 _l
201 495 226 520 255 536 _c
283 552 317 560 357 560 _c
397 560 430 550 458 530 _c
486 510 506 480 520 442 _c
_cl}_e}_d
/n{634 0 91 0 549 560 _sc
549 330 _m
549 0 _l
459 0 _l
459 327 _l
459 379 448 417 428 443 _c
408 469 378 482 338 482 _c
289 482 251 466 223 435 _c
195 404 181 362 181 309 _c
181 0 _l
91 0 _l
91 547 _l
181 547 _l
181 462 _l
202 494 227 519 257 535 _c
286 551 320 560 358 560 _c
420 560 468 540 500 501 _c
532 462 549 405 549 330 _c
_cl}_d
/p{{635 0 91 -207 580 560 _sc
181 82 _m
181 -207 _l
91 -207 _l
91 547 _l
181 547 _l
181 464 _l
199 496 223 520 252 536 _c
281 552 316 560 356 560 _c
422 560 476 533 518 481 _c
559 428 580 359 580 273 _c
580 187 559 117 518 65 _c
476 13 422 -13 356 -13 _c
316 -13 281 -5 252 10 _c
223 25 199 49 181 82 _c
487 273 _m
487 339 473 390 446 428 _c
418 466 381 485 334 485 _c
}_e{286 485 249 466 222 428 _c
194 390 181 339 181 273 _c
181 207 194 155 222 117 _c
249 79 286 61 334 61 _c
381 61 418 79 446 117 _c
473 155 487 207 487 273 _c
_cl}_e}_d
/r{411 0 91 0 411 560 _sc
411 463 _m
401 469 390 473 378 476 _c
366 478 353 480 339 480 _c
288 480 249 463 222 430 _c
194 397 181 350 181 288 _c
181 0 _l
91 0 _l
91 547 _l
181 547 _l
181 462 _l
199 495 224 520 254 536 _c
284 552 321 560 365 560 _c
371 560 378 559 386 559 _c
393 558 401 557 411 555 _c
411 463 _l
_cl}_d
/s{{521 0 54 -13 472 560 _sc
443 531 _m
443 446 _l
417 458 391 468 364 475 _c
336 481 308 485 279 485 _c
234 485 200 478 178 464 _c
156 450 145 430 145 403 _c
145 382 153 366 169 354 _c
185 342 217 330 265 320 _c
296 313 _l
360 299 405 279 432 255 _c
458 230 472 195 472 151 _c
472 100 452 60 412 31 _c
372 1 316 -13 246 -13 _c
216 -13 186 -10 154 -5 _c
}_e{122 0 89 8 54 20 _c
54 113 _l
87 95 120 82 152 74 _c
184 65 216 61 248 61 _c
290 61 323 68 346 82 _c
368 96 380 117 380 144 _c
380 168 371 187 355 200 _c
339 213 303 226 247 238 _c
216 245 _l
160 257 119 275 95 299 _c
70 323 58 356 58 399 _c
58 450 76 490 112 518 _c
148 546 200 560 268 560 _c
301 560 332 557 362 552 _c
391 547 418 540 443 531 _c
}_e{_cl}_e}_d
/t{392 0 27 0 368 702 _sc
183 702 _m
183 547 _l
368 547 _l
368 477 _l
183 477 _l
183 180 _l
183 135 189 106 201 94 _c
213 81 238 75 276 75 _c
368 75 _l
368 0 _l
276 0 _l
206 0 158 13 132 39 _c
106 65 93 112 93 180 _c
93 477 _l
27 477 _l
27 547 _l
93 547 _l
93 702 _l
183 702 _l
_cl}_d
/u{634 0 85 -13 543 560 _sc
85 216 _m
85 547 _l
175 547 _l
175 219 _l
175 167 185 129 205 103 _c
225 77 255 64 296 64 _c
344 64 383 79 411 110 _c
439 141 453 183 453 237 _c
453 547 _l
543 547 _l
543 0 _l
453 0 _l
453 84 _l
431 50 405 26 377 10 _c
348 -5 315 -13 277 -13 _c
214 -13 166 6 134 45 _c
101 83 85 140 85 216 _c
311 560 _m
311 560 _l
_cl}_d
/v{592 0 30 0 562 547 _sc
30 547 _m
125 547 _l
296 88 _l
467 547 _l
562 547 _l
357 0 _l
235 0 _l
30 547 _l
_cl}_d
/w{818 0 42 0 776 547 _sc
42 547 _m
132 547 _l
244 120 _l
356 547 _l
462 547 _l
574 120 _l
686 547 _l
776 547 _l
633 0 _l
527 0 _l
409 448 _l
291 0 _l
185 0 _l
42 547 _l
_cl}_d
end readonly def

/BuildGlyph
 {exch begin
 CharStrings exch
 2 copy known not{pop /.notdef}if
 true 3 1 roll get exec
 end}_d

/BuildChar {
 1 index /Encoding get exch get
 1 index /BuildGlyph get exec
}_d

FontName currentdict end definefont pop
end
%%EndProlog
mpldict begin
75.6 223.2 translate
460.8 345.6 0 0 clipbox
gsave
0 0 m
460.8 0 l
460.8 345.6 l
0 345.6 l
cl
1.000 setgray
fill
grestore
gsave
57.6 38.016 m
414.72 38.016 l
414.72 304.128 l
57.6 304.128 l
cl
1.000 setgray
fill
grestore
gsave
357.1 266.1 57.6 38.02 clipbox
78.006857 38.016 m
88.210286 38.016 l
88.210286 38.016 l
78.006857 38.016 l
cl
1.000 0.000 0.000 setrgbcolor
fill
grestore
gsave
357.1 266.1 57.6 38.02 clipbox
90.761143 38.016 m
100.964571 38.016 l
100.964571 38.016 l
90.761143 38.016 l
cl
1.000 0.000 0.000 setrgbcolor
fill
grestore
gsave
357.1 266.1 57.6 38.02 clipbox
103.515429 38.016 m
113.718857 38.016 l
113.718857 38.016 l
103.515429 38.016 l
cl
1.000 0.000 0.000 setrgbcolor
fill
grestore
gsave
357.1 266.1 57.6 38.02 clipbox
116.269714 38.016 m
126.473143 38.016 l
126.473143 38.016 l
116.269714 38.016 l
cl
1.000 0.000 0.000 setrgbcolor
fill
grestore
gsave
357.1 266.1 57.6 38.02 clipbox
129.024 38.016 m
139.227429 38.016 l
139.227429 38.016 l
129.024 38.016 l
cl
1.000 0.000 0.000 setrgbcolor
fill
grestore
gsave
357.1 266.1 57.6 38.02 clipbox
141.778286 38.016 m
151.981714 38.016 l
151.981714 38.016 l
141.778286 38.016 l
cl
1.000 0.000 0.000 setrgbcolor
fill
grestore
gsave
357.1 266.1 57.6 38.02 clipbox
154.532571 38.016 m
164.736 38.016 l
164.736 38.016 l
154.532571 38.016 l
cl
1.000 0.000 0.000 setrgbcolor
fill
grestore
gsave
357.1 266.1 57.6 38.02 clipbox
167.286857 38.016 m
177.490286 38.016 l
177.490286 65.185211 l
167.286857 65.185211 l
cl
1.000 0.000 0.000 setrgbcolor
fill
grestore
gsave
357.1 266.1 57.6 38.02 clipbox
180.041143 38.016 m
190.244571 38.016 l
190.244571 65.185211 l
180.041143 65.185211 l
cl
1.000 0.000 0.000 setrgbcolor
fill
grestore
gsave
357.1 266.1 57.6 38.02 clipbox
192.795429 38.016 m
202.998857 38.016 l
202.998857 76.052896 l
192.795429 76.052896 l
cl
1.000 0.000 0.000 setrgbcolor
fill
grestore
gsave
357.1 266.1 57.6 38.02 clipbox
205.549714 38.016 m
215.753143 38.016 l
215.753143 38.016 l
205.549714 38.016 l
cl
1.000 0.000 0.000 setrgbcolor
fill
grestore
gsave
357.1 266.1 57.6 38.02 clipbox
218.304 38.016 m
228.507429 38.016 l
228.507429 38.016 l
218.304 38.016 l
cl
1.000 0.000 0.000 setrgbcolor
fill
grestore
gsave
357.1 266.1 57.6 38.02 clipbox
231.058286 38.016 m
241.261714 38.016 l
241.261714 38.016 l
231.058286 38.016 l
cl
1.000 0.000 0.000 setrgbcolor
fill
grestore
gsave
357.1 266.1 57.6 38.02 clipbox
243.812571 38.016 m
254.016 38.016 l
254.016 38.016 l
243.812571 38.016 l
cl
1.000 0.000 0.000 setrgbcolor
fill
grestore
gsave
357.1 266.1 57.6 38.02 clipbox
256.566857 38.016 m
266.770286 38.016 l
266.770286 38.016 l
256.566857 38.016 l
cl
1.000 0.000 0.000 setrgbcolor
fill
grestore
gsave
357.1 266.1 57.6 38.02 clipbox
269.321143 38.016 m
279.524571 38.016 l
279.524571 38.016 l
269.321143 38.016 l
cl
1.000 0.000 0.000 setrgbcolor
fill
grestore
gsave
357.1 266.1 57.6 38.02 clipbox
282.075429 38.016 m
292.278857 38.016 l
292.278857 38.016 l
282.075429 38.016 l
cl
1.000 0.000 0.000 setrgbcolor
fill
grestore
gsave
357.1 266.1 57.6 38.02 clipbox
294.829714 38.016 m
305.033143 38.016 l
305.033143 38.016 l
294.829714 38.016 l
cl
1.000 0.000 0.000 setrgbcolor
fill
grestore
gsave
357.1 266.1 57.6 38.02 clipbox
307.584 38.016 m
317.787429 38.016 l
317.787429 38.016 l
307.584 38.016 l
cl
1.000 0.000 0.000 setrgbcolor
fill
grestore
gsave
357.1 266.1 57.6 38.02 clipbox
320.338286 38.016 m
330.541714 38.016 l
330.541714 38.016 l
320.338286 38.016 l
cl
1.000 0.000 0.000 setrgbcolor
fill
grestore
gsave
357.1 266.1 57.6 38.02 clipbox
333.092571 38.016 m
343.296 38.016 l
343.296 70.619054 l
333.092571 70.619054 l
cl
1.000 0.000 0.000 setrgbcolor
fill
grestore
gsave
357.1 266.1 57.6 38.02 clipbox
345.846857 38.016 m
356.050286 38.016 l
356.050286 70.619054 l
345.846857 70.619054 l
cl
1.000 0.000 0.000 setrgbcolor
fill
grestore
gsave
357.1 266.1 57.6 38.02 clipbox
358.601143 38.016 m
368.804571 38.016 l
368.804571 81.486738 l
358.601143 81.486738 l
cl
1.000 0.000 0.000 setrgbcolor
fill
grestore
gsave
357.1 266.1 57.6 38.02 clipbox
371.355429 38.016 m
381.558857 38.016 l
381.558857 48.883685 l
371.355429 48.883685 l
cl
1.000 0.000 0.000 setrgbcolor
fill
grestore
gsave
357.1 266.1 57.6 38.02 clipbox
78.006857 38.016 m
88.210286 38.016 l
88.210286 51.053869 l
78.006857 51.053869 l
cl
1.000 0.647 0.000 setrgbcolor
fill
grestore
gsave
357.1 266.1 57.6 38.02 clipbox
90.761143 38.016 m
100.964571 38.016 l
100.964571 51.052801 l
90.761143 51.052801 l
cl
1.000 0.647 0.000 setrgbcolor
fill
grestore
gsave
357.1 266.1 57.6 38.02 clipbox
103.515429 38.016 m
113.718857 38.016 l
113.718857 51.051421 l
103.515429 51.051421 l
cl
1.000 0.647 0.000 setrgbcolor
fill
grestore
gsave
357.1 266.1 57.6 38.02 clipbox
116.269714 38.016 m
126.473143 38.016 l
126.473143 51.050943 l
116.269714 51.050943 l
cl
1.000 0.647 0.000 setrgbcolor
fill
grestore
gsave
357.1 266.1 57.6 38.02 clipbox
129.024 38.016 m
139.227429 38.016 l
139.227429 51.052265 l
129.024 51.052265 l
cl
1.000 0.647 0.000 setrgbcolor
fill
grestore
gsave
357.1 266.1 57.6 38.02 clipbox
141.778286 38.016 m
151.981714 38.016 l
151.981714 51.055397 l
141.778286 51.055397 l
cl
1.000 0.647 0.000 setrgbcolor
fill
grestore
gsave
357.1 266.1 57.6 38.02 clipbox
154.532571 38.016 m
164.736 38.016 l
164.736 51.059542 l
154.532571 51.059542 l
cl
1.000 0.647 0.000 setrgbcolor
fill
grestore
gsave
357.1 266.1 57.6 38.02 clipbox
167.286857 65.185211 m
177.490286 65.185211 l
177.490286 78.232701 l
167.286857 78.232701 l
cl
1.000 0.647 0.000 setrgbcolor
fill
grestore
gsave
357.1 266.1 57.6 38.02 clipbox
180.041143 65.185211 m
190.244571 65.185211 l
190.244571 78.235292 l
180.041143 78.235292 l
cl
1.000 0.647 0.000 setrgbcolor
fill
grestore
gsave
357.1 266.1 57.6 38.02 clipbox
192.795429 76.052896 m
202.998857 76.052896 l
202.998857 89.103555 l
192.795429 89.103555 l
cl
1.000 0.647 0.000 setrgbcolor
fill
grestore
gsave
357.1 266.1 57.6 38.02 clipbox
205.549714 38.016 m
215.753143 38.016 l
215.753143 51.065369 l
205.549714 51.065369 l
cl
1.000 0.647 0.000 setrgbcolor
fill
grestore
gsave
357.1 266.1 57.6 38.02 clipbox
218.304 38.016 m
228.507429 38.016 l
228.507429 51.06315 l
218.304 51.06315 l
cl
1.000 0.647 0.000 setrgbcolor
fill
grestore
gsave
357.1 266.1 57.6 38.02 clipbox
231.058286 38.016 m
241.261714 38.016 l
241.261714 51.061316 l
231.058286 51.061316 l
cl
1.000 0.647 0.000 setrgbcolor
fill
grestore
gsave
357.1 266.1 57.6 38.02 clipbox
243.812571 38.016 m
254.016 38.016 l
254.016 51.060825 l
243.812571 51.060825 l
cl
1.000 0.647 0.000 setrgbcolor
fill
grestore
gsave
357.1 266.1 57.6 38.02 clipbox
256.566857 38.016 m
266.770286 38.016 l
266.770286 51.061574 l
256.566857 51.061574 l
cl
1.000 0.647 0.000 setrgbcolor
fill
grestore
gsave
357.1 266.1 57.6 38.02 clipbox
269.321143 38.016 m
279.524571 38.016 l
279.524571 51.062199 l
269.321143 51.062199 l
cl
1.000 0.647 0.000 setrgbcolor
fill
grestore
gsave
357.1 266.1 57.6 38.02 clipbox
282.075429 38.016 m
292.278857 38.016 l
292.278857 51.060752 l
282.075429 51.060752 l
cl
1.000 0.647 0.000 setrgbcolor
fill
grestore
gsave
357.1 266.1 57.6 38.02 clipbox
294.829714 38.016 m
305.033143 38.016 l
305.033143 51.056162 l
294.829714 51.056162 l
cl
1.000 0.647 0.000 setrgbcolor
fill
grestore
gsave
357.1 266.1 57.6 38.02 clipbox
307.584 38.016 m
317.787429 38.016 l
317.787429 51.049787 l
307.584 51.049787 l
cl
1.000 0.647 0.000 setrgbcolor
fill
grestore
gsave
357.1 266.1 57.6 38.02 clipbox
320.338286 38.016 m
330.541714 38.016 l
330.541714 51.045917 l
320.338286 51.045917 l
cl
1.000 0.647 0.000 setrgbcolor
fill
grestore
gsave
357.1 266.1 57.6 38.02 clipbox
333.092571 70.619054 m
343.296 70.619054 l
343.296 83.651916 l
333.092571 83.651916 l
cl
1.000 0.647 0.000 setrgbcolor
fill
grestore
gsave
357.1 266.1 57.6 38.02 clipbox
345.846857 70.619054 m
356.050286 70.619054 l
356.050286 83.650362 l
345.846857 83.650362 l
cl
1.000 0.647 0.000 setrgbcolor
fill
grestore
gsave
357.1 266.1 57.6 38.02 clipbox
358.601143 81.486738 m
368.804571 81.486738 l
368.804571 94.52859 l
358.601143 94.52859 l
cl
1.000 0.647 0.000 setrgbcolor
fill
grestore
gsave
357.1 266.1 57.6 38.02 clipbox
371.355429 48.883685 m
381.558857 48.883685 l
381.558857 61.923155 l
371.355429 61.923155 l
cl
1.000 0.647 0.000 setrgbcolor
fill
grestore
gsave
357.1 266.1 57.6 38.02 clipbox
78.006857 51.053869 m
88.210286 51.053869 l
88.210286 51.053869 l
78.006857 51.053869 l
cl
1.000 1.000 0.000 setrgbcolor
fill
grestore
gsave
357.1 266.1 57.6 38.02 clipbox
90.761143 51.052801 m
100.964571 51.052801 l
100.964571 51.052801 l
90.761143 51.052801 l
cl
1.000 1.000 0.000 setrgbcolor
fill
grestore
gsave
357.1 266.1 57.6 38.02 clipbox
103.515429 51.051421 m
113.718857 51.051421 l
113.718857 51.051421 l
103.515429 51.051421 l
cl
1.000 1.000 0.000 setrgbcolor
fill
grestore
gsave
357.1 266.1 57.6 38.02 clipbox
116.269714 51.050943 m
126.473143 51.050943 l
126.473143 51.050943 l
116.269714 51.050943 l
cl
1.000 1.000 0.000 setrgbcolor
fill
grestore
gsave
357.1 266.1 57.6 38.02 clipbox
129.024 51.052265 m
139.227429 51.052265 l
139.227429 51.052265 l
129.024 51.052265 l
cl
1.000 1.000 0.000 setrgbcolor
fill
grestore
gsave
357.1 266.1 57.6 38.02 clipbox
141.778286 51.055397 m
151.981714 51.055397 l
151.981714 51.055397 l
141.778286 51.055397 l
cl
1.000 1.000 0.000 setrgbcolor
fill
grestore
gsave
357.1 266.1 57.6 38.02 clipbox
154.532571 51.059542 m
164.736 51.059542 l
164.736 51.059542 l
154.532571 51.059542 l
cl
1.000 1.000 0.000 setrgbcolor
fill
grestore
gsave
357.1 266.1 57.6 38.02 clipbox
167.286857 78.232701 m
177.490286 78.232701 l
177.490286 78.232701 l
167.286857 78.232701 l
cl
1.000 1.000 0.000 setrgbcolor
fill
grestore
gsave
357.1 266.1 57.6 38.02 clipbox
180.041143 78.235292 m
190.244571 78.235292 l
190.244571 78.235292 l
180.041143 78.235292 l
cl
1.000 1.000 0.000 setrgbcolor
fill
grestore
gsave
357.1 266.1 57.6 38.02 clipbox
192.795429 89.103555 m
202.998857 89.103555 l
202.998857 89.103555 l
192.795429 89.103555 l
cl
1.000 1.000 0.000 setrgbcolor
fill
grestore
gsave
357.1 266.1 57.6 38.02 clipbox
205.549714 51.065369 m
215.753143 51.065369 l
215.753143 51.065369 l
205.549714 51.065369 l
cl
1.000 1.000 0.000 setrgbcolor
fill
grestore
gsave
357.1 266.1 57.6 38.02 clipbox
218.304 51.06315 m
228.507429 51.06315 l
228.507429 51.06315 l
218.304 51.06315 l
cl
1.000 1.000 0.000 setrgbcolor
fill
grestore
gsave
357.1 266.1 57.6 38.02 clipbox
231.058286 51.061316 m
241.261714 51.061316 l
241.261714 51.061316 l
231.058286 51.061316 l
cl
1.000 1.000 0.000 setrgbcolor
fill
grestore
gsave
357.1 266.1 57.6 38.02 clipbox
243.812571 51.060825 m
254.016 51.060825 l
254.016 51.060825 l
243.812571 51.060825 l
cl
1.000 1.000 0.000 setrgbcolor
fill
grestore
gsave
357.1 266.1 57.6 38.02 clipbox
256.566857 51.061574 m
266.770286 51.061574 l
266.770286 51.061574 l
256.566857 51.061574 l
cl
1.000 1.000 0.000 setrgbcolor
fill
grestore
gsave
357.1 266.1 57.6 38.02 clipbox
269.321143 51.062199 m
279.524571 51.062199 l
279.524571 51.062199 l
269.321143 51.062199 l
cl
1.000 1.000 0.000 setrgbcolor
fill
grestore
gsave
357.1 266.1 57.6 38.02 clipbox
282.075429 51.060752 m
292.278857 51.060752 l
292.278857 51.060752 l
282.075429 51.060752 l
cl
1.000 1.000 0.000 setrgbcolor
fill
grestore
gsave
357.1 266.1 57.6 38.02 clipbox
294.829714 51.056162 m
305.033143 51.056162 l
305.033143 72.791389 l
294.829714 72.791389 l
cl
1.000 1.000 0.000 setrgbcolor
fill
grestore
gsave
357.1 266.1 57.6 38.02 clipbox
307.584 51.049787 m
317.787429 51.049787 l
317.787429 72.785014 l
307.584 72.785014 l
cl
1.000 1.000 0.000 setrgbcolor
fill
grestore
gsave
357.1 266.1 57.6 38.02 clipbox
320.338286 51.045917 m
330.541714 51.045917 l
330.541714 72.781144 l
320.338286 72.781144 l
cl
1.000 1.000 0.000 setrgbcolor
fill
grestore
gsave
357.1 266.1 57.6 38.02 clipbox
333.092571 83.651916 m
343.296 83.651916 l
343.296 105.387142 l
333.092571 105.387142 l
cl
1.000 1.000 0.000 setrgbcolor
fill
grestore
gsave
357.1 266.1 57.6 38.02 clipbox
345.846857 83.650362 m
356.050286 83.650362 l
356.050286 105.385589 l
345.846857 105.385589 l
cl
1.000 1.000 0.000 setrgbcolor
fill
grestore
gsave
357.1 266.1 57.6 38.02 clipbox
358.601143 94.52859 m
368.804571 94.52859 l
368.804571 116.263817 l
358.601143 116.263817 l
cl
1.000 1.000 0.000 setrgbcolor
fill
grestore
gsave
357.1 266.1 57.6 38.02 clipbox
371.355429 61.923155 m
381.558857 61.923155 l
381.558857 61.923155 l
371.355429 61.923155 l
cl
1.000 1.000 0.000 setrgbcolor
fill
grestore
gsave
357.1 266.1 57.6 38.02 clipbox
78.006857 51.053869 m
88.210286 51.053869 l
88.210286 110.332149 l
78.006857 110.332149 l
cl
0.502 0.000 0.502 setrgbcolor
fill
grestore
gsave
357.1 266.1 57.6 38.02 clipbox
90.761143 51.052801 m
100.964571 51.052801 l
100.964571 110.33108 l
90.761143 110.33108 l
cl
0.502 0.000 0.502 setrgbcolor
fill
grestore
gsave
357.1 266.1 57.6 38.02 clipbox
103.515429 51.051421 m
113.718857 51.051421 l
113.718857 110.3297 l
103.515429 110.3297 l
cl
0.502 0.000 0.502 setrgbcolor
fill
grestore
gsave
357.1 266.1 57.6 38.02 clipbox
116.269714 51.050943 m
126.473143 51.050943 l
126.473143 110.329222 l
116.269714 110.329222 l
cl
0.502 0.000 0.502 setrgbcolor
fill
grestore
gsave
357.1 266.1 57.6 38.02 clipbox
129.024 51.052265 m
139.227429 51.052265 l
139.227429 110.330545 l
129.024 110.330545 l
cl
0.502 0.000 0.502 setrgbcolor
fill
grestore
gsave
357.1 266.1 57.6 38.02 clipbox
141.778286 51.055397 m
151.981714 51.055397 l
151.981714 51.055397 l
141.778286 51.055397 l
cl
0.502 0.000 0.502 setrgbcolor
fill
grestore
gsave
357.1 266.1 57.6 38.02 clipbox
154.532571 51.059542 m
164.736 51.059542 l
164.736 51.059542 l
154.532571 51.059542 l
cl
0.502 0.000 0.502 setrgbcolor
fill
grestore
gsave
357.1 266.1 57.6 38.02 clipbox
167.286857 78.232701 m
177.490286 78.232701 l
177.490286 78.232701 l
167.286857 78.232701 l
cl
0.502 0.000 0.502 setrgbcolor
fill
grestore
gsave
357.1 266.1 57.6 38.02 clipbox
180.041143 78.235292 m
190.244571 78.235292 l
190.244571 78.235292 l
180.041143 78.235292 l
cl
0.502 0.000 0.502 setrgbcolor
fill
grestore
gsave
357.1 266.1 57.6 38.02 clipbox
192.795429 89.103555 m
202.998857 89.103555 l
202.998857 89.103555 l
192.795429 89.103555 l
cl
0.502 0.000 0.502 setrgbcolor
fill
grestore
gsave
357.1 266.1 57.6 38.02 clipbox
205.549714 51.065369 m
215.753143 51.065369 l
215.753143 51.065369 l
205.549714 51.065369 l
cl
0.502 0.000 0.502 setrgbcolor
fill
grestore
gsave
357.1 266.1 57.6 38.02 clipbox
218.304 51.06315 m
228.507429 51.06315 l
228.507429 51.06315 l
218.304 51.06315 l
cl
0.502 0.000 0.502 setrgbcolor
fill
grestore
gsave
357.1 266.1 57.6 38.02 clipbox
231.058286 51.061316 m
241.261714 51.061316 l
241.261714 51.061316 l
231.058286 51.061316 l
cl
0.502 0.000 0.502 setrgbcolor
fill
grestore
gsave
357.1 266.1 57.6 38.02 clipbox
243.812571 51.060825 m
254.016 51.060825 l
254.016 51.060825 l
243.812571 51.060825 l
cl
0.502 0.000 0.502 setrgbcolor
fill
grestore
gsave
357.1 266.1 57.6 38.02 clipbox
256.566857 51.061574 m
266.770286 51.061574 l
266.770286 51.061574 l
256.566857 51.061574 l
cl
0.502 0.000 0.502 setrgbcolor
fill
grestore
gsave
357.1 266.1 57.6 38.02 clipbox
269.321143 51.062199 m
279.524571 51.062199 l
279.524571 51.062199 l
269.321143 51.062199 l
cl
0.502 0.000 0.502 setrgbcolor
fill
grestore
gsave
357.1 266.1 57.6 38.02 clipbox
282.075429 51.060752 m
292.278857 51.060752 l
292.278857 51.060752 l
282.075429 51.060752 l
cl
0.502 0.000 0.502 setrgbcolor
fill
grestore
gsave
357.1 266.1 57.6 38.02 clipbox
294.829714 72.791389 m
305.033143 72.791389 l
305.033143 72.791389 l
294.829714 72.791389 l
cl
0.502 0.000 0.502 setrgbcolor
fill
grestore
gsave
357.1 266.1 57.6 38.02 clipbox
307.584 72.785014 m
317.787429 72.785014 l
317.787429 132.063293 l
307.584 132.063293 l
cl
0.502 0.000 0.502 setrgbcolor
fill
grestore
gsave
357.1 266.1 57.6 38.02 clipbox
320.338286 72.781144 m
330.541714 72.781144 l
330.541714 132.059423 l
320.338286 132.059423 l
cl
0.502 0.000 0.502 setrgbcolor
fill
grestore
gsave
357.1 266.1 57.6 38.02 clipbox
333.092571 105.387142 m
343.296 105.387142 l
343.296 164.665422 l
333.092571 164.665422 l
cl
0.502 0.000 0.502 setrgbcolor
fill
grestore
gsave
357.1 266.1 57.6 38.02 clipbox
345.846857 105.385589 m
356.050286 105.385589 l
356.050286 164.663868 l
345.846857 164.663868 l
cl
0.502 0.000 0.502 setrgbcolor
fill
grestore
gsave
357.1 266.1 57.6 38.02 clipbox
358.601143 116.263817 m
368.804571 116.263817 l
368.804571 175.542096 l
358.601143 175.542096 l
cl
0.502 0.000 0.502 setrgbcolor
fill
grestore
gsave
357.1 266.1 57.6 38.02 clipbox
371.355429 61.923155 m
381.558857 61.923155 l
381.558857 121.201434 l
371.355429 121.201434 l
cl
0.502 0.000 0.502 setrgbcolor
fill
grestore
gsave
357.1 266.1 57.6 38.02 clipbox
78.006857 110.332149 m
88.210286 110.332149 l
88.210286 110.332149 l
78.006857 110.332149 l
cl
1.000 0.000 1.000 setrgbcolor
fill
grestore
gsave
357.1 266.1 57.6 38.02 clipbox
90.761143 110.33108 m
100.964571 110.33108 l
100.964571 110.33108 l
90.761143 110.33108 l
cl
1.000 0.000 1.000 setrgbcolor
fill
grestore
gsave
357.1 266.1 57.6 38.02 clipbox
103.515429 110.3297 m
113.718857 110.3297 l
113.718857 110.3297 l
103.515429 110.3297 l
cl
1.000 0.000 1.000 setrgbcolor
fill
grestore
gsave
357.1 266.1 57.6 38.02 clipbox
116.269714 110.329222 m
126.473143 110.329222 l
126.473143 110.329222 l
116.269714 110.329222 l
cl
1.000 0.000 1.000 setrgbcolor
fill
grestore
gsave
357.1 266.1 57.6 38.02 clipbox
129.024 110.330545 m
139.227429 110.330545 l
139.227429 110.330545 l
129.024 110.330545 l
cl
1.000 0.000 1.000 setrgbcolor
fill
grestore
gsave
357.1 266.1 57.6 38.02 clipbox
141.778286 51.055397 m
151.981714 51.055397 l
151.981714 51.055397 l
141.778286 51.055397 l
cl
1.000 0.000 1.000 setrgbcolor
fill
grestore
gsave
357.1 266.1 57.6 38.02 clipbox
154.532571 51.059542 m
164.736 51.059542 l
164.736 51.059542 l
154.532571 51.059542 l
cl
1.000 0.000 1.000 setrgbcolor
fill
grestore
gsave
357.1 266.1 57.6 38.02 clipbox
167.286857 78.232701 m
177.490286 78.232701 l
177.490286 78.232701 l
167.286857 78.232701 l
cl
1.000 0.000 1.000 setrgbcolor
fill
grestore
gsave
357.1 266.1 57.6 38.02 clipbox
180.041143 78.235292 m
190.244571 78.235292 l
190.244571 78.235292 l
180.041143 78.235292 l
cl
1.000 0.000 1.000 setrgbcolor
fill
grestore
gsave
357.1 266.1 57.6 38.02 clipbox
192.795429 89.103555 m
202.998857 89.103555 l
202.998857 89.103555 l
192.795429 89.103555 l
cl
1.000 0.000 1.000 setrgbcolor
fill
grestore
gsave
357.1 266.1 57.6 38.02 clipbox
205.549714 51.065369 m
215.753143 51.065369 l
215.753143 51.065369 l
205.549714 51.065369 l
cl
1.000 0.000 1.000 setrgbcolor
fill
grestore
gsave
357.1 266.1 57.6 38.02 clipbox
218.304 51.06315 m
228.507429 51.06315 l
228.507429 51.06315 l
218.304 51.06315 l
cl
1.000 0.000 1.000 setrgbcolor
fill
grestore
gsave
357.1 266.1 57.6 38.02 clipbox
231.058286 51.061316 m
241.261714 51.061316 l
241.261714 138.002792 l
231.058286 138.002792 l
cl
1.000 0.000 1.000 setrgbcolor
fill
grestore
gsave
357.1 266.1 57.6 38.02 clipbox
243.812571 51.060825 m
254.016 51.060825 l
254.016 138.002301 l
243.812571 138.002301 l
cl
1.000 0.000 1.000 setrgbcolor
fill
grestore
gsave
357.1 266.1 57.6 38.02 clipbox
256.566857 51.061574 m
266.770286 51.061574 l
266.770286 138.00305 l
256.566857 138.00305 l
cl
1.000 0.000 1.000 setrgbcolor
fill
grestore
gsave
357.1 266.1 57.6 38.02 clipbox
269.321143 51.062199 m
279.524571 51.062199 l
279.524571 138.003676 l
269.321143 138.003676 l
cl
1.000 0.000 1.000 setrgbcolor
fill
grestore
gsave
357.1 266.1 57.6 38.02 clipbox
282.075429 51.060752 m
292.278857 51.060752 l
292.278857 138.002229 l
282.075429 138.002229 l
cl
1.000 0.000 1.000 setrgbcolor
fill
grestore
gsave
357.1 266.1 57.6 38.02 clipbox
294.829714 72.791389 m
305.033143 72.791389 l
305.033143 159.732866 l
294.829714 159.732866 l
cl
1.000 0.000 1.000 setrgbcolor
fill
grestore
gsave
357.1 266.1 57.6 38.02 clipbox
307.584 132.063293 m
317.787429 132.063293 l
317.787429 219.00477 l
307.584 219.00477 l
cl
1.000 0.000 1.000 setrgbcolor
fill
grestore
gsave
357.1 266.1 57.6 38.02 clipbox
320.338286 132.059423 m
330.541714 132.059423 l
330.541714 219.000899 l
320.338286 219.000899 l
cl
1.000 0.000 1.000 setrgbcolor
fill
grestore
gsave
357.1 266.1 57.6 38.02 clipbox
333.092571 164.665422 m
343.296 164.665422 l
343.296 164.665422 l
333.092571 164.665422 l
cl
1.000 0.000 1.000 setrgbcolor
fill
grestore
gsave
357.1 266.1 57.6 38.02 clipbox
345.846857 164.663868 m
356.050286 164.663868 l
356.050286 164.663868 l
345.846857 164.663868 l
cl
1.000 0.000 1.000 setrgbcolor
fill
grestore
gsave
357.1 266.1 57.6 38.02 clipbox
358.601143 175.542096 m
368.804571 175.542096 l
368.804571 175.542096 l
358.601143 175.542096 l
cl
1.000 0.000 1.000 setrgbcolor
fill
grestore
gsave
357.1 266.1 57.6 38.02 clipbox
371.355429 121.201434 m
381.558857 121.201434 l
381.558857 121.201434 l
371.355429 121.201434 l
cl
1.000 0.000 1.000 setrgbcolor
fill
grestore
gsave
357.1 266.1 57.6 38.02 clipbox
78.006857 110.332149 m
88.210286 110.332149 l
88.210286 110.332149 l
78.006857 110.332149 l
cl
0.000 1.000 0.000 setrgbcolor
fill
grestore
gsave
357.1 266.1 57.6 38.02 clipbox
90.761143 110.33108 m
100.964571 110.33108 l
100.964571 110.33108 l
90.761143 110.33108 l
cl
0.000 1.000 0.000 setrgbcolor
fill
grestore
gsave
357.1 266.1 57.6 38.02 clipbox
103.515429 110.3297 m
113.718857 110.3297 l
113.718857 110.3297 l
103.515429 110.3297 l
cl
0.000 1.000 0.000 setrgbcolor
fill
grestore
gsave
357.1 266.1 57.6 38.02 clipbox
116.269714 110.329222 m
126.473143 110.329222 l
126.473143 110.329222 l
116.269714 110.329222 l
cl
0.000 1.000 0.000 setrgbcolor
fill
grestore
gsave
357.1 266.1 57.6 38.02 clipbox
129.024 110.330545 m
139.227429 110.330545 l
139.227429 110.330545 l
129.024 110.330545 l
cl
0.000 1.000 0.000 setrgbcolor
fill
grestore
gsave
357.1 266.1 57.6 38.02 clipbox
141.778286 51.055397 m
151.981714 51.055397 l
151.981714 51.055397 l
141.778286 51.055397 l
cl
0.000 1.000 0.000 setrgbcolor
fill
grestore
gsave
357.1 266.1 57.6 38.02 clipbox
154.532571 51.059542 m
164.736 51.059542 l
164.736 51.059542 l
154.532571 51.059542 l
cl
0.000 1.000 0.000 setrgbcolor
fill
grestore
gsave
357.1 266.1 57.6 38.02 clipbox
167.286857 78.232701 m
177.490286 78.232701 l
177.490286 78.232701 l
167.286857 78.232701 l
cl
0.000 1.000 0.000 setrgbcolor
fill
grestore
gsave
357.1 266.1 57.6 38.02 clipbox
180.041143 78.235292 m
190.244571 78.235292 l
190.244571 150.686522 l
180.041143 150.686522 l
cl
0.000 1.000 0.000 setrgbcolor
fill
grestore
gsave
357.1 266.1 57.6 38.02 clipbox
192.795429 89.103555 m
202.998857 89.103555 l
202.998857 161.554785 l
192.795429 161.554785 l
cl
0.000 1.000 0.000 setrgbcolor
fill
grestore
gsave
357.1 266.1 57.6 38.02 clipbox
205.549714 51.065369 m
215.753143 51.065369 l
215.753143 123.5166 l
205.549714 123.5166 l
cl
0.000 1.000 0.000 setrgbcolor
fill
grestore
gsave
357.1 266.1 57.6 38.02 clipbox
218.304 51.06315 m
228.507429 51.06315 l
228.507429 123.51438 l
218.304 123.51438 l
cl
0.000 1.000 0.000 setrgbcolor
fill
grestore
gsave
357.1 266.1 57.6 38.02 clipbox
231.058286 138.002792 m
241.261714 138.002792 l
241.261714 210.454023 l
231.058286 210.454023 l
cl
0.000 1.000 0.000 setrgbcolor
fill
grestore
gsave
357.1 266.1 57.6 38.02 clipbox
243.812571 138.002301 m
254.016 138.002301 l
254.016 210.453532 l
243.812571 210.453532 l
cl
0.000 1.000 0.000 setrgbcolor
fill
grestore
gsave
357.1 266.1 57.6 38.02 clipbox
256.566857 138.00305 m
266.770286 138.00305 l
266.770286 210.454281 l
256.566857 210.454281 l
cl
0.000 1.000 0.000 setrgbcolor
fill
grestore
gsave
357.1 266.1 57.6 38.02 clipbox
269.321143 138.003676 m
279.524571 138.003676 l
279.524571 210.454906 l
269.321143 210.454906 l
cl
0.000 1.000 0.000 setrgbcolor
fill
grestore
gsave
357.1 266.1 57.6 38.02 clipbox
282.075429 138.002229 m
292.278857 138.002229 l
292.278857 210.453459 l
282.075429 210.453459 l
cl
0.000 1.000 0.000 setrgbcolor
fill
grestore
gsave
357.1 266.1 57.6 38.02 clipbox
294.829714 159.732866 m
305.033143 159.732866 l
305.033143 232.184096 l
294.829714 232.184096 l
cl
0.000 1.000 0.000 setrgbcolor
fill
grestore
gsave
357.1 266.1 57.6 38.02 clipbox
307.584 219.00477 m
317.787429 219.00477 l
317.787429 291.456 l
307.584 291.456 l
cl
0.000 1.000 0.000 setrgbcolor
fill
grestore
gsave
357.1 266.1 57.6 38.02 clipbox
320.338286 219.000899 m
330.541714 219.000899 l
330.541714 291.45213 l
320.338286 291.45213 l
cl
0.000 1.000 0.000 setrgbcolor
fill
grestore
gsave
357.1 266.1 57.6 38.02 clipbox
333.092571 164.665422 m
343.296 164.665422 l
343.296 164.665422 l
333.092571 164.665422 l
cl
0.000 1.000 0.000 setrgbcolor
fill
grestore
gsave
357.1 266.1 57.6 38.02 clipbox
345.846857 164.663868 m
356.050286 164.663868 l
356.050286 164.663868 l
345.846857 164.663868 l
cl
0.000 1.000 0.000 setrgbcolor
fill
grestore
gsave
357.1 266.1 57.6 38.02 clipbox
358.601143 175.542096 m
368.804571 175.542096 l
368.804571 175.542096 l
358.601143 175.542096 l
cl
0.000 1.000 0.000 setrgbcolor
fill
grestore
gsave
357.1 266.1 57.6 38.02 clipbox
371.355429 121.201434 m
381.558857 121.201434 l
381.558857 121.201434 l
371.355429 121.201434 l
cl
0.000 1.000 0.000 setrgbcolor
fill
grestore
0.800 setlinewidth
1 setlinejoin
0 setlinecap
[] 0 setdash
0.000 setgray
gsave
/o {
gsave
newpath
translate
0.8 setlinewidth
1 setlinejoin
0 setlinecap
0 0 m
0 -3.5 l

gsave
0.000 setgray
fill
grestore
stroke
grestore
} bind def
83.1086 38.016 o
grestore
/DejaVuSans findfont
10.000 scalefont
setfont
gsave
79.928884 23.422250 translate
0.000000 rotate
0.000000 0.000000 m /zero glyphshow
grestore
gsave
/o {
gsave
newpath
translate
0.8 setlinewidth
1 setlinejoin
0 setlinecap
0 0 m
0 -3.5 l

gsave
0.000 setgray
fill
grestore
stroke
grestore
} bind def
146.88 38.016 o
grestore
gsave
143.700312 23.422250 translate
0.000000 rotate
0.000000 0.000000 m /five glyphshow
grestore
gsave
/o {
gsave
newpath
translate
0.8 setlinewidth
1 setlinejoin
0 setlinecap
0 0 m
0 -3.5 l

gsave
0.000 setgray
fill
grestore
stroke
grestore
} bind def
210.651 38.016 o
grestore
gsave
204.292054 23.422250 translate
0.000000 rotate
0.000000 0.000000 m /one glyphshow
6.362305 0.000000 m /zero glyphshow
grestore
gsave
/o {
gsave
newpath
translate
0.8 setlinewidth
1 setlinejoin
0 setlinecap
0 0 m
0 -3.5 l

gsave
0.000 setgray
fill
grestore
stroke
grestore
} bind def
274.423 38.016 o
grestore
gsave
268.063482 23.422250 translate
0.000000 rotate
0.000000 0.000000 m /one glyphshow
6.362305 0.000000 m /five glyphshow
grestore
gsave
/o {
gsave
newpath
translate
0.8 setlinewidth
1 setlinejoin
0 setlinecap
0 0 m
0 -3.5 l

gsave
0.000 setgray
fill
grestore
stroke
grestore
} bind def
338.194 38.016 o
grestore
gsave
331.834911 23.422250 translate
0.000000 rotate
0.000000 0.000000 m /two glyphshow
6.362305 0.000000 m /zero glyphshow
grestore
gsave
/o {
gsave
newpath
translate
0.8 setlinewidth
1 setlinejoin
0 setlinecap
0 0 m
0 -3.5 l

gsave
0.000 setgray
fill
grestore
stroke
grestore
} bind def
401.966 38.016 o
grestore
gsave
395.606339 23.422250 translate
0.000000 rotate
0.000000 0.000000 m /two glyphshow
6.362305 0.000000 m /five glyphshow
grestore
gsave
/o {
gsave
newpath
translate
0.8 setlinewidth
1 setlinejoin
0 setlinecap
0 0 m
-3.5 0 l

gsave
0.000 setgray
fill
grestore
stroke
grestore
} bind def
57.6 38.016 o
grestore
gsave
34.693750 34.219125 translate
0.000000 rotate
0.000000 0.000000 m /zero glyphshow
6.362305 0.000000 m /period glyphshow
9.541016 0.000000 m /zero glyphshow
grestore
gsave
/o {
gsave
newpath
translate
0.8 setlinewidth
1 setlinejoin
0 setlinecap
0 0 m
-3.5 0 l

gsave
0.000 setgray
fill
grestore
stroke
grestore
} bind def
57.6 92.3544 o
grestore
gsave
34.693750 88.557548 translate
0.000000 rotate
0.000000 0.000000 m /zero glyphshow
6.362305 0.000000 m /period glyphshow
9.541016 0.000000 m /five glyphshow
grestore
gsave
/o {
gsave
newpath
translate
0.8 setlinewidth
1 setlinejoin
0 setlinecap
0 0 m
-3.5 0 l

gsave
0.000 setgray
fill
grestore
stroke
grestore
} bind def
57.6 146.693 o
grestore
gsave
34.693750 142.895971 translate
0.000000 rotate
0.000000 0.000000 m /one glyphshow
6.362305 0.000000 m /period glyphshow
9.541016 0.000000 m /zero glyphshow
grestore
gsave
/o {
gsave
newpath
translate
0.8 setlinewidth
1 setlinejoin
0 setlinecap
0 0 m
-3.5 0 l

gsave
0.000 setgray
fill
grestore
stroke
grestore
} bind def
57.6 201.031 o
grestore
gsave
34.693750 197.234394 translate
0.000000 rotate
0.000000 0.000000 m /one glyphshow
6.362305 0.000000 m /period glyphshow
9.541016 0.000000 m /five glyphshow
grestore
gsave
/o {
gsave
newpath
translate
0.8 setlinewidth
1 setlinejoin
0 setlinecap
0 0 m
-3.5 0 l

gsave
0.000 setgray
fill
grestore
stroke
grestore
} bind def
57.6 255.37 o
grestore
gsave
34.693750 251.572816 translate
0.000000 rotate
0.000000 0.000000 m /two glyphshow
6.362305 0.000000 m /period glyphshow
9.541016 0.000000 m /zero glyphshow
grestore
0 setlinejoin
2 setlinecap
[] 0 setdash
gsave
57.6 38.016 m
57.6 304.128 l
stroke
grestore
gsave
414.72 38.016 m
414.72 304.128 l
stroke
grestore
gsave
57.6 38.016 m
414.72 38.016 l
stroke
grestore
gsave
57.6 304.128 m
414.72 304.128 l
stroke
grestore
1.000 setlinewidth
0 setlinecap
0.800 setgray
gsave
325.216875 230.778 m
448.32 230.778 l
449.92 230.778 450.72 231.578 450.72 233.178 c
450.72 337.728 l
450.72 339.328 449.92 340.128 448.32 340.128 c
325.216875 340.128 l
323.616875 340.128 322.816875 339.328 322.816875 337.728 c
322.816875 233.178 l
322.816875 231.578 323.616875 230.778 325.216875 230.778 c
cl
gsave
1.000 setgray
fill
grestore
stroke
grestore
gsave
327.616875 326.203 m
351.616875 326.203 l
351.616875 334.603 l
327.616875 334.603 l
cl
1.000 0.000 0.000 setrgbcolor
fill
grestore
0.000 setgray
/DejaVuSans findfont
12.000 scalefont
setfont
gsave
361.216875 326.203000 translate
0.000000 rotate
0.000000 0.000000 m /s glyphshow
6.251953 0.000000 m /i glyphshow
9.585938 0.000000 m /t glyphshow
14.291016 0.000000 m /e glyphshow
21.673828 0.000000 m /four glyphshow
29.308594 0.000000 m /period glyphshow
33.123047 0.000000 m /u glyphshow
40.728516 0.000000 m /n glyphshow
48.333984 0.000000 m /s glyphshow
54.585938 0.000000 m /c glyphshow
61.183594 0.000000 m /h glyphshow
68.789062 0.000000 m /e glyphshow
76.171875 0.000000 m /d glyphshow
grestore
gsave
327.616875 308.578 m
351.616875 308.578 l
351.616875 316.978 l
327.616875 316.978 l
cl
1.000 0.647 0.000 setrgbcolor
fill
grestore
gsave
361.216875 308.578000 translate
0.000000 rotate
0.000000 0.000000 m /s glyphshow
6.251953 0.000000 m /i glyphshow
9.585938 0.000000 m /t glyphshow
14.291016 0.000000 m /e glyphshow
21.673828 0.000000 m /four glyphshow
29.308594 0.000000 m /period glyphshow
33.123047 0.000000 m /f glyphshow
37.347656 0.000000 m /r glyphshow
42.281250 0.000000 m /i glyphshow
45.615234 0.000000 m /d glyphshow
53.232422 0.000000 m /g glyphshow
60.849609 0.000000 m /e glyphshow
grestore
gsave
327.616875 290.953 m
351.616875 290.953 l
351.616875 299.353 l
327.616875 299.353 l
cl
1.000 1.000 0.000 setrgbcolor
fill
grestore
gsave
361.216875 290.953000 translate
0.000000 rotate
0.000000 0.000000 m /s glyphshow
6.251953 0.000000 m /i glyphshow
9.585938 0.000000 m /t glyphshow
14.291016 0.000000 m /e glyphshow
21.673828 0.000000 m /four glyphshow
29.308594 0.000000 m /period glyphshow
33.123047 0.000000 m /l glyphshow
36.457031 0.000000 m /i glyphshow
39.791016 0.000000 m /g glyphshow
47.408203 0.000000 m /h glyphshow
55.013672 0.000000 m /t glyphshow
grestore
gsave
327.616875 273.328 m
351.616875 273.328 l
351.616875 281.728 l
327.616875 281.728 l
cl
0.502 0.000 0.502 setrgbcolor
fill
grestore
gsave
361.216875 273.328000 translate
0.000000 rotate
0.000000 0.000000 m /s glyphshow
6.251953 0.000000 m /i glyphshow
9.585938 0.000000 m /t glyphshow
14.291016 0.000000 m /e glyphshow
21.673828 0.000000 m /four glyphshow
29.308594 0.000000 m /period glyphshow
33.123047 0.000000 m /e glyphshow
40.505859 0.000000 m /v glyphshow
grestore
gsave
327.616875 255.703 m
351.616875 255.703 l
351.616875 264.103 l
327.616875 264.103 l
cl
1.000 0.000 1.000 setrgbcolor
fill
grestore
gsave
361.216875 255.703000 translate
0.000000 rotate
0.000000 0.000000 m /s glyphshow
6.251953 0.000000 m /i glyphshow
9.585938 0.000000 m /t glyphshow
14.291016 0.000000 m /e glyphshow
21.673828 0.000000 m /four glyphshow
29.308594 0.000000 m /period glyphshow
33.123047 0.000000 m /w glyphshow
42.937500 0.000000 m /p glyphshow
50.554688 0.000000 m /u glyphshow
58.160156 0.000000 m /m glyphshow
69.849609 0.000000 m /p glyphshow
grestore
gsave
327.616875 238.078 m
351.616875 238.078 l
351.616875 246.478 l
327.616875 246.478 l
cl
0.000 1.000 0.000 setrgbcolor
fill
grestore
gsave
361.216875 238.078000 translate
0.000000 rotate
0.000000 0.000000 m /s glyphshow
6.251953 0.000000 m /i glyphshow
9.585938 0.000000 m /t glyphshow
14.291016 0.000000 m /e glyphshow
21.673828 0.000000 m /four glyphshow
29.308594 0.000000 m /period glyphshow
33.123047 0.000000 m /m glyphshow
44.812500 0.000000 m /a glyphshow
52.166016 0.000000 m /c glyphshow
58.763672 0.000000 m /h glyphshow
66.369141 0.000000 m /i glyphshow
69.703125 0.000000 m /n glyphshow
77.308594 0.000000 m /e glyphshow
grestore

end
showpage
