%!PS-Adobe-3.0 EPSF-3.0
%%Title: scenario2.py-network-latest-report/animation-mg-0001.eps
%%Creator: matplotlib version 2.0.0, http://matplotlib.org/
%%CreationDate: Sun Jun  2 09:13:28 2019
%%Orientation: portrait
%%BoundingBox: 75 223 536 568
%%EndComments
%%BeginProlog
/mpldict 8 dict def
mpldict begin
/m { moveto } bind def
/l { lineto } bind def
/r { rlineto } bind def
/c { curveto } bind def
/cl { closepath } bind def
/box {
m
1 index 0 r
0 exch r
neg 0 r
cl
} bind def
/clipbox {
box
clip
newpath
} bind def
%!PS-Adobe-3.0 Resource-Font
%%Title: DejaVu Sans
%%Copyright: Copyright (c) 2003 by Bitstream, Inc. All Rights Reserved. Copyright (c) 2006 by Tavmjong Bah. All Rights Reserved. DejaVu changes are in public domain 
%%Creator: Converted from TrueType to type 3 by PPR
25 dict begin
/_d{bind def}bind def
/_m{moveto}_d
/_l{lineto}_d
/_cl{closepath eofill}_d
/_c{curveto}_d
/_sc{7 -1 roll{setcachedevice}{pop pop pop pop pop pop}ifelse}_d
/_e{exec}_d
/FontName /DejaVuSans def
/PaintType 0 def
/FontMatrix[.001 0 0 .001 0 0]def
/FontBBox[-1021 -463 1793 1232]def
/FontType 3 def
/Encoding [ /zero /one /two /three /four /five /six /seven /a /b /c /d /e /i /l /m /n /p /r /s /t /u /v /y /minus ] def
/FontInfo 10 dict dup begin
/FamilyName (DejaVu Sans) def
/FullName (DejaVu Sans) def
/Notice (Copyright (c) 2003 by Bitstream, Inc. All Rights Reserved. Copyright (c) 2006 by Tavmjong Bah. All Rights Reserved. DejaVu changes are in public domain ) def
/Weight (Book) def
/Version (Version 2.35) def
/ItalicAngle 0.0 def
/isFixedPitch false def
/UnderlinePosition -130 def
/UnderlineThickness 90 def
end readonly def
/CharStrings 25 dict dup begin
/zero{636 0 66 -13 570 742 _sc
318 664 _m
267 664 229 639 203 589 _c
177 539 165 464 165 364 _c
165 264 177 189 203 139 _c
229 89 267 64 318 64 _c
369 64 407 89 433 139 _c
458 189 471 264 471 364 _c
471 464 458 539 433 589 _c
407 639 369 664 318 664 _c
318 742 _m
399 742 461 709 505 645 _c
548 580 570 486 570 364 _c
570 241 548 147 505 83 _c
461 19 399 -13 318 -13 _c
236 -13 173 19 130 83 _c
87 147 66 241 66 364 _c
66 486 87 580 130 645 _c
173 709 236 742 318 742 _c
_cl}_d
/one{636 0 110 0 544 729 _sc
124 83 _m
285 83 _l
285 639 _l
110 604 _l
110 694 _l
284 729 _l
383 729 _l
383 83 _l
544 83 _l
544 0 _l
124 0 _l
124 83 _l
_cl}_d
/two{{636 0 73 0 536 742 _sc
192 83 _m
536 83 _l
536 0 _l
73 0 _l
73 83 _l
110 121 161 173 226 239 _c
290 304 331 346 348 365 _c
380 400 402 430 414 455 _c
426 479 433 504 433 528 _c
433 566 419 598 392 622 _c
365 646 330 659 286 659 _c
255 659 222 653 188 643 _c
154 632 117 616 78 594 _c
78 694 _l
118 710 155 722 189 730 _c
223 738 255 742 284 742 _c
}_e{359 742 419 723 464 685 _c
509 647 532 597 532 534 _c
532 504 526 475 515 449 _c
504 422 484 390 454 354 _c
446 344 420 317 376 272 _c
332 227 271 164 192 83 _c
_cl}_e}_d
/three{{636 0 76 -13 556 742 _sc
406 393 _m
453 383 490 362 516 330 _c
542 298 556 258 556 212 _c
556 140 531 84 482 45 _c
432 6 362 -13 271 -13 _c
240 -13 208 -10 176 -4 _c
144 1 110 10 76 22 _c
76 117 _l
103 101 133 89 166 81 _c
198 73 232 69 268 69 _c
330 69 377 81 409 105 _c
441 129 458 165 458 212 _c
458 254 443 288 413 312 _c
383 336 341 349 287 349 _c
}_e{202 349 _l
202 430 _l
291 430 _l
339 430 376 439 402 459 _c
428 478 441 506 441 543 _c
441 580 427 609 401 629 _c
374 649 336 659 287 659 _c
260 659 231 656 200 650 _c
169 644 135 635 98 623 _c
98 711 _l
135 721 170 729 203 734 _c
235 739 266 742 296 742 _c
370 742 429 725 473 691 _c
517 657 539 611 539 553 _c
539 513 527 479 504 451 _c
481 423 448 403 406 393 _c
_cl}_e}_d
/four{636 0 49 0 580 729 _sc
378 643 _m
129 254 _l
378 254 _l
378 643 _l
352 729 _m
476 729 _l
476 254 _l
580 254 _l
580 172 _l
476 172 _l
476 0 _l
378 0 _l
378 172 _l
49 172 _l
49 267 _l
352 729 _l
_cl}_d
/five{{636 0 77 -13 549 729 _sc
108 729 _m
495 729 _l
495 646 _l
198 646 _l
198 467 _l
212 472 227 476 241 478 _c
255 480 270 482 284 482 _c
365 482 429 459 477 415 _c
525 370 549 310 549 234 _c
549 155 524 94 475 51 _c
426 8 357 -13 269 -13 _c
238 -13 207 -10 175 -6 _c
143 -1 111 6 77 17 _c
77 116 _l
106 100 136 88 168 80 _c
199 72 232 69 267 69 _c
}_e{323 69 368 83 401 113 _c
433 143 450 183 450 234 _c
450 284 433 324 401 354 _c
368 384 323 399 267 399 _c
241 399 214 396 188 390 _c
162 384 135 375 108 363 _c
108 729 _l
_cl}_e}_d
/six{{636 0 70 -13 573 742 _sc
330 404 _m
286 404 251 388 225 358 _c
199 328 186 286 186 234 _c
186 181 199 139 225 109 _c
251 79 286 64 330 64 _c
374 64 409 79 435 109 _c
461 139 474 181 474 234 _c
474 286 461 328 435 358 _c
409 388 374 404 330 404 _c
526 713 _m
526 623 _l
501 635 476 644 451 650 _c
425 656 400 659 376 659 _c
310 659 260 637 226 593 _c
}_e{192 549 172 482 168 394 _c
187 422 211 444 240 459 _c
269 474 301 482 336 482 _c
409 482 467 459 509 415 _c
551 371 573 310 573 234 _c
573 159 550 99 506 54 _c
462 9 403 -13 330 -13 _c
246 -13 181 19 137 83 _c
92 147 70 241 70 364 _c
70 479 97 571 152 639 _c
206 707 280 742 372 742 _c
396 742 421 739 447 735 _c
472 730 498 723 526 713 _c
_cl}_e}_d
/seven{636 0 82 0 551 729 _sc
82 729 _m
551 729 _l
551 687 _l
286 0 _l
183 0 _l
432 646 _l
82 646 _l
82 729 _l
_cl}_d
/a{{613 0 60 -13 522 560 _sc
343 275 _m
270 275 220 266 192 250 _c
164 233 150 205 150 165 _c
150 133 160 107 181 89 _c
202 70 231 61 267 61 _c
317 61 357 78 387 114 _c
417 149 432 196 432 255 _c
432 275 _l
343 275 _l
522 312 _m
522 0 _l
432 0 _l
432 83 _l
411 49 385 25 355 10 _c
325 -5 287 -13 243 -13 _c
187 -13 142 2 109 33 _c
76 64 60 106 60 159 _c
}_e{60 220 80 266 122 298 _c
163 329 224 345 306 345 _c
432 345 _l
432 354 _l
432 395 418 427 391 450 _c
364 472 326 484 277 484 _c
245 484 215 480 185 472 _c
155 464 127 453 100 439 _c
100 522 _l
132 534 164 544 195 550 _c
226 556 256 560 286 560 _c
365 560 424 539 463 498 _c
502 457 522 395 522 312 _c
_cl}_e}_d
/b{{635 0 91 -13 580 760 _sc
487 273 _m
487 339 473 390 446 428 _c
418 466 381 485 334 485 _c
286 485 249 466 222 428 _c
194 390 181 339 181 273 _c
181 207 194 155 222 117 _c
249 79 286 61 334 61 _c
381 61 418 79 446 117 _c
473 155 487 207 487 273 _c
181 464 _m
199 496 223 520 252 536 _c
281 552 316 560 356 560 _c
422 560 476 533 518 481 _c
559 428 580 359 580 273 _c
}_e{580 187 559 117 518 65 _c
476 13 422 -13 356 -13 _c
316 -13 281 -5 252 10 _c
223 25 199 49 181 82 _c
181 0 _l
91 0 _l
91 760 _l
181 760 _l
181 464 _l
_cl}_e}_d
/c{{550 0 55 -13 488 560 _sc
488 526 _m
488 442 _l
462 456 437 466 411 473 _c
385 480 360 484 334 484 _c
276 484 230 465 198 428 _c
166 391 150 339 150 273 _c
150 206 166 154 198 117 _c
230 80 276 62 334 62 _c
360 62 385 65 411 72 _c
437 79 462 90 488 104 _c
488 21 _l
462 9 436 0 410 -5 _c
383 -10 354 -13 324 -13 _c
242 -13 176 12 128 64 _c
}_e{79 115 55 185 55 273 _c
55 362 79 432 128 483 _c
177 534 244 560 330 560 _c
358 560 385 557 411 551 _c
437 545 463 537 488 526 _c
_cl}_e}_d
/d{{635 0 55 -13 544 760 _sc
454 464 _m
454 760 _l
544 760 _l
544 0 _l
454 0 _l
454 82 _l
435 49 411 25 382 10 _c
353 -5 319 -13 279 -13 _c
213 -13 159 13 117 65 _c
75 117 55 187 55 273 _c
55 359 75 428 117 481 _c
159 533 213 560 279 560 _c
319 560 353 552 382 536 _c
411 520 435 496 454 464 _c
148 273 _m
148 207 161 155 188 117 _c
215 79 253 61 301 61 _c
}_e{348 61 385 79 413 117 _c
440 155 454 207 454 273 _c
454 339 440 390 413 428 _c
385 466 348 485 301 485 _c
253 485 215 466 188 428 _c
161 390 148 339 148 273 _c
_cl}_e}_d
/e{{615 0 55 -13 562 560 _sc
562 296 _m
562 252 _l
149 252 _l
153 190 171 142 205 110 _c
238 78 284 62 344 62 _c
378 62 412 66 444 74 _c
476 82 509 95 541 113 _c
541 28 _l
509 14 476 3 442 -3 _c
408 -9 373 -13 339 -13 _c
251 -13 182 12 131 62 _c
80 112 55 181 55 268 _c
55 357 79 428 127 481 _c
175 533 241 560 323 560 _c
397 560 455 536 498 489 _c
}_e{540 441 562 377 562 296 _c
472 322 _m
471 371 457 410 431 440 _c
404 469 368 484 324 484 _c
274 484 234 469 204 441 _c
174 413 156 373 152 322 _c
472 322 _l
_cl}_e}_d
/i{278 0 94 0 184 760 _sc
94 547 _m
184 547 _l
184 0 _l
94 0 _l
94 547 _l
94 760 _m
184 760 _l
184 646 _l
94 646 _l
94 760 _l
_cl}_d
/l{278 0 94 0 184 760 _sc
94 760 _m
184 760 _l
184 0 _l
94 0 _l
94 760 _l
_cl}_d
/m{{974 0 91 0 889 560 _sc
520 442 _m
542 482 569 511 600 531 _c
631 550 668 560 711 560 _c
767 560 811 540 842 500 _c
873 460 889 403 889 330 _c
889 0 _l
799 0 _l
799 327 _l
799 379 789 418 771 444 _c
752 469 724 482 686 482 _c
639 482 602 466 575 435 _c
548 404 535 362 535 309 _c
535 0 _l
445 0 _l
445 327 _l
445 379 435 418 417 444 _c
398 469 369 482 331 482 _c
}_e{285 482 248 466 221 435 _c
194 404 181 362 181 309 _c
181 0 _l
91 0 _l
91 547 _l
181 547 _l
181 462 _l
201 495 226 520 255 536 _c
283 552 317 560 357 560 _c
397 560 430 550 458 530 _c
486 510 506 480 520 442 _c
_cl}_e}_d
/n{634 0 91 0 549 560 _sc
549 330 _m
549 0 _l
459 0 _l
459 327 _l
459 379 448 417 428 443 _c
408 469 378 482 338 482 _c
289 482 251 466 223 435 _c
195 404 181 362 181 309 _c
181 0 _l
91 0 _l
91 547 _l
181 547 _l
181 462 _l
202 494 227 519 257 535 _c
286 551 320 560 358 560 _c
420 560 468 540 500 501 _c
532 462 549 405 549 330 _c
_cl}_d
/p{{635 0 91 -207 580 560 _sc
181 82 _m
181 -207 _l
91 -207 _l
91 547 _l
181 547 _l
181 464 _l
199 496 223 520 252 536 _c
281 552 316 560 356 560 _c
422 560 476 533 518 481 _c
559 428 580 359 580 273 _c
580 187 559 117 518 65 _c
476 13 422 -13 356 -13 _c
316 -13 281 -5 252 10 _c
223 25 199 49 181 82 _c
487 273 _m
487 339 473 390 446 428 _c
418 466 381 485 334 485 _c
}_e{286 485 249 466 222 428 _c
194 390 181 339 181 273 _c
181 207 194 155 222 117 _c
249 79 286 61 334 61 _c
381 61 418 79 446 117 _c
473 155 487 207 487 273 _c
_cl}_e}_d
/r{411 0 91 0 411 560 _sc
411 463 _m
401 469 390 473 378 476 _c
366 478 353 480 339 480 _c
288 480 249 463 222 430 _c
194 397 181 350 181 288 _c
181 0 _l
91 0 _l
91 547 _l
181 547 _l
181 462 _l
199 495 224 520 254 536 _c
284 552 321 560 365 560 _c
371 560 378 559 386 559 _c
393 558 401 557 411 555 _c
411 463 _l
_cl}_d
/s{{521 0 54 -13 472 560 _sc
443 531 _m
443 446 _l
417 458 391 468 364 475 _c
336 481 308 485 279 485 _c
234 485 200 478 178 464 _c
156 450 145 430 145 403 _c
145 382 153 366 169 354 _c
185 342 217 330 265 320 _c
296 313 _l
360 299 405 279 432 255 _c
458 230 472 195 472 151 _c
472 100 452 60 412 31 _c
372 1 316 -13 246 -13 _c
216 -13 186 -10 154 -5 _c
}_e{122 0 89 8 54 20 _c
54 113 _l
87 95 120 82 152 74 _c
184 65 216 61 248 61 _c
290 61 323 68 346 82 _c
368 96 380 117 380 144 _c
380 168 371 187 355 200 _c
339 213 303 226 247 238 _c
216 245 _l
160 257 119 275 95 299 _c
70 323 58 356 58 399 _c
58 450 76 490 112 518 _c
148 546 200 560 268 560 _c
301 560 332 557 362 552 _c
391 547 418 540 443 531 _c
}_e{_cl}_e}_d
/t{392 0 27 0 368 702 _sc
183 702 _m
183 547 _l
368 547 _l
368 477 _l
183 477 _l
183 180 _l
183 135 189 106 201 94 _c
213 81 238 75 276 75 _c
368 75 _l
368 0 _l
276 0 _l
206 0 158 13 132 39 _c
106 65 93 112 93 180 _c
93 477 _l
27 477 _l
27 547 _l
93 547 _l
93 702 _l
183 702 _l
_cl}_d
/u{634 0 85 -13 543 560 _sc
85 216 _m
85 547 _l
175 547 _l
175 219 _l
175 167 185 129 205 103 _c
225 77 255 64 296 64 _c
344 64 383 79 411 110 _c
439 141 453 183 453 237 _c
453 547 _l
543 547 _l
543 0 _l
453 0 _l
453 84 _l
431 50 405 26 377 10 _c
348 -5 315 -13 277 -13 _c
214 -13 166 6 134 45 _c
101 83 85 140 85 216 _c
311 560 _m
311 560 _l
_cl}_d
/v{592 0 30 0 562 547 _sc
30 547 _m
125 547 _l
296 88 _l
467 547 _l
562 547 _l
357 0 _l
235 0 _l
30 547 _l
_cl}_d
/y{592 0 30 -207 562 547 _sc
322 -50 _m
296 -114 271 -157 247 -177 _c
223 -197 191 -207 151 -207 _c
79 -207 _l
79 -132 _l
132 -132 _l
156 -132 175 -126 189 -114 _c
203 -102 218 -75 235 -31 _c
251 9 _l
30 547 _l
125 547 _l
296 119 _l
467 547 _l
562 547 _l
322 -50 _l
_cl}_d
/minus{838 0 106 272 732 355 _sc
106 355 _m
732 355 _l
732 272 _l
106 272 _l
106 355 _l
_cl}_d
end readonly def

/BuildGlyph
 {exch begin
 CharStrings exch
 2 copy known not{pop /.notdef}if
 true 3 1 roll get exec
 end}_d

/BuildChar {
 1 index /Encoding get exch get
 1 index /BuildGlyph get exec
}_d

FontName currentdict end definefont pop
end
%%EndProlog
mpldict begin
75.6 223.2 translate
460.8 345.6 0 0 clipbox
gsave
0 0 m
460.8 0 l
460.8 345.6 l
0 345.6 l
cl
1.000 setgray
fill
grestore
gsave
57.6 38.016 m
414.72 38.016 l
414.72 304.128 l
57.6 304.128 l
cl
1.000 setgray
fill
grestore
gsave
357.1 266.1 57.6 38.02 clipbox
78.006857 102.313447 m
88.210286 102.313447 l
88.210286 154.030189 l
78.006857 154.030189 l
cl
1.000 0.000 0.000 setrgbcolor
fill
grestore
gsave
357.1 266.1 57.6 38.02 clipbox
90.761143 102.472874 m
100.964571 102.472874 l
100.964571 154.030189 l
90.761143 154.030189 l
cl
1.000 0.000 0.000 setrgbcolor
fill
grestore
gsave
357.1 266.1 57.6 38.02 clipbox
103.515429 102.412635 m
113.718857 102.412635 l
113.718857 154.030189 l
103.515429 154.030189 l
cl
1.000 0.000 0.000 setrgbcolor
fill
grestore
gsave
357.1 266.1 57.6 38.02 clipbox
116.269714 102.49185 m
126.473143 102.49185 l
126.473143 154.030189 l
116.269714 154.030189 l
cl
1.000 0.000 0.000 setrgbcolor
fill
grestore
gsave
357.1 266.1 57.6 38.02 clipbox
129.024 102.446286 m
139.227429 102.446286 l
139.227429 154.030189 l
129.024 154.030189 l
cl
1.000 0.000 0.000 setrgbcolor
fill
grestore
gsave
357.1 266.1 57.6 38.02 clipbox
141.778286 103.392667 m
151.981714 103.392667 l
151.981714 154.030189 l
141.778286 154.030189 l
cl
1.000 0.000 0.000 setrgbcolor
fill
grestore
gsave
357.1 266.1 57.6 38.02 clipbox
154.532571 104.046864 m
164.736 104.046864 l
164.736 154.030189 l
154.532571 154.030189 l
cl
1.000 0.000 0.000 setrgbcolor
fill
grestore
gsave
357.1 266.1 57.6 38.02 clipbox
167.286857 106.550932 m
177.490286 106.550932 l
177.490286 154.030189 l
167.286857 154.030189 l
cl
1.000 0.000 0.000 setrgbcolor
fill
grestore
gsave
357.1 266.1 57.6 38.02 clipbox
180.041143 105.907955 m
190.244571 105.907955 l
190.244571 154.030189 l
180.041143 154.030189 l
cl
1.000 0.000 0.000 setrgbcolor
fill
grestore
gsave
357.1 266.1 57.6 38.02 clipbox
192.795429 108.782821 m
202.998857 108.782821 l
202.998857 154.030189 l
192.795429 154.030189 l
cl
1.000 0.000 0.000 setrgbcolor
fill
grestore
gsave
357.1 266.1 57.6 38.02 clipbox
205.549714 109.560651 m
215.753143 109.560651 l
215.753143 154.030189 l
205.549714 154.030189 l
cl
1.000 0.000 0.000 setrgbcolor
fill
grestore
gsave
357.1 266.1 57.6 38.02 clipbox
218.304 109.351908 m
228.507429 109.351908 l
228.507429 154.030189 l
218.304 154.030189 l
cl
1.000 0.000 0.000 setrgbcolor
fill
grestore
gsave
357.1 266.1 57.6 38.02 clipbox
231.058286 106.350756 m
241.261714 106.350756 l
241.261714 154.030189 l
231.058286 154.030189 l
cl
1.000 0.000 0.000 setrgbcolor
fill
grestore
gsave
357.1 266.1 57.6 38.02 clipbox
243.812571 106.063836 m
254.016 106.063836 l
254.016 154.030189 l
243.812571 154.030189 l
cl
1.000 0.000 0.000 setrgbcolor
fill
grestore
gsave
357.1 266.1 57.6 38.02 clipbox
256.566857 105.769142 m
266.770286 105.769142 l
266.770286 154.030189 l
256.566857 154.030189 l
cl
1.000 0.000 0.000 setrgbcolor
fill
grestore
gsave
357.1 266.1 57.6 38.02 clipbox
269.321143 105.513845 m
279.524571 105.513845 l
279.524571 154.030189 l
269.321143 154.030189 l
cl
1.000 0.000 0.000 setrgbcolor
fill
grestore
gsave
357.1 266.1 57.6 38.02 clipbox
282.075429 105.276307 m
292.278857 105.276307 l
292.278857 154.030189 l
282.075429 154.030189 l
cl
1.000 0.000 0.000 setrgbcolor
fill
grestore
gsave
357.1 266.1 57.6 38.02 clipbox
294.829714 104.759156 m
305.033143 104.759156 l
305.033143 154.030189 l
294.829714 154.030189 l
cl
1.000 0.000 0.000 setrgbcolor
fill
grestore
gsave
357.1 266.1 57.6 38.02 clipbox
307.584 103.06763 m
317.787429 103.06763 l
317.787429 154.030189 l
307.584 154.030189 l
cl
1.000 0.000 0.000 setrgbcolor
fill
grestore
gsave
357.1 266.1 57.6 38.02 clipbox
320.338286 101.94932 m
330.541714 101.94932 l
330.541714 154.030189 l
320.338286 154.030189 l
cl
1.000 0.000 0.000 setrgbcolor
fill
grestore
gsave
357.1 266.1 57.6 38.02 clipbox
333.092571 101.282939 m
343.296 101.282939 l
343.296 154.030189 l
333.092571 154.030189 l
cl
1.000 0.000 0.000 setrgbcolor
fill
grestore
gsave
357.1 266.1 57.6 38.02 clipbox
345.846857 102.019864 m
356.050286 102.019864 l
356.050286 154.030189 l
345.846857 154.030189 l
cl
1.000 0.000 0.000 setrgbcolor
fill
grestore
gsave
357.1 266.1 57.6 38.02 clipbox
358.601143 101.691463 m
368.804571 101.691463 l
368.804571 154.030189 l
358.601143 154.030189 l
cl
1.000 0.000 0.000 setrgbcolor
fill
grestore
gsave
357.1 266.1 57.6 38.02 clipbox
371.355429 102.211622 m
381.558857 102.211622 l
381.558857 154.030189 l
371.355429 154.030189 l
cl
1.000 0.000 0.000 setrgbcolor
fill
grestore
gsave
357.1 266.1 57.6 38.02 clipbox
78.006857 101.758608 m
88.210286 101.758608 l
88.210286 102.313447 l
78.006857 102.313447 l
cl
1.000 0.647 0.000 setrgbcolor
fill
grestore
gsave
357.1 266.1 57.6 38.02 clipbox
90.761143 101.918035 m
100.964571 101.918035 l
100.964571 102.472874 l
90.761143 102.472874 l
cl
1.000 0.647 0.000 setrgbcolor
fill
grestore
gsave
357.1 266.1 57.6 38.02 clipbox
103.515429 101.857796 m
113.718857 101.857796 l
113.718857 102.412635 l
103.515429 102.412635 l
cl
1.000 0.647 0.000 setrgbcolor
fill
grestore
gsave
357.1 266.1 57.6 38.02 clipbox
116.269714 101.881527 m
126.473143 101.881527 l
126.473143 102.49185 l
116.269714 102.49185 l
cl
1.000 0.647 0.000 setrgbcolor
fill
grestore
gsave
357.1 266.1 57.6 38.02 clipbox
129.024 100.393381 m
139.227429 100.393381 l
139.227429 102.446286 l
129.024 102.446286 l
cl
1.000 0.647 0.000 setrgbcolor
fill
grestore
gsave
357.1 266.1 57.6 38.02 clipbox
141.778286 92.184914 m
151.981714 92.184914 l
151.981714 103.392667 l
141.778286 103.392667 l
cl
1.000 0.647 0.000 setrgbcolor
fill
grestore
gsave
357.1 266.1 57.6 38.02 clipbox
154.532571 78.643786 m
164.736 78.643786 l
164.736 104.046864 l
154.532571 104.046864 l
cl
1.000 0.647 0.000 setrgbcolor
fill
grestore
gsave
357.1 266.1 57.6 38.02 clipbox
167.286857 66.132608 m
177.490286 66.132608 l
177.490286 106.550932 l
167.286857 106.550932 l
cl
1.000 0.647 0.000 setrgbcolor
fill
grestore
gsave
357.1 266.1 57.6 38.02 clipbox
180.041143 52.027315 m
190.244571 52.027315 l
190.244571 105.907955 l
180.041143 105.907955 l
cl
1.000 0.647 0.000 setrgbcolor
fill
grestore
gsave
357.1 266.1 57.6 38.02 clipbox
192.795429 46.580375 m
202.998857 46.580375 l
202.998857 108.782821 l
192.795429 108.782821 l
cl
1.000 0.647 0.000 setrgbcolor
fill
grestore
gsave
357.1 266.1 57.6 38.02 clipbox
205.549714 43.707914 m
215.753143 43.707914 l
215.753143 109.560651 l
205.549714 109.560651 l
cl
1.000 0.647 0.000 setrgbcolor
fill
grestore
gsave
357.1 266.1 57.6 38.02 clipbox
218.304 44.085246 m
228.507429 44.085246 l
228.507429 109.351908 l
218.304 109.351908 l
cl
1.000 0.647 0.000 setrgbcolor
fill
grestore
gsave
357.1 266.1 57.6 38.02 clipbox
231.058286 43.61134 m
241.261714 43.61134 l
241.261714 106.350756 l
231.058286 106.350756 l
cl
1.000 0.647 0.000 setrgbcolor
fill
grestore
gsave
357.1 266.1 57.6 38.02 clipbox
243.812571 46.163924 m
254.016 46.163924 l
254.016 106.063836 l
243.812571 106.063836 l
cl
1.000 0.647 0.000 setrgbcolor
fill
grestore
gsave
357.1 266.1 57.6 38.02 clipbox
256.566857 55.292787 m
266.770286 55.292787 l
266.770286 105.769142 l
256.566857 105.769142 l
cl
1.000 0.647 0.000 setrgbcolor
fill
grestore
gsave
357.1 266.1 57.6 38.02 clipbox
269.321143 61.026544 m
279.524571 61.026544 l
279.524571 105.513845 l
269.321143 105.513845 l
cl
1.000 0.647 0.000 setrgbcolor
fill
grestore
gsave
357.1 266.1 57.6 38.02 clipbox
282.075429 70.828224 m
292.278857 70.828224 l
292.278857 105.276307 l
282.075429 105.276307 l
cl
1.000 0.647 0.000 setrgbcolor
fill
grestore
gsave
357.1 266.1 57.6 38.02 clipbox
294.829714 79.181066 m
305.033143 79.181066 l
305.033143 104.759156 l
294.829714 104.759156 l
cl
1.000 0.647 0.000 setrgbcolor
fill
grestore
gsave
357.1 266.1 57.6 38.02 clipbox
307.584 87.754066 m
317.787429 87.754066 l
317.787429 103.06763 l
307.584 103.06763 l
cl
1.000 0.647 0.000 setrgbcolor
fill
grestore
gsave
357.1 266.1 57.6 38.02 clipbox
320.338286 95.180281 m
330.541714 95.180281 l
330.541714 101.94932 l
320.338286 101.94932 l
cl
1.000 0.647 0.000 setrgbcolor
fill
grestore
gsave
357.1 266.1 57.6 38.02 clipbox
333.092571 95.068743 m
343.296 95.068743 l
343.296 101.282939 l
333.092571 101.282939 l
cl
1.000 0.647 0.000 setrgbcolor
fill
grestore
gsave
357.1 266.1 57.6 38.02 clipbox
345.846857 96.915347 m
356.050286 96.915347 l
356.050286 102.019864 l
345.846857 102.019864 l
cl
1.000 0.647 0.000 setrgbcolor
fill
grestore
gsave
357.1 266.1 57.6 38.02 clipbox
358.601143 100.803721 m
368.804571 100.803721 l
368.804571 101.691463 l
358.601143 101.691463 l
cl
1.000 0.647 0.000 setrgbcolor
fill
grestore
gsave
357.1 266.1 57.6 38.02 clipbox
371.355429 101.713055 m
381.558857 101.713055 l
381.558857 102.211622 l
371.355429 102.211622 l
cl
1.000 0.647 0.000 setrgbcolor
fill
grestore
gsave
357.1 266.1 57.6 38.02 clipbox
78.006857 101.742027 m
88.210286 101.742027 l
88.210286 101.758608 l
78.006857 101.758608 l
cl
1.000 1.000 0.000 setrgbcolor
fill
grestore
gsave
357.1 266.1 57.6 38.02 clipbox
90.761143 98.216097 m
100.964571 98.216097 l
100.964571 101.918035 l
90.761143 101.918035 l
cl
1.000 1.000 0.000 setrgbcolor
fill
grestore
gsave
357.1 266.1 57.6 38.02 clipbox
103.515429 101.846369 m
113.718857 101.846369 l
113.718857 101.857796 l
103.515429 101.857796 l
cl
1.000 1.000 0.000 setrgbcolor
fill
grestore
gsave
357.1 266.1 57.6 38.02 clipbox
116.269714 98.19973 m
126.473143 98.19973 l
126.473143 101.881527 l
116.269714 101.881527 l
cl
1.000 1.000 0.000 setrgbcolor
fill
grestore
gsave
357.1 266.1 57.6 38.02 clipbox
129.024 96.60845 m
139.227429 96.60845 l
139.227429 100.393381 l
129.024 100.393381 l
cl
1.000 1.000 0.000 setrgbcolor
fill
grestore
gsave
357.1 266.1 57.6 38.02 clipbox
141.778286 91.75332 m
151.981714 91.75332 l
151.981714 92.184914 l
141.778286 92.184914 l
cl
1.000 1.000 0.000 setrgbcolor
fill
grestore
gsave
357.1 266.1 57.6 38.02 clipbox
154.532571 154.030189 m
164.736 154.030189 l
164.736 154.097763 l
154.532571 154.097763 l
cl
1.000 1.000 0.000 setrgbcolor
fill
grestore
gsave
357.1 266.1 57.6 38.02 clipbox
167.286857 66.090234 m
177.490286 66.090234 l
177.490286 66.132608 l
167.286857 66.132608 l
cl
1.000 1.000 0.000 setrgbcolor
fill
grestore
gsave
357.1 266.1 57.6 38.02 clipbox
180.041143 52.01337 m
190.244571 52.01337 l
190.244571 52.027315 l
180.041143 52.027315 l
cl
1.000 1.000 0.000 setrgbcolor
fill
grestore
gsave
357.1 266.1 57.6 38.02 clipbox
192.795429 154.030189 m
202.998857 154.030189 l
202.998857 158.558326 l
192.795429 158.558326 l
cl
1.000 1.000 0.000 setrgbcolor
fill
grestore
gsave
357.1 266.1 57.6 38.02 clipbox
205.549714 154.030189 m
215.753143 154.030189 l
215.753143 160.556647 l
205.549714 160.556647 l
cl
1.000 1.000 0.000 setrgbcolor
fill
grestore
gsave
357.1 266.1 57.6 38.02 clipbox
218.304 154.030189 m
228.507429 154.030189 l
228.507429 160.090138 l
218.304 160.090138 l
cl
1.000 1.000 0.000 setrgbcolor
fill
grestore
gsave
357.1 266.1 57.6 38.02 clipbox
231.058286 43.540485 m
241.261714 43.540485 l
241.261714 43.61134 l
231.058286 43.61134 l
cl
1.000 1.000 0.000 setrgbcolor
fill
grestore
gsave
357.1 266.1 57.6 38.02 clipbox
243.812571 46.124589 m
254.016 46.124589 l
254.016 46.163924 l
243.812571 46.163924 l
cl
1.000 1.000 0.000 setrgbcolor
fill
grestore
gsave
357.1 266.1 57.6 38.02 clipbox
256.566857 55.254819 m
266.770286 55.254819 l
266.770286 55.292787 l
256.566857 55.292787 l
cl
1.000 1.000 0.000 setrgbcolor
fill
grestore
gsave
357.1 266.1 57.6 38.02 clipbox
269.321143 154.030189 m
279.524571 154.030189 l
279.524571 155.61739 l
269.321143 155.61739 l
cl
1.000 1.000 0.000 setrgbcolor
fill
grestore
gsave
357.1 266.1 57.6 38.02 clipbox
282.075429 154.030189 m
292.278857 154.030189 l
292.278857 154.722245 l
282.075429 154.722245 l
cl
1.000 1.000 0.000 setrgbcolor
fill
grestore
gsave
357.1 266.1 57.6 38.02 clipbox
294.829714 154.030189 m
305.033143 154.030189 l
305.033143 154.254785 l
294.829714 154.254785 l
cl
1.000 1.000 0.000 setrgbcolor
fill
grestore
gsave
357.1 266.1 57.6 38.02 clipbox
307.584 154.030189 m
317.787429 154.030189 l
317.787429 154.045373 l
307.584 154.045373 l
cl
1.000 1.000 0.000 setrgbcolor
fill
grestore
gsave
357.1 266.1 57.6 38.02 clipbox
320.338286 94.306529 m
330.541714 94.306529 l
330.541714 95.180281 l
320.338286 95.180281 l
cl
1.000 1.000 0.000 setrgbcolor
fill
grestore
gsave
357.1 266.1 57.6 38.02 clipbox
333.092571 94.324423 m
343.296 94.324423 l
343.296 95.068743 l
333.092571 95.068743 l
cl
1.000 1.000 0.000 setrgbcolor
fill
grestore
gsave
357.1 266.1 57.6 38.02 clipbox
345.846857 92.112612 m
356.050286 92.112612 l
356.050286 96.915347 l
345.846857 96.915347 l
cl
1.000 1.000 0.000 setrgbcolor
fill
grestore
gsave
357.1 266.1 57.6 38.02 clipbox
358.601143 100.556534 m
368.804571 100.556534 l
368.804571 100.803721 l
358.601143 100.803721 l
cl
1.000 1.000 0.000 setrgbcolor
fill
grestore
gsave
357.1 266.1 57.6 38.02 clipbox
371.355429 101.644693 m
381.558857 101.644693 l
381.558857 101.713055 l
371.355429 101.713055 l
cl
1.000 1.000 0.000 setrgbcolor
fill
grestore
gsave
357.1 266.1 57.6 38.02 clipbox
78.006857 154.030189 m
88.210286 154.030189 l
88.210286 161.024544 l
78.006857 161.024544 l
cl
0.502 0.000 0.502 setrgbcolor
fill
grestore
gsave
357.1 266.1 57.6 38.02 clipbox
90.761143 154.030189 m
100.964571 154.030189 l
100.964571 161.86862 l
90.761143 161.86862 l
cl
0.502 0.000 0.502 setrgbcolor
fill
grestore
gsave
357.1 266.1 57.6 38.02 clipbox
103.515429 154.030189 m
113.718857 154.030189 l
113.718857 161.420594 l
103.515429 161.420594 l
cl
0.502 0.000 0.502 setrgbcolor
fill
grestore
gsave
357.1 266.1 57.6 38.02 clipbox
116.269714 154.030189 m
126.473143 154.030189 l
126.473143 161.90065 l
116.269714 161.90065 l
cl
0.502 0.000 0.502 setrgbcolor
fill
grestore
gsave
357.1 266.1 57.6 38.02 clipbox
129.024 154.030189 m
139.227429 154.030189 l
139.227429 161.782564 l
129.024 161.782564 l
cl
0.502 0.000 0.502 setrgbcolor
fill
grestore
gsave
357.1 266.1 57.6 38.02 clipbox
141.778286 154.030189 m
151.981714 154.030189 l
151.981714 155.379348 l
141.778286 155.379348 l
cl
0.502 0.000 0.502 setrgbcolor
fill
grestore
gsave
357.1 266.1 57.6 38.02 clipbox
154.532571 154.097763 m
164.736 154.097763 l
164.736 155.369323 l
154.532571 155.369323 l
cl
0.502 0.000 0.502 setrgbcolor
fill
grestore
gsave
357.1 266.1 57.6 38.02 clipbox
167.286857 154.030189 m
177.490286 154.030189 l
177.490286 158.125903 l
167.286857 158.125903 l
cl
0.502 0.000 0.502 setrgbcolor
fill
grestore
gsave
357.1 266.1 57.6 38.02 clipbox
180.041143 154.030189 m
190.244571 154.030189 l
190.244571 165.723753 l
180.041143 165.723753 l
cl
0.502 0.000 0.502 setrgbcolor
fill
grestore
gsave
357.1 266.1 57.6 38.02 clipbox
192.795429 158.558326 m
202.998857 158.558326 l
202.998857 179.292282 l
192.795429 179.292282 l
cl
0.502 0.000 0.502 setrgbcolor
fill
grestore
gsave
357.1 266.1 57.6 38.02 clipbox
205.549714 160.556647 m
215.753143 160.556647 l
215.753143 179.319773 l
205.549714 179.319773 l
cl
0.502 0.000 0.502 setrgbcolor
fill
grestore
gsave
357.1 266.1 57.6 38.02 clipbox
218.304 160.090138 m
228.507429 160.090138 l
228.507429 178.414593 l
218.304 178.414593 l
cl
0.502 0.000 0.502 setrgbcolor
fill
grestore
gsave
357.1 266.1 57.6 38.02 clipbox
231.058286 154.030189 m
241.261714 154.030189 l
241.261714 174.927638 l
231.058286 174.927638 l
cl
0.502 0.000 0.502 setrgbcolor
fill
grestore
gsave
357.1 266.1 57.6 38.02 clipbox
243.812571 154.030189 m
254.016 154.030189 l
254.016 173.99522 l
243.812571 173.99522 l
cl
0.502 0.000 0.502 setrgbcolor
fill
grestore
gsave
357.1 266.1 57.6 38.02 clipbox
256.566857 154.030189 m
266.770286 154.030189 l
266.770286 172.373385 l
256.566857 172.373385 l
cl
0.502 0.000 0.502 setrgbcolor
fill
grestore
gsave
357.1 266.1 57.6 38.02 clipbox
269.321143 155.61739 m
279.524571 155.61739 l
279.524571 172.250563 l
269.321143 172.250563 l
cl
0.502 0.000 0.502 setrgbcolor
fill
grestore
gsave
357.1 266.1 57.6 38.02 clipbox
282.075429 154.722245 m
292.278857 154.722245 l
292.278857 170.276185 l
282.075429 170.276185 l
cl
0.502 0.000 0.502 setrgbcolor
fill
grestore
gsave
357.1 266.1 57.6 38.02 clipbox
294.829714 154.254785 m
305.033143 154.254785 l
305.033143 167.659052 l
294.829714 167.659052 l
cl
0.502 0.000 0.502 setrgbcolor
fill
grestore
gsave
357.1 266.1 57.6 38.02 clipbox
307.584 154.045373 m
317.787429 154.045373 l
317.787429 166.732259 l
307.584 166.732259 l
cl
0.502 0.000 0.502 setrgbcolor
fill
grestore
gsave
357.1 266.1 57.6 38.02 clipbox
320.338286 154.030189 m
330.541714 154.030189 l
330.541714 161.995912 l
320.338286 161.995912 l
cl
0.502 0.000 0.502 setrgbcolor
fill
grestore
gsave
357.1 266.1 57.6 38.02 clipbox
333.092571 154.030189 m
343.296 154.030189 l
343.296 163.02783 l
333.092571 163.02783 l
cl
0.502 0.000 0.502 setrgbcolor
fill
grestore
gsave
357.1 266.1 57.6 38.02 clipbox
345.846857 154.030189 m
356.050286 154.030189 l
356.050286 165.363801 l
345.846857 165.363801 l
cl
0.502 0.000 0.502 setrgbcolor
fill
grestore
gsave
357.1 266.1 57.6 38.02 clipbox
358.601143 154.030189 m
368.804571 154.030189 l
368.804571 164.690549 l
358.601143 164.690549 l
cl
0.502 0.000 0.502 setrgbcolor
fill
grestore
gsave
357.1 266.1 57.6 38.02 clipbox
371.355429 154.030189 m
381.558857 154.030189 l
381.558857 161.683362 l
371.355429 161.683362 l
cl
0.502 0.000 0.502 setrgbcolor
fill
grestore
gsave
357.1 266.1 57.6 38.02 clipbox
78.006857 161.024544 m
88.210286 161.024544 l
88.210286 166.771061 l
78.006857 166.771061 l
cl
1.000 0.000 1.000 setrgbcolor
fill
grestore
gsave
357.1 266.1 57.6 38.02 clipbox
90.761143 161.86862 m
100.964571 161.86862 l
100.964571 168.457911 l
90.761143 168.457911 l
cl
1.000 0.000 1.000 setrgbcolor
fill
grestore
gsave
357.1 266.1 57.6 38.02 clipbox
103.515429 161.420594 m
113.718857 161.420594 l
113.718857 167.537337 l
103.515429 167.537337 l
cl
1.000 0.000 1.000 setrgbcolor
fill
grestore
gsave
357.1 266.1 57.6 38.02 clipbox
116.269714 161.90065 m
126.473143 161.90065 l
126.473143 168.526442 l
116.269714 168.526442 l
cl
1.000 0.000 1.000 setrgbcolor
fill
grestore
gsave
357.1 266.1 57.6 38.02 clipbox
129.024 161.782564 m
139.227429 161.782564 l
139.227429 168.288346 l
129.024 168.288346 l
cl
1.000 0.000 1.000 setrgbcolor
fill
grestore
gsave
357.1 266.1 57.6 38.02 clipbox
141.778286 155.379348 m
151.981714 155.379348 l
151.981714 168.33047 l
141.778286 168.33047 l
cl
1.000 0.000 1.000 setrgbcolor
fill
grestore
gsave
357.1 266.1 57.6 38.02 clipbox
154.532571 155.369323 m
164.736 155.369323 l
164.736 170.261341 l
154.532571 170.261341 l
cl
1.000 0.000 1.000 setrgbcolor
fill
grestore
gsave
357.1 266.1 57.6 38.02 clipbox
167.286857 158.125903 m
177.490286 158.125903 l
177.490286 163.344578 l
167.286857 163.344578 l
cl
1.000 0.000 1.000 setrgbcolor
fill
grestore
gsave
357.1 266.1 57.6 38.02 clipbox
180.041143 165.723753 m
190.244571 165.723753 l
190.244571 173.894532 l
180.041143 173.894532 l
cl
1.000 0.000 1.000 setrgbcolor
fill
grestore
gsave
357.1 266.1 57.6 38.02 clipbox
192.795429 179.292282 m
202.998857 179.292282 l
202.998857 193.171091 l
192.795429 193.171091 l
cl
1.000 0.000 1.000 setrgbcolor
fill
grestore
gsave
357.1 266.1 57.6 38.02 clipbox
205.549714 179.319773 m
215.753143 179.319773 l
215.753143 193.553391 l
205.549714 193.553391 l
cl
1.000 0.000 1.000 setrgbcolor
fill
grestore
gsave
357.1 266.1 57.6 38.02 clipbox
218.304 178.414593 m
228.507429 178.414593 l
228.507429 192.233566 l
218.304 192.233566 l
cl
1.000 0.000 1.000 setrgbcolor
fill
grestore
gsave
357.1 266.1 57.6 38.02 clipbox
231.058286 174.927638 m
241.261714 174.927638 l
241.261714 183.104978 l
231.058286 183.104978 l
cl
1.000 0.000 1.000 setrgbcolor
fill
grestore
gsave
357.1 266.1 57.6 38.02 clipbox
243.812571 173.99522 m
254.016 173.99522 l
254.016 181.27907 l
243.812571 181.27907 l
cl
1.000 0.000 1.000 setrgbcolor
fill
grestore
gsave
357.1 266.1 57.6 38.02 clipbox
256.566857 172.373385 m
266.770286 172.373385 l
266.770286 178.718102 l
256.566857 178.718102 l
cl
1.000 0.000 1.000 setrgbcolor
fill
grestore
gsave
357.1 266.1 57.6 38.02 clipbox
269.321143 172.250563 m
279.524571 172.250563 l
279.524571 177.47981 l
269.321143 177.47981 l
cl
1.000 0.000 1.000 setrgbcolor
fill
grestore
gsave
357.1 266.1 57.6 38.02 clipbox
282.075429 170.276185 m
292.278857 170.276185 l
292.278857 174.594245 l
282.075429 174.594245 l
cl
1.000 0.000 1.000 setrgbcolor
fill
grestore
gsave
357.1 266.1 57.6 38.02 clipbox
294.829714 167.659052 m
305.033143 167.659052 l
305.033143 170.112144 l
294.829714 170.112144 l
cl
1.000 0.000 1.000 setrgbcolor
fill
grestore
gsave
357.1 266.1 57.6 38.02 clipbox
307.584 166.732259 m
317.787429 166.732259 l
317.787429 173.088164 l
307.584 173.088164 l
cl
1.000 0.000 1.000 setrgbcolor
fill
grestore
gsave
357.1 266.1 57.6 38.02 clipbox
320.338286 161.995912 m
330.541714 161.995912 l
330.541714 167.982588 l
320.338286 167.982588 l
cl
1.000 0.000 1.000 setrgbcolor
fill
grestore
gsave
357.1 266.1 57.6 38.02 clipbox
333.092571 163.02783 m
343.296 163.02783 l
343.296 171.999728 l
333.092571 171.999728 l
cl
1.000 0.000 1.000 setrgbcolor
fill
grestore
gsave
357.1 266.1 57.6 38.02 clipbox
345.846857 165.363801 m
356.050286 165.363801 l
356.050286 173.270625 l
345.846857 173.270625 l
cl
1.000 0.000 1.000 setrgbcolor
fill
grestore
gsave
357.1 266.1 57.6 38.02 clipbox
358.601143 164.690549 m
368.804571 164.690549 l
368.804571 169.662323 l
358.601143 169.662323 l
cl
1.000 0.000 1.000 setrgbcolor
fill
grestore
gsave
357.1 266.1 57.6 38.02 clipbox
371.355429 161.683362 m
381.558857 161.683362 l
381.558857 168.18543 l
371.355429 168.18543 l
cl
1.000 0.000 1.000 setrgbcolor
fill
grestore
gsave
357.1 266.1 57.6 38.02 clipbox
78.006857 166.771061 m
88.210286 166.771061 l
88.210286 173.728617 l
78.006857 173.728617 l
cl
0.000 1.000 0.000 setrgbcolor
fill
grestore
gsave
357.1 266.1 57.6 38.02 clipbox
90.761143 168.457911 m
100.964571 168.457911 l
100.964571 176.301807 l
90.761143 176.301807 l
cl
0.000 1.000 0.000 setrgbcolor
fill
grestore
gsave
357.1 266.1 57.6 38.02 clipbox
103.515429 167.537337 m
113.718857 167.537337 l
113.718857 174.962202 l
103.515429 174.962202 l
cl
0.000 1.000 0.000 setrgbcolor
fill
grestore
gsave
357.1 266.1 57.6 38.02 clipbox
116.269714 168.526442 m
126.473143 168.526442 l
126.473143 176.383886 l
116.269714 176.383886 l
cl
0.000 1.000 0.000 setrgbcolor
fill
grestore
gsave
357.1 266.1 57.6 38.02 clipbox
129.024 168.288346 m
139.227429 168.288346 l
139.227429 175.985787 l
129.024 175.985787 l
cl
0.000 1.000 0.000 setrgbcolor
fill
grestore
gsave
357.1 266.1 57.6 38.02 clipbox
141.778286 168.33047 m
151.981714 168.33047 l
151.981714 169.681077 l
141.778286 169.681077 l
cl
0.000 1.000 0.000 setrgbcolor
fill
grestore
gsave
357.1 266.1 57.6 38.02 clipbox
154.532571 170.261341 m
164.736 170.261341 l
164.736 177.634768 l
154.532571 177.634768 l
cl
0.000 1.000 0.000 setrgbcolor
fill
grestore
gsave
357.1 266.1 57.6 38.02 clipbox
167.286857 163.344578 m
177.490286 163.344578 l
177.490286 167.998341 l
167.286857 167.998341 l
cl
0.000 1.000 0.000 setrgbcolor
fill
grestore
gsave
357.1 266.1 57.6 38.02 clipbox
180.041143 173.894532 m
190.244571 173.894532 l
190.244571 175.246053 l
180.041143 175.246053 l
cl
0.000 1.000 0.000 setrgbcolor
fill
grestore
gsave
357.1 266.1 57.6 38.02 clipbox
192.795429 193.171091 m
202.998857 193.171091 l
202.998857 194.563977 l
192.795429 194.563977 l
cl
0.000 1.000 0.000 setrgbcolor
fill
grestore
gsave
357.1 266.1 57.6 38.02 clipbox
205.549714 193.553391 m
215.753143 193.553391 l
215.753143 194.8292 l
205.549714 194.8292 l
cl
0.000 1.000 0.000 setrgbcolor
fill
grestore
gsave
357.1 266.1 57.6 38.02 clipbox
218.304 192.233566 m
228.507429 192.233566 l
228.507429 193.597414 l
218.304 193.597414 l
cl
0.000 1.000 0.000 setrgbcolor
fill
grestore
gsave
357.1 266.1 57.6 38.02 clipbox
231.058286 183.104978 m
241.261714 183.104978 l
241.261714 196.216985 l
231.058286 196.216985 l
cl
0.000 1.000 0.000 setrgbcolor
fill
grestore
gsave
357.1 266.1 57.6 38.02 clipbox
243.812571 181.27907 m
254.016 181.27907 l
254.016 195.292791 l
243.812571 195.292791 l
cl
0.000 1.000 0.000 setrgbcolor
fill
grestore
gsave
357.1 266.1 57.6 38.02 clipbox
256.566857 178.718102 m
266.770286 178.718102 l
266.770286 192.271146 l
256.566857 192.271146 l
cl
0.000 1.000 0.000 setrgbcolor
fill
grestore
gsave
357.1 266.1 57.6 38.02 clipbox
269.321143 177.47981 m
279.524571 177.47981 l
279.524571 189.994957 l
269.321143 189.994957 l
cl
0.000 1.000 0.000 setrgbcolor
fill
grestore
gsave
357.1 266.1 57.6 38.02 clipbox
282.075429 174.594245 m
292.278857 174.594245 l
292.278857 186.196208 l
282.075429 186.196208 l
cl
0.000 1.000 0.000 setrgbcolor
fill
grestore
gsave
357.1 266.1 57.6 38.02 clipbox
294.829714 170.112144 m
305.033143 170.112144 l
305.033143 180.952764 l
294.829714 180.952764 l
cl
0.000 1.000 0.000 setrgbcolor
fill
grestore
gsave
357.1 266.1 57.6 38.02 clipbox
307.584 173.088164 m
317.787429 173.088164 l
317.787429 186.893869 l
307.584 186.893869 l
cl
0.000 1.000 0.000 setrgbcolor
fill
grestore
gsave
357.1 266.1 57.6 38.02 clipbox
320.338286 167.982588 m
330.541714 167.982588 l
330.541714 178.769322 l
320.338286 178.769322 l
cl
0.000 1.000 0.000 setrgbcolor
fill
grestore
gsave
357.1 266.1 57.6 38.02 clipbox
333.092571 171.999728 m
343.296 171.999728 l
343.296 181.021181 l
333.092571 181.021181 l
cl
0.000 1.000 0.000 setrgbcolor
fill
grestore
gsave
357.1 266.1 57.6 38.02 clipbox
345.846857 173.270625 m
356.050286 173.270625 l
356.050286 181.419659 l
345.846857 181.419659 l
cl
0.000 1.000 0.000 setrgbcolor
fill
grestore
gsave
357.1 266.1 57.6 38.02 clipbox
358.601143 169.662323 m
368.804571 169.662323 l
368.804571 176.992015 l
358.601143 176.992015 l
cl
0.000 1.000 0.000 setrgbcolor
fill
grestore
gsave
357.1 266.1 57.6 38.02 clipbox
371.355429 168.18543 m
381.558857 168.18543 l
381.558857 174.648547 l
371.355429 174.648547 l
cl
0.000 1.000 0.000 setrgbcolor
fill
grestore
gsave
357.1 266.1 57.6 38.02 clipbox
78.006857 173.728617 m
88.210286 173.728617 l
88.210286 180.884432 l
78.006857 180.884432 l
cl
0.000 0.502 0.000 setrgbcolor
fill
grestore
gsave
357.1 266.1 57.6 38.02 clipbox
90.761143 176.301807 m
100.964571 176.301807 l
100.964571 184.333976 l
90.761143 184.333976 l
cl
0.000 0.502 0.000 setrgbcolor
fill
grestore
gsave
357.1 266.1 57.6 38.02 clipbox
103.515429 174.962202 m
113.718857 174.962202 l
113.718857 182.576385 l
103.515429 182.576385 l
cl
0.000 0.502 0.000 setrgbcolor
fill
grestore
gsave
357.1 266.1 57.6 38.02 clipbox
116.269714 176.383886 m
126.473143 176.383886 l
126.473143 184.489086 l
116.269714 184.489086 l
cl
0.000 0.502 0.000 setrgbcolor
fill
grestore
gsave
357.1 266.1 57.6 38.02 clipbox
129.024 175.985787 m
139.227429 175.985787 l
139.227429 186.512903 l
129.024 186.512903 l
cl
0.000 0.502 0.000 setrgbcolor
fill
grestore
gsave
357.1 266.1 57.6 38.02 clipbox
141.778286 169.681077 m
151.981714 169.681077 l
151.981714 174.918748 l
141.778286 174.918748 l
cl
0.000 0.502 0.000 setrgbcolor
fill
grestore
gsave
357.1 266.1 57.6 38.02 clipbox
154.532571 177.634768 m
164.736 177.634768 l
164.736 179.155115 l
154.532571 179.155115 l
cl
0.000 0.502 0.000 setrgbcolor
fill
grestore
gsave
357.1 266.1 57.6 38.02 clipbox
167.286857 167.998341 m
177.490286 167.998341 l
177.490286 169.551343 l
167.286857 169.551343 l
cl
0.000 0.502 0.000 setrgbcolor
fill
grestore
gsave
357.1 266.1 57.6 38.02 clipbox
180.041143 175.246053 m
190.244571 175.246053 l
190.244571 191.245424 l
180.041143 191.245424 l
cl
0.000 0.502 0.000 setrgbcolor
fill
grestore
gsave
357.1 266.1 57.6 38.02 clipbox
192.795429 194.563977 m
202.998857 194.563977 l
202.998857 224.123006 l
192.795429 224.123006 l
cl
0.000 0.502 0.000 setrgbcolor
fill
grestore
gsave
357.1 266.1 57.6 38.02 clipbox
205.549714 194.8292 m
215.753143 194.8292 l
215.753143 226.750323 l
205.549714 226.750323 l
cl
0.000 0.502 0.000 setrgbcolor
fill
grestore
gsave
357.1 266.1 57.6 38.02 clipbox
218.304 193.597414 m
228.507429 193.597414 l
228.507429 224.600558 l
218.304 224.600558 l
cl
0.000 0.502 0.000 setrgbcolor
fill
grestore
gsave
357.1 266.1 57.6 38.02 clipbox
231.058286 196.216985 m
241.261714 196.216985 l
241.261714 214.244804 l
231.058286 214.244804 l
cl
0.000 0.502 0.000 setrgbcolor
fill
grestore
gsave
357.1 266.1 57.6 38.02 clipbox
243.812571 195.292791 m
254.016 195.292791 l
254.016 209.479131 l
243.812571 209.479131 l
cl
0.000 0.502 0.000 setrgbcolor
fill
grestore
gsave
357.1 266.1 57.6 38.02 clipbox
256.566857 192.271146 m
266.770286 192.271146 l
266.770286 204.647329 l
256.566857 204.647329 l
cl
0.000 0.502 0.000 setrgbcolor
fill
grestore
gsave
357.1 266.1 57.6 38.02 clipbox
269.321143 189.994957 m
279.524571 189.994957 l
279.524571 205.986937 l
269.321143 205.986937 l
cl
0.000 0.502 0.000 setrgbcolor
fill
grestore
gsave
357.1 266.1 57.6 38.02 clipbox
282.075429 186.196208 m
292.278857 186.196208 l
292.278857 197.622573 l
282.075429 197.622573 l
cl
0.000 0.502 0.000 setrgbcolor
fill
grestore
gsave
357.1 266.1 57.6 38.02 clipbox
294.829714 180.952764 m
305.033143 180.952764 l
305.033143 188.71356 l
294.829714 188.71356 l
cl
0.000 0.502 0.000 setrgbcolor
fill
grestore
gsave
357.1 266.1 57.6 38.02 clipbox
307.584 186.893869 m
317.787429 186.893869 l
317.787429 195.804483 l
307.584 195.804483 l
cl
0.000 0.502 0.000 setrgbcolor
fill
grestore
gsave
357.1 266.1 57.6 38.02 clipbox
320.338286 178.769322 m
330.541714 178.769322 l
330.541714 185.529545 l
320.338286 185.529545 l
cl
0.000 0.502 0.000 setrgbcolor
fill
grestore
gsave
357.1 266.1 57.6 38.02 clipbox
333.092571 181.021181 m
343.296 181.021181 l
343.296 186.896706 l
333.092571 186.896706 l
cl
0.000 0.502 0.000 setrgbcolor
fill
grestore
gsave
357.1 266.1 57.6 38.02 clipbox
345.846857 181.419659 m
356.050286 181.419659 l
356.050286 189.648749 l
345.846857 189.648749 l
cl
0.000 0.502 0.000 setrgbcolor
fill
grestore
gsave
357.1 266.1 57.6 38.02 clipbox
358.601143 176.992015 m
368.804571 176.992015 l
368.804571 183.429136 l
358.601143 183.429136 l
cl
0.000 0.502 0.000 setrgbcolor
fill
grestore
gsave
357.1 266.1 57.6 38.02 clipbox
371.355429 174.648547 m
381.558857 174.648547 l
381.558857 181.323196 l
371.355429 181.323196 l
cl
0.000 0.502 0.000 setrgbcolor
fill
grestore
gsave
357.1 266.1 57.6 38.02 clipbox
78.006857 180.884432 m
88.210286 180.884432 l
88.210286 185.423455 l
78.006857 185.423455 l
cl
0.000 0.000 1.000 setrgbcolor
fill
grestore
gsave
357.1 266.1 57.6 38.02 clipbox
90.761143 184.333976 m
100.964571 184.333976 l
100.964571 188.593328 l
90.761143 188.593328 l
cl
0.000 0.000 1.000 setrgbcolor
fill
grestore
gsave
357.1 266.1 57.6 38.02 clipbox
103.515429 182.576385 m
113.718857 182.576385 l
113.718857 186.35408 l
103.515429 186.35408 l
cl
0.000 0.000 1.000 setrgbcolor
fill
grestore
gsave
357.1 266.1 57.6 38.02 clipbox
116.269714 184.489086 m
126.473143 184.489086 l
126.473143 188.741051 l
116.269714 188.741051 l
cl
0.000 0.000 1.000 setrgbcolor
fill
grestore
gsave
357.1 266.1 57.6 38.02 clipbox
129.024 186.512903 m
139.227429 186.512903 l
139.227429 190.632813 l
129.024 190.632813 l
cl
0.000 0.000 1.000 setrgbcolor
fill
grestore
gsave
357.1 266.1 57.6 38.02 clipbox
141.778286 174.918748 m
151.981714 174.918748 l
151.981714 182.69999 l
141.778286 182.69999 l
cl
0.000 0.000 1.000 setrgbcolor
fill
grestore
gsave
357.1 266.1 57.6 38.02 clipbox
154.532571 179.155115 m
164.736 179.155115 l
164.736 191.707008 l
154.532571 191.707008 l
cl
0.000 0.000 1.000 setrgbcolor
fill
grestore
gsave
357.1 266.1 57.6 38.02 clipbox
167.286857 169.551343 m
177.490286 169.551343 l
177.490286 191.619404 l
167.286857 191.619404 l
cl
0.000 0.000 1.000 setrgbcolor
fill
grestore
gsave
357.1 266.1 57.6 38.02 clipbox
180.041143 191.245424 m
190.244571 191.245424 l
190.244571 206.039965 l
180.041143 206.039965 l
cl
0.000 0.000 1.000 setrgbcolor
fill
grestore
gsave
357.1 266.1 57.6 38.02 clipbox
192.795429 224.123006 m
202.998857 224.123006 l
202.998857 226.616824 l
192.795429 226.616824 l
cl
0.000 0.000 1.000 setrgbcolor
fill
grestore
gsave
357.1 266.1 57.6 38.02 clipbox
205.549714 226.750323 m
215.753143 226.750323 l
215.753143 229.110865 l
205.549714 229.110865 l
cl
0.000 0.000 1.000 setrgbcolor
fill
grestore
gsave
357.1 266.1 57.6 38.02 clipbox
218.304 224.600558 m
228.507429 224.600558 l
228.507429 228.156881 l
218.304 228.156881 l
cl
0.000 0.000 1.000 setrgbcolor
fill
grestore
gsave
357.1 266.1 57.6 38.02 clipbox
231.058286 214.244804 m
241.261714 214.244804 l
241.261714 227.348271 l
231.058286 227.348271 l
cl
0.000 0.000 1.000 setrgbcolor
fill
grestore
gsave
357.1 266.1 57.6 38.02 clipbox
243.812571 209.479131 m
254.016 209.479131 l
254.016 223.47045 l
243.812571 223.47045 l
cl
0.000 0.000 1.000 setrgbcolor
fill
grestore
gsave
357.1 266.1 57.6 38.02 clipbox
256.566857 204.647329 m
266.770286 204.647329 l
266.770286 218.221895 l
256.566857 218.221895 l
cl
0.000 0.000 1.000 setrgbcolor
fill
grestore
gsave
357.1 266.1 57.6 38.02 clipbox
269.321143 205.986937 m
279.524571 205.986937 l
279.524571 218.5383 l
269.321143 218.5383 l
cl
0.000 0.000 1.000 setrgbcolor
fill
grestore
gsave
357.1 266.1 57.6 38.02 clipbox
282.075429 197.622573 m
292.278857 197.622573 l
292.278857 210.374812 l
282.075429 210.374812 l
cl
0.000 0.000 1.000 setrgbcolor
fill
grestore
gsave
357.1 266.1 57.6 38.02 clipbox
294.829714 188.71356 m
305.033143 188.71356 l
305.033143 199.910058 l
294.829714 199.910058 l
cl
0.000 0.000 1.000 setrgbcolor
fill
grestore
gsave
357.1 266.1 57.6 38.02 clipbox
307.584 195.804483 m
317.787429 195.804483 l
317.787429 201.762866 l
307.584 201.762866 l
cl
0.000 0.000 1.000 setrgbcolor
fill
grestore
gsave
357.1 266.1 57.6 38.02 clipbox
320.338286 185.529545 m
330.541714 185.529545 l
330.541714 191.491748 l
320.338286 191.491748 l
cl
0.000 0.000 1.000 setrgbcolor
fill
grestore
gsave
357.1 266.1 57.6 38.02 clipbox
333.092571 186.896706 m
343.296 186.896706 l
343.296 192.842364 l
333.092571 192.842364 l
cl
0.000 0.000 1.000 setrgbcolor
fill
grestore
gsave
357.1 266.1 57.6 38.02 clipbox
345.846857 189.648749 m
356.050286 189.648749 l
356.050286 193.358892 l
345.846857 193.358892 l
cl
0.000 0.000 1.000 setrgbcolor
fill
grestore
gsave
357.1 266.1 57.6 38.02 clipbox
358.601143 183.429136 m
368.804571 183.429136 l
368.804571 187.000179 l
358.601143 187.000179 l
cl
0.000 0.000 1.000 setrgbcolor
fill
grestore
gsave
357.1 266.1 57.6 38.02 clipbox
371.355429 181.323196 m
381.558857 181.323196 l
381.558857 185.457472 l
371.355429 185.457472 l
cl
0.000 0.000 1.000 setrgbcolor
fill
grestore
gsave
357.1 266.1 57.6 38.02 clipbox
78.006857 185.423455 m
88.210286 185.423455 l
88.210286 192.727744 l
78.006857 192.727744 l
cl
0.000 0.000 0.502 setrgbcolor
fill
grestore
gsave
357.1 266.1 57.6 38.02 clipbox
90.761143 188.593328 m
100.964571 188.593328 l
100.964571 195.652621 l
90.761143 195.652621 l
cl
0.000 0.000 0.502 setrgbcolor
fill
grestore
gsave
357.1 266.1 57.6 38.02 clipbox
103.515429 186.35408 m
113.718857 186.35408 l
113.718857 192.932636 l
103.515429 192.932636 l
cl
0.000 0.000 0.502 setrgbcolor
fill
grestore
gsave
357.1 266.1 57.6 38.02 clipbox
116.269714 188.741051 m
126.473143 188.741051 l
126.473143 195.710193 l
116.269714 195.710193 l
cl
0.000 0.000 0.502 setrgbcolor
fill
grestore
gsave
357.1 266.1 57.6 38.02 clipbox
129.024 190.632813 m
139.227429 190.632813 l
139.227429 197.523557 l
129.024 197.523557 l
cl
0.000 0.000 0.502 setrgbcolor
fill
grestore
gsave
357.1 266.1 57.6 38.02 clipbox
141.778286 182.69999 m
151.981714 182.69999 l
151.981714 193.294572 l
141.778286 193.294572 l
cl
0.000 0.000 0.502 setrgbcolor
fill
grestore
gsave
357.1 266.1 57.6 38.02 clipbox
154.532571 191.707008 m
164.736 191.707008 l
164.736 204.214327 l
154.532571 204.214327 l
cl
0.000 0.000 0.502 setrgbcolor
fill
grestore
gsave
357.1 266.1 57.6 38.02 clipbox
167.286857 191.619404 m
177.490286 191.619404 l
177.490286 213.673157 l
167.286857 213.673157 l
cl
0.000 0.000 0.502 setrgbcolor
fill
grestore
gsave
357.1 266.1 57.6 38.02 clipbox
180.041143 206.039965 m
190.244571 206.039965 l
190.244571 221.918331 l
180.041143 221.918331 l
cl
0.000 0.000 0.502 setrgbcolor
fill
grestore
gsave
357.1 266.1 57.6 38.02 clipbox
192.795429 226.616824 m
202.998857 226.616824 l
202.998857 230.781955 l
192.795429 230.781955 l
cl
0.000 0.000 0.502 setrgbcolor
fill
grestore
gsave
357.1 266.1 57.6 38.02 clipbox
205.549714 229.110865 m
215.753143 229.110865 l
215.753143 233.097016 l
205.549714 233.097016 l
cl
0.000 0.000 0.502 setrgbcolor
fill
grestore
gsave
357.1 266.1 57.6 38.02 clipbox
218.304 228.156881 m
228.507429 228.156881 l
228.507429 232.360645 l
218.304 232.360645 l
cl
0.000 0.000 0.502 setrgbcolor
fill
grestore
gsave
357.1 266.1 57.6 38.02 clipbox
231.058286 227.348271 m
241.261714 227.348271 l
241.261714 244.387498 l
231.058286 244.387498 l
cl
0.000 0.000 0.502 setrgbcolor
fill
grestore
gsave
357.1 266.1 57.6 38.02 clipbox
243.812571 223.47045 m
254.016 223.47045 l
254.016 244.637546 l
243.812571 244.637546 l
cl
0.000 0.000 0.502 setrgbcolor
fill
grestore
gsave
357.1 266.1 57.6 38.02 clipbox
256.566857 218.221895 m
266.770286 218.221895 l
266.770286 237.307627 l
256.566857 237.307627 l
cl
0.000 0.000 0.502 setrgbcolor
fill
grestore
gsave
357.1 266.1 57.6 38.02 clipbox
269.321143 218.5383 m
279.524571 218.5383 l
279.524571 233.818318 l
269.321143 233.818318 l
cl
0.000 0.000 0.502 setrgbcolor
fill
grestore
gsave
357.1 266.1 57.6 38.02 clipbox
282.075429 210.374812 m
292.278857 210.374812 l
292.278857 224.746351 l
282.075429 224.746351 l
cl
0.000 0.000 0.502 setrgbcolor
fill
grestore
gsave
357.1 266.1 57.6 38.02 clipbox
294.829714 199.910058 m
305.033143 199.910058 l
305.033143 215.029929 l
294.829714 215.029929 l
cl
0.000 0.000 0.502 setrgbcolor
fill
grestore
gsave
357.1 266.1 57.6 38.02 clipbox
307.584 201.762866 m
317.787429 201.762866 l
317.787429 212.782336 l
307.584 212.782336 l
cl
0.000 0.000 0.502 setrgbcolor
fill
grestore
gsave
357.1 266.1 57.6 38.02 clipbox
320.338286 191.491748 m
330.541714 191.491748 l
330.541714 201.806237 l
320.338286 201.806237 l
cl
0.000 0.000 0.502 setrgbcolor
fill
grestore
gsave
357.1 266.1 57.6 38.02 clipbox
333.092571 192.842364 m
343.296 192.842364 l
343.296 199.396856 l
333.092571 199.396856 l
cl
0.000 0.000 0.502 setrgbcolor
fill
grestore
gsave
357.1 266.1 57.6 38.02 clipbox
345.846857 193.358892 m
356.050286 193.358892 l
356.050286 198.763825 l
345.846857 198.763825 l
cl
0.000 0.000 0.502 setrgbcolor
fill
grestore
gsave
357.1 266.1 57.6 38.02 clipbox
358.601143 187.000179 m
368.804571 187.000179 l
368.804571 193.297442 l
358.601143 193.297442 l
cl
0.000 0.000 0.502 setrgbcolor
fill
grestore
gsave
357.1 266.1 57.6 38.02 clipbox
371.355429 185.457472 m
381.558857 185.457472 l
381.558857 192.101373 l
371.355429 192.101373 l
cl
0.000 0.000 0.502 setrgbcolor
fill
grestore
gsave
357.1 266.1 57.6 38.02 clipbox
78.006857 192.727744 m
88.210286 192.727744 l
88.210286 198.431443 l
78.006857 198.431443 l
cl
0.000 setgray
fill
grestore
gsave
357.1 266.1 57.6 38.02 clipbox
90.761143 195.652621 m
100.964571 195.652621 l
100.964571 202.26045 l
90.761143 202.26045 l
cl
0.000 setgray
fill
grestore
gsave
357.1 266.1 57.6 38.02 clipbox
103.515429 192.932636 m
113.718857 192.932636 l
113.718857 199.095218 l
103.515429 199.095218 l
cl
0.000 setgray
fill
grestore
gsave
357.1 266.1 57.6 38.02 clipbox
116.269714 195.710193 m
126.473143 195.710193 l
126.473143 202.307437 l
116.269714 202.307437 l
cl
0.000 setgray
fill
grestore
gsave
357.1 266.1 57.6 38.02 clipbox
129.024 197.523557 m
139.227429 197.523557 l
139.227429 204.048554 l
129.024 204.048554 l
cl
0.000 setgray
fill
grestore
gsave
357.1 266.1 57.6 38.02 clipbox
141.778286 193.294572 m
151.981714 193.294572 l
151.981714 203.451074 l
141.778286 203.451074 l
cl
0.000 setgray
fill
grestore
gsave
357.1 266.1 57.6 38.02 clipbox
154.532571 204.214327 m
164.736 204.214327 l
164.736 216.320173 l
154.532571 216.320173 l
cl
0.000 setgray
fill
grestore
gsave
357.1 266.1 57.6 38.02 clipbox
167.286857 213.673157 m
177.490286 213.673157 l
177.490286 221.102675 l
167.286857 221.102675 l
cl
0.000 setgray
fill
grestore
gsave
357.1 266.1 57.6 38.02 clipbox
180.041143 221.918331 m
190.244571 221.918331 l
190.244571 233.406092 l
180.041143 233.406092 l
cl
0.000 setgray
fill
grestore
gsave
357.1 266.1 57.6 38.02 clipbox
192.795429 230.781955 m
202.998857 230.781955 l
202.998857 244.67494 l
192.795429 244.67494 l
cl
0.000 setgray
fill
grestore
gsave
357.1 266.1 57.6 38.02 clipbox
205.549714 233.097016 m
215.753143 233.097016 l
215.753143 247.364492 l
205.549714 247.364492 l
cl
0.000 setgray
fill
grestore
gsave
357.1 266.1 57.6 38.02 clipbox
218.304 232.360645 m
228.507429 232.360645 l
228.507429 246.186399 l
218.304 246.186399 l
cl
0.000 setgray
fill
grestore
gsave
357.1 266.1 57.6 38.02 clipbox
231.058286 244.387498 m
241.261714 244.387498 l
241.261714 252.543698 l
231.058286 252.543698 l
cl
0.000 setgray
fill
grestore
gsave
357.1 266.1 57.6 38.02 clipbox
243.812571 244.637546 m
254.016 244.637546 l
254.016 251.891255 l
243.812571 251.891255 l
cl
0.000 setgray
fill
grestore
gsave
357.1 266.1 57.6 38.02 clipbox
256.566857 237.307627 m
266.770286 237.307627 l
266.770286 243.665893 l
256.566857 243.665893 l
cl
0.000 setgray
fill
grestore
gsave
357.1 266.1 57.6 38.02 clipbox
269.321143 233.818318 m
279.524571 233.818318 l
279.524571 239.044637 l
269.321143 239.044637 l
cl
0.000 setgray
fill
grestore
gsave
357.1 266.1 57.6 38.02 clipbox
282.075429 224.746351 m
292.278857 224.746351 l
292.278857 229.062326 l
282.075429 229.062326 l
cl
0.000 setgray
fill
grestore
gsave
357.1 266.1 57.6 38.02 clipbox
294.829714 215.029929 m
305.033143 215.029929 l
305.033143 217.523122 l
294.829714 217.523122 l
cl
0.000 setgray
fill
grestore
gsave
357.1 266.1 57.6 38.02 clipbox
307.584 212.782336 m
317.787429 212.782336 l
317.787429 215.79505 l
307.584 215.79505 l
cl
0.000 setgray
fill
grestore
gsave
357.1 266.1 57.6 38.02 clipbox
320.338286 201.806237 m
330.541714 201.806237 l
330.541714 207.252429 l
320.338286 207.252429 l
cl
0.000 setgray
fill
grestore
gsave
357.1 266.1 57.6 38.02 clipbox
333.092571 199.396856 m
343.296 199.396856 l
343.296 207.20856 l
333.092571 207.20856 l
cl
0.000 setgray
fill
grestore
gsave
357.1 266.1 57.6 38.02 clipbox
345.846857 198.763825 m
356.050286 198.763825 l
356.050286 208.850786 l
345.846857 208.850786 l
cl
0.000 setgray
fill
grestore
gsave
357.1 266.1 57.6 38.02 clipbox
358.601143 193.297442 m
368.804571 193.297442 l
368.804571 198.437826 l
358.601143 198.437826 l
cl
0.000 setgray
fill
grestore
gsave
357.1 266.1 57.6 38.02 clipbox
371.355429 192.101373 m
381.558857 192.101373 l
381.558857 199.752692 l
371.355429 199.752692 l
cl
0.000 setgray
fill
grestore
gsave
357.1 266.1 57.6 38.02 clipbox
78.006857 198.431443 m
88.210286 198.431443 l
88.210286 206.318352 l
78.006857 206.318352 l
cl
1.000 0.000 0.000 setrgbcolor
fill
grestore
gsave
357.1 266.1 57.6 38.02 clipbox
90.761143 202.26045 m
100.964571 202.26045 l
100.964571 209.844282 l
90.761143 209.844282 l
cl
1.000 0.000 0.000 setrgbcolor
fill
grestore
gsave
357.1 266.1 57.6 38.02 clipbox
103.515429 199.095218 m
113.718857 199.095218 l
113.718857 206.214009 l
103.515429 206.214009 l
cl
1.000 0.000 0.000 setrgbcolor
fill
grestore
gsave
357.1 266.1 57.6 38.02 clipbox
116.269714 202.307437 m
126.473143 202.307437 l
126.473143 209.860649 l
116.269714 209.860649 l
cl
1.000 0.000 0.000 setrgbcolor
fill
grestore
gsave
357.1 266.1 57.6 38.02 clipbox
129.024 204.048554 m
139.227429 204.048554 l
139.227429 211.451929 l
129.024 211.451929 l
cl
1.000 0.000 0.000 setrgbcolor
fill
grestore
gsave
357.1 266.1 57.6 38.02 clipbox
141.778286 203.451074 m
151.981714 203.451074 l
151.981714 216.307059 l
141.778286 216.307059 l
cl
1.000 0.000 0.000 setrgbcolor
fill
grestore
gsave
357.1 266.1 57.6 38.02 clipbox
154.532571 216.320173 m
164.736 216.320173 l
164.736 229.416593 l
154.532571 229.416593 l
cl
1.000 0.000 0.000 setrgbcolor
fill
grestore
gsave
357.1 266.1 57.6 38.02 clipbox
167.286857 221.102675 m
177.490286 221.102675 l
177.490286 241.970145 l
167.286857 241.970145 l
cl
1.000 0.000 0.000 setrgbcolor
fill
grestore
gsave
357.1 266.1 57.6 38.02 clipbox
180.041143 233.406092 m
190.244571 233.406092 l
190.244571 256.047009 l
180.041143 256.047009 l
cl
1.000 0.000 0.000 setrgbcolor
fill
grestore
gsave
357.1 266.1 57.6 38.02 clipbox
192.795429 244.67494 m
202.998857 244.67494 l
202.998857 261.480004 l
192.795429 261.480004 l
cl
1.000 0.000 0.000 setrgbcolor
fill
grestore
gsave
357.1 266.1 57.6 38.02 clipbox
205.549714 247.364492 m
215.753143 247.364492 l
215.753143 264.352465 l
205.549714 264.352465 l
cl
1.000 0.000 0.000 setrgbcolor
fill
grestore
gsave
357.1 266.1 57.6 38.02 clipbox
218.304 246.186399 m
228.507429 246.186399 l
228.507429 263.975132 l
218.304 263.975132 l
cl
1.000 0.000 0.000 setrgbcolor
fill
grestore
gsave
357.1 266.1 57.6 38.02 clipbox
231.058286 252.543698 m
241.261714 252.543698 l
241.261714 264.519894 l
231.058286 264.519894 l
cl
1.000 0.000 0.000 setrgbcolor
fill
grestore
gsave
357.1 266.1 57.6 38.02 clipbox
243.812571 251.891255 m
254.016 251.891255 l
254.016 261.935789 l
243.812571 261.935789 l
cl
1.000 0.000 0.000 setrgbcolor
fill
grestore
gsave
357.1 266.1 57.6 38.02 clipbox
256.566857 243.665893 m
266.770286 243.665893 l
266.770286 252.80556 l
256.566857 252.80556 l
cl
1.000 0.000 0.000 setrgbcolor
fill
grestore
gsave
357.1 266.1 57.6 38.02 clipbox
269.321143 239.044637 m
279.524571 239.044637 l
279.524571 247.033835 l
269.321143 247.033835 l
cl
1.000 0.000 0.000 setrgbcolor
fill
grestore
gsave
357.1 266.1 57.6 38.02 clipbox
282.075429 229.062326 m
292.278857 229.062326 l
292.278857 237.232155 l
282.075429 237.232155 l
cl
1.000 0.000 0.000 setrgbcolor
fill
grestore
gsave
357.1 266.1 57.6 38.02 clipbox
294.829714 217.523122 m
305.033143 217.523122 l
305.033143 228.879313 l
294.829714 228.879313 l
cl
1.000 0.000 0.000 setrgbcolor
fill
grestore
gsave
357.1 266.1 57.6 38.02 clipbox
307.584 215.79505 m
317.787429 215.79505 l
317.787429 220.306313 l
307.584 220.306313 l
cl
1.000 0.000 0.000 setrgbcolor
fill
grestore
gsave
357.1 266.1 57.6 38.02 clipbox
320.338286 207.252429 m
330.541714 207.252429 l
330.541714 213.75385 l
320.338286 213.75385 l
cl
1.000 0.000 0.000 setrgbcolor
fill
grestore
gsave
357.1 266.1 57.6 38.02 clipbox
333.092571 207.20856 m
343.296 207.20856 l
343.296 213.735956 l
333.092571 213.735956 l
cl
1.000 0.000 0.000 setrgbcolor
fill
grestore
gsave
357.1 266.1 57.6 38.02 clipbox
345.846857 208.850786 m
356.050286 208.850786 l
356.050286 215.947767 l
345.846857 215.947767 l
cl
1.000 0.000 0.000 setrgbcolor
fill
grestore
gsave
357.1 266.1 57.6 38.02 clipbox
358.601143 198.437826 m
368.804571 198.437826 l
368.804571 207.503845 l
358.601143 207.503845 l
cl
1.000 0.000 0.000 setrgbcolor
fill
grestore
gsave
357.1 266.1 57.6 38.02 clipbox
371.355429 199.752692 m
381.558857 199.752692 l
381.558857 206.415686 l
371.355429 206.415686 l
cl
1.000 0.000 0.000 setrgbcolor
fill
grestore
0.800 setlinewidth
1 setlinejoin
0 setlinecap
[] 0 setdash
0.000 setgray
gsave
/o {
gsave
newpath
translate
0.8 setlinewidth
1 setlinejoin
0 setlinecap
0 0 m
0 -3.5 l

gsave
0.000 setgray
fill
grestore
stroke
grestore
} bind def
83.1086 38.016 o
grestore
/DejaVuSans findfont
10.000 scalefont
setfont
gsave
79.928884 23.422250 translate
0.000000 rotate
0.000000 0.000000 m /zero glyphshow
grestore
gsave
/o {
gsave
newpath
translate
0.8 setlinewidth
1 setlinejoin
0 setlinecap
0 0 m
0 -3.5 l

gsave
0.000 setgray
fill
grestore
stroke
grestore
} bind def
146.88 38.016 o
grestore
gsave
143.700312 23.422250 translate
0.000000 rotate
0.000000 0.000000 m /five glyphshow
grestore
gsave
/o {
gsave
newpath
translate
0.8 setlinewidth
1 setlinejoin
0 setlinecap
0 0 m
0 -3.5 l

gsave
0.000 setgray
fill
grestore
stroke
grestore
} bind def
210.651 38.016 o
grestore
gsave
204.292054 23.422250 translate
0.000000 rotate
0.000000 0.000000 m /one glyphshow
6.362305 0.000000 m /zero glyphshow
grestore
gsave
/o {
gsave
newpath
translate
0.8 setlinewidth
1 setlinejoin
0 setlinecap
0 0 m
0 -3.5 l

gsave
0.000 setgray
fill
grestore
stroke
grestore
} bind def
274.423 38.016 o
grestore
gsave
268.063482 23.422250 translate
0.000000 rotate
0.000000 0.000000 m /one glyphshow
6.362305 0.000000 m /five glyphshow
grestore
gsave
/o {
gsave
newpath
translate
0.8 setlinewidth
1 setlinejoin
0 setlinecap
0 0 m
0 -3.5 l

gsave
0.000 setgray
fill
grestore
stroke
grestore
} bind def
338.194 38.016 o
grestore
gsave
331.834911 23.422250 translate
0.000000 rotate
0.000000 0.000000 m /two glyphshow
6.362305 0.000000 m /zero glyphshow
grestore
gsave
/o {
gsave
newpath
translate
0.8 setlinewidth
1 setlinejoin
0 setlinecap
0 0 m
0 -3.5 l

gsave
0.000 setgray
fill
grestore
stroke
grestore
} bind def
401.966 38.016 o
grestore
gsave
395.606339 23.422250 translate
0.000000 rotate
0.000000 0.000000 m /two glyphshow
6.362305 0.000000 m /five glyphshow
grestore
gsave
/o {
gsave
newpath
translate
0.8 setlinewidth
1 setlinejoin
0 setlinecap
0 0 m
-3.5 0 l

gsave
0.000 setgray
fill
grestore
stroke
grestore
} bind def
57.6 43.0623 o
grestore
gsave
29.506250 39.265459 translate
0.000000 rotate
0.000000 0.000000 m /minus glyphshow
8.378906 0.000000 m /one glyphshow
14.741211 0.000000 m /zero glyphshow
grestore
gsave
/o {
gsave
newpath
translate
0.8 setlinewidth
1 setlinejoin
0 setlinecap
0 0 m
-3.5 0 l

gsave
0.000 setgray
fill
grestore
stroke
grestore
} bind def
57.6 98.5463 o
grestore
gsave
35.865625 94.749387 translate
0.000000 rotate
0.000000 0.000000 m /minus glyphshow
8.378906 0.000000 m /five glyphshow
grestore
gsave
/o {
gsave
newpath
translate
0.8 setlinewidth
1 setlinejoin
0 setlinecap
0 0 m
-3.5 0 l

gsave
0.000 setgray
fill
grestore
stroke
grestore
} bind def
57.6 154.03 o
grestore
gsave
44.240625 150.233314 translate
0.000000 rotate
0.000000 0.000000 m /zero glyphshow
grestore
gsave
/o {
gsave
newpath
translate
0.8 setlinewidth
1 setlinejoin
0 setlinecap
0 0 m
-3.5 0 l

gsave
0.000 setgray
fill
grestore
stroke
grestore
} bind def
57.6 209.514 o
grestore
gsave
44.240625 205.717242 translate
0.000000 rotate
0.000000 0.000000 m /five glyphshow
grestore
gsave
/o {
gsave
newpath
translate
0.8 setlinewidth
1 setlinejoin
0 setlinecap
0 0 m
-3.5 0 l

gsave
0.000 setgray
fill
grestore
stroke
grestore
} bind def
57.6 264.998 o
grestore
gsave
37.881250 261.201169 translate
0.000000 rotate
0.000000 0.000000 m /one glyphshow
6.362305 0.000000 m /zero glyphshow
grestore
1.500 setlinewidth
2 setlinecap
0.000 0.000 1.000 setrgbcolor
gsave
357.1 266.1 57.6 38.02 clipbox
83.108571 154.030189 m
95.862857 154.030189 l
108.617143 154.030189 l
121.371429 154.030189 l
134.125714 154.030189 l
146.88 154.030189 l
159.634286 154.030189 l
172.388571 154.030189 l
185.142857 154.030189 l
197.897143 154.030189 l
210.651429 154.030189 l
223.405714 154.030189 l
236.16 154.030189 l
248.914286 154.030189 l
261.668571 154.030189 l
274.422857 154.030189 l
287.177143 154.030189 l
299.931429 154.030189 l
312.685714 154.030189 l
325.44 154.030189 l
338.194286 154.030189 l
350.948571 154.030189 l
363.702857 154.030189 l
376.457143 154.030189 l
stroke
grestore
1.000 0.000 0.000 setrgbcolor
gsave
357.1 266.1 57.6 38.02 clipbox
83.108571 154.030189 m
95.862857 154.030189 l
108.617143 154.030189 l
121.371429 154.030189 l
134.125714 154.030189 l
146.88 154.030189 l
159.634286 154.030189 l
172.388571 154.030189 l
185.142857 154.030189 l
197.897143 154.030189 l
210.651429 154.030189 l
223.405714 154.030189 l
236.16 154.030189 l
248.914286 154.030189 l
261.668571 154.030189 l
274.422857 154.030189 l
287.177143 154.030189 l
299.931429 154.030189 l
312.685714 154.030189 l
325.44 154.030189 l
338.194286 154.030189 l
350.948571 154.030189 l
363.702857 154.030189 l
376.457143 154.030189 l
stroke
grestore
0.800 setlinewidth
0 setlinejoin
[] 0 setdash
0.000 setgray
gsave
57.6 38.016 m
57.6 304.128 l
stroke
grestore
gsave
414.72 38.016 m
414.72 304.128 l
stroke
grestore
gsave
57.6 38.016 m
414.72 38.016 l
stroke
grestore
gsave
57.6 304.128 m
414.72 304.128 l
stroke
grestore
1.000 setlinewidth
0 setlinecap
0.800 setgray
gsave
360.623125 107.403 m
448.32 107.403 l
449.92 107.403 450.72 108.203 450.72 109.803 c
450.72 337.728 l
450.72 339.328 449.92 340.128 448.32 340.128 c
360.623125 340.128 l
359.023125 340.128 358.223125 339.328 358.223125 337.728 c
358.223125 109.803 l
358.223125 108.203 359.023125 107.403 360.623125 107.403 c
cl
gsave
1.000 setgray
fill
grestore
stroke
grestore
1.500 setlinewidth
1 setlinejoin
2 setlinecap
[] 0 setdash
0.000 0.000 1.000 setrgbcolor
gsave
363.023125 330.403 m
387.023125 330.403 l
stroke
grestore
0.000 setgray
/DejaVuSans findfont
12.000 scalefont
setfont
gsave
396.623125 326.203000 translate
0.000000 rotate
0.000000 0.000000 m /p glyphshow
7.617188 0.000000 m /r glyphshow
12.550781 0.000000 m /i glyphshow
15.884766 0.000000 m /c glyphshow
22.482422 0.000000 m /e glyphshow
grestore
1.000 0.000 0.000 setrgbcolor
gsave
363.023125 312.778 m
387.023125 312.778 l
stroke
grestore
0.000 setgray
gsave
396.623125 308.578000 translate
0.000000 rotate
0.000000 0.000000 m /d glyphshow
7.617188 0.000000 m /e glyphshow
15.000000 0.000000 m /m glyphshow
26.689453 0.000000 m /a glyphshow
34.042969 0.000000 m /n glyphshow
41.648438 0.000000 m /d glyphshow
grestore
gsave
363.023125 290.953 m
387.023125 290.953 l
387.023125 299.353 l
363.023125 299.353 l
cl
1.000 0.000 0.000 setrgbcolor
fill
grestore
gsave
396.623125 290.953000 translate
0.000000 rotate
0.000000 0.000000 m /s glyphshow
6.251953 0.000000 m /u glyphshow
13.857422 0.000000 m /p glyphshow
21.474609 0.000000 m /p glyphshow
29.091797 0.000000 m /l glyphshow
32.425781 0.000000 m /y glyphshow
grestore
gsave
363.023125 273.328 m
387.023125 273.328 l
387.023125 281.728 l
363.023125 281.728 l
cl
1.000 0.647 0.000 setrgbcolor
fill
grestore
gsave
396.623125 273.328000 translate
0.000000 rotate
0.000000 0.000000 m /p glyphshow
7.617188 0.000000 m /v glyphshow
grestore
gsave
363.023125 255.703 m
387.023125 255.703 l
387.023125 264.103 l
363.023125 264.103 l
cl
1.000 1.000 0.000 setrgbcolor
fill
grestore
gsave
396.623125 255.703000 translate
0.000000 rotate
0.000000 0.000000 m /b glyphshow
7.617188 0.000000 m /a glyphshow
14.970703 0.000000 m /t glyphshow
19.675781 0.000000 m /t glyphshow
24.380859 0.000000 m /e glyphshow
31.763672 0.000000 m /r glyphshow
36.697266 0.000000 m /y glyphshow
grestore
gsave
363.023125 238.078 m
387.023125 238.078 l
387.023125 246.478 l
363.023125 246.478 l
cl
0.502 0.000 0.502 setrgbcolor
fill
grestore
gsave
396.623125 238.078000 translate
0.000000 rotate
0.000000 0.000000 m /s glyphshow
6.251953 0.000000 m /i glyphshow
9.585938 0.000000 m /t glyphshow
14.291016 0.000000 m /e glyphshow
21.673828 0.000000 m /four glyphshow
grestore
gsave
363.023125 220.453 m
387.023125 220.453 l
387.023125 228.853 l
363.023125 228.853 l
cl
1.000 0.000 1.000 setrgbcolor
fill
grestore
gsave
396.623125 220.453000 translate
0.000000 rotate
0.000000 0.000000 m /s glyphshow
6.251953 0.000000 m /i glyphshow
9.585938 0.000000 m /t glyphshow
14.291016 0.000000 m /e glyphshow
21.673828 0.000000 m /one glyphshow
grestore
gsave
363.023125 202.828 m
387.023125 202.828 l
387.023125 211.228 l
363.023125 211.228 l
cl
0.000 1.000 0.000 setrgbcolor
fill
grestore
gsave
396.623125 202.828000 translate
0.000000 rotate
0.000000 0.000000 m /s glyphshow
6.251953 0.000000 m /i glyphshow
9.585938 0.000000 m /t glyphshow
14.291016 0.000000 m /e glyphshow
21.673828 0.000000 m /zero glyphshow
grestore
gsave
363.023125 185.203 m
387.023125 185.203 l
387.023125 193.603 l
363.023125 193.603 l
cl
0.000 0.502 0.000 setrgbcolor
fill
grestore
gsave
396.623125 185.203000 translate
0.000000 rotate
0.000000 0.000000 m /s glyphshow
6.251953 0.000000 m /i glyphshow
9.585938 0.000000 m /t glyphshow
14.291016 0.000000 m /e glyphshow
21.673828 0.000000 m /five glyphshow
grestore
gsave
363.023125 167.578 m
387.023125 167.578 l
387.023125 175.978 l
363.023125 175.978 l
cl
0.000 0.000 1.000 setrgbcolor
fill
grestore
gsave
396.623125 167.578000 translate
0.000000 rotate
0.000000 0.000000 m /s glyphshow
6.251953 0.000000 m /i glyphshow
9.585938 0.000000 m /t glyphshow
14.291016 0.000000 m /e glyphshow
21.673828 0.000000 m /two glyphshow
grestore
gsave
363.023125 149.953 m
387.023125 149.953 l
387.023125 158.353 l
363.023125 158.353 l
cl
0.000 0.000 0.502 setrgbcolor
fill
grestore
gsave
396.623125 149.953000 translate
0.000000 rotate
0.000000 0.000000 m /s glyphshow
6.251953 0.000000 m /i glyphshow
9.585938 0.000000 m /t glyphshow
14.291016 0.000000 m /e glyphshow
21.673828 0.000000 m /six glyphshow
grestore
gsave
363.023125 132.328 m
387.023125 132.328 l
387.023125 140.728 l
363.023125 140.728 l
cl
fill
grestore
gsave
396.623125 132.328000 translate
0.000000 rotate
0.000000 0.000000 m /s glyphshow
6.251953 0.000000 m /i glyphshow
9.585938 0.000000 m /t glyphshow
14.291016 0.000000 m /e glyphshow
21.673828 0.000000 m /three glyphshow
grestore
gsave
363.023125 114.703 m
387.023125 114.703 l
387.023125 123.103 l
363.023125 123.103 l
cl
1.000 0.000 0.000 setrgbcolor
fill
grestore
gsave
396.623125 114.703000 translate
0.000000 rotate
0.000000 0.000000 m /s glyphshow
6.251953 0.000000 m /i glyphshow
9.585938 0.000000 m /t glyphshow
14.291016 0.000000 m /e glyphshow
21.673828 0.000000 m /seven glyphshow
grestore

end
showpage
