%!PS-Adobe-3.0 EPSF-3.0
%%Title: scenario2.py-network-latest-base-case-report/animation-mg-0000.eps
%%Creator: matplotlib version 2.0.0, http://matplotlib.org/
%%CreationDate: Sun Jun  2 09:13:41 2019
%%Orientation: portrait
%%BoundingBox: 75 223 536 568
%%EndComments
%%BeginProlog
/mpldict 8 dict def
mpldict begin
/m { moveto } bind def
/l { lineto } bind def
/r { rlineto } bind def
/c { curveto } bind def
/cl { closepath } bind def
/box {
m
1 index 0 r
0 exch r
neg 0 r
cl
} bind def
/clipbox {
box
clip
newpath
} bind def
%!PS-Adobe-3.0 Resource-Font
%%Title: DejaVu Sans
%%Copyright: Copyright (c) 2003 by Bitstream, Inc. All Rights Reserved. Copyright (c) 2006 by Tavmjong Bah. All Rights Reserved. DejaVu changes are in public domain 
%%Creator: Converted from TrueType to type 3 by PPR
25 dict begin
/_d{bind def}bind def
/_m{moveto}_d
/_l{lineto}_d
/_cl{closepath eofill}_d
/_c{curveto}_d
/_sc{7 -1 roll{setcachedevice}{pop pop pop pop pop pop}ifelse}_d
/_e{exec}_d
/FontName /DejaVuSans def
/PaintType 0 def
/FontMatrix[.001 0 0 .001 0 0]def
/FontBBox[-1021 -463 1793 1232]def
/FontType 3 def
/Encoding [ /zero /one /two /five /a /b /c /d /e /i /l /m /n /o /p /r /s /t /u /v /y /minus ] def
/FontInfo 10 dict dup begin
/FamilyName (DejaVu Sans) def
/FullName (DejaVu Sans) def
/Notice (Copyright (c) 2003 by Bitstream, Inc. All Rights Reserved. Copyright (c) 2006 by Tavmjong Bah. All Rights Reserved. DejaVu changes are in public domain ) def
/Weight (Book) def
/Version (Version 2.35) def
/ItalicAngle 0.0 def
/isFixedPitch false def
/UnderlinePosition -130 def
/UnderlineThickness 90 def
end readonly def
/CharStrings 22 dict dup begin
/zero{636 0 66 -13 570 742 _sc
318 664 _m
267 664 229 639 203 589 _c
177 539 165 464 165 364 _c
165 264 177 189 203 139 _c
229 89 267 64 318 64 _c
369 64 407 89 433 139 _c
458 189 471 264 471 364 _c
471 464 458 539 433 589 _c
407 639 369 664 318 664 _c
318 742 _m
399 742 461 709 505 645 _c
548 580 570 486 570 364 _c
570 241 548 147 505 83 _c
461 19 399 -13 318 -13 _c
236 -13 173 19 130 83 _c
87 147 66 241 66 364 _c
66 486 87 580 130 645 _c
173 709 236 742 318 742 _c
_cl}_d
/one{636 0 110 0 544 729 _sc
124 83 _m
285 83 _l
285 639 _l
110 604 _l
110 694 _l
284 729 _l
383 729 _l
383 83 _l
544 83 _l
544 0 _l
124 0 _l
124 83 _l
_cl}_d
/two{{636 0 73 0 536 742 _sc
192 83 _m
536 83 _l
536 0 _l
73 0 _l
73 83 _l
110 121 161 173 226 239 _c
290 304 331 346 348 365 _c
380 400 402 430 414 455 _c
426 479 433 504 433 528 _c
433 566 419 598 392 622 _c
365 646 330 659 286 659 _c
255 659 222 653 188 643 _c
154 632 117 616 78 594 _c
78 694 _l
118 710 155 722 189 730 _c
223 738 255 742 284 742 _c
}_e{359 742 419 723 464 685 _c
509 647 532 597 532 534 _c
532 504 526 475 515 449 _c
504 422 484 390 454 354 _c
446 344 420 317 376 272 _c
332 227 271 164 192 83 _c
_cl}_e}_d
/five{{636 0 77 -13 549 729 _sc
108 729 _m
495 729 _l
495 646 _l
198 646 _l
198 467 _l
212 472 227 476 241 478 _c
255 480 270 482 284 482 _c
365 482 429 459 477 415 _c
525 370 549 310 549 234 _c
549 155 524 94 475 51 _c
426 8 357 -13 269 -13 _c
238 -13 207 -10 175 -6 _c
143 -1 111 6 77 17 _c
77 116 _l
106 100 136 88 168 80 _c
199 72 232 69 267 69 _c
}_e{323 69 368 83 401 113 _c
433 143 450 183 450 234 _c
450 284 433 324 401 354 _c
368 384 323 399 267 399 _c
241 399 214 396 188 390 _c
162 384 135 375 108 363 _c
108 729 _l
_cl}_e}_d
/a{{613 0 60 -13 522 560 _sc
343 275 _m
270 275 220 266 192 250 _c
164 233 150 205 150 165 _c
150 133 160 107 181 89 _c
202 70 231 61 267 61 _c
317 61 357 78 387 114 _c
417 149 432 196 432 255 _c
432 275 _l
343 275 _l
522 312 _m
522 0 _l
432 0 _l
432 83 _l
411 49 385 25 355 10 _c
325 -5 287 -13 243 -13 _c
187 -13 142 2 109 33 _c
76 64 60 106 60 159 _c
}_e{60 220 80 266 122 298 _c
163 329 224 345 306 345 _c
432 345 _l
432 354 _l
432 395 418 427 391 450 _c
364 472 326 484 277 484 _c
245 484 215 480 185 472 _c
155 464 127 453 100 439 _c
100 522 _l
132 534 164 544 195 550 _c
226 556 256 560 286 560 _c
365 560 424 539 463 498 _c
502 457 522 395 522 312 _c
_cl}_e}_d
/b{{635 0 91 -13 580 760 _sc
487 273 _m
487 339 473 390 446 428 _c
418 466 381 485 334 485 _c
286 485 249 466 222 428 _c
194 390 181 339 181 273 _c
181 207 194 155 222 117 _c
249 79 286 61 334 61 _c
381 61 418 79 446 117 _c
473 155 487 207 487 273 _c
181 464 _m
199 496 223 520 252 536 _c
281 552 316 560 356 560 _c
422 560 476 533 518 481 _c
559 428 580 359 580 273 _c
}_e{580 187 559 117 518 65 _c
476 13 422 -13 356 -13 _c
316 -13 281 -5 252 10 _c
223 25 199 49 181 82 _c
181 0 _l
91 0 _l
91 760 _l
181 760 _l
181 464 _l
_cl}_e}_d
/c{{550 0 55 -13 488 560 _sc
488 526 _m
488 442 _l
462 456 437 466 411 473 _c
385 480 360 484 334 484 _c
276 484 230 465 198 428 _c
166 391 150 339 150 273 _c
150 206 166 154 198 117 _c
230 80 276 62 334 62 _c
360 62 385 65 411 72 _c
437 79 462 90 488 104 _c
488 21 _l
462 9 436 0 410 -5 _c
383 -10 354 -13 324 -13 _c
242 -13 176 12 128 64 _c
}_e{79 115 55 185 55 273 _c
55 362 79 432 128 483 _c
177 534 244 560 330 560 _c
358 560 385 557 411 551 _c
437 545 463 537 488 526 _c
_cl}_e}_d
/d{{635 0 55 -13 544 760 _sc
454 464 _m
454 760 _l
544 760 _l
544 0 _l
454 0 _l
454 82 _l
435 49 411 25 382 10 _c
353 -5 319 -13 279 -13 _c
213 -13 159 13 117 65 _c
75 117 55 187 55 273 _c
55 359 75 428 117 481 _c
159 533 213 560 279 560 _c
319 560 353 552 382 536 _c
411 520 435 496 454 464 _c
148 273 _m
148 207 161 155 188 117 _c
215 79 253 61 301 61 _c
}_e{348 61 385 79 413 117 _c
440 155 454 207 454 273 _c
454 339 440 390 413 428 _c
385 466 348 485 301 485 _c
253 485 215 466 188 428 _c
161 390 148 339 148 273 _c
_cl}_e}_d
/e{{615 0 55 -13 562 560 _sc
562 296 _m
562 252 _l
149 252 _l
153 190 171 142 205 110 _c
238 78 284 62 344 62 _c
378 62 412 66 444 74 _c
476 82 509 95 541 113 _c
541 28 _l
509 14 476 3 442 -3 _c
408 -9 373 -13 339 -13 _c
251 -13 182 12 131 62 _c
80 112 55 181 55 268 _c
55 357 79 428 127 481 _c
175 533 241 560 323 560 _c
397 560 455 536 498 489 _c
}_e{540 441 562 377 562 296 _c
472 322 _m
471 371 457 410 431 440 _c
404 469 368 484 324 484 _c
274 484 234 469 204 441 _c
174 413 156 373 152 322 _c
472 322 _l
_cl}_e}_d
/i{278 0 94 0 184 760 _sc
94 547 _m
184 547 _l
184 0 _l
94 0 _l
94 547 _l
94 760 _m
184 760 _l
184 646 _l
94 646 _l
94 760 _l
_cl}_d
/l{278 0 94 0 184 760 _sc
94 760 _m
184 760 _l
184 0 _l
94 0 _l
94 760 _l
_cl}_d
/m{{974 0 91 0 889 560 _sc
520 442 _m
542 482 569 511 600 531 _c
631 550 668 560 711 560 _c
767 560 811 540 842 500 _c
873 460 889 403 889 330 _c
889 0 _l
799 0 _l
799 327 _l
799 379 789 418 771 444 _c
752 469 724 482 686 482 _c
639 482 602 466 575 435 _c
548 404 535 362 535 309 _c
535 0 _l
445 0 _l
445 327 _l
445 379 435 418 417 444 _c
398 469 369 482 331 482 _c
}_e{285 482 248 466 221 435 _c
194 404 181 362 181 309 _c
181 0 _l
91 0 _l
91 547 _l
181 547 _l
181 462 _l
201 495 226 520 255 536 _c
283 552 317 560 357 560 _c
397 560 430 550 458 530 _c
486 510 506 480 520 442 _c
_cl}_e}_d
/n{634 0 91 0 549 560 _sc
549 330 _m
549 0 _l
459 0 _l
459 327 _l
459 379 448 417 428 443 _c
408 469 378 482 338 482 _c
289 482 251 466 223 435 _c
195 404 181 362 181 309 _c
181 0 _l
91 0 _l
91 547 _l
181 547 _l
181 462 _l
202 494 227 519 257 535 _c
286 551 320 560 358 560 _c
420 560 468 540 500 501 _c
532 462 549 405 549 330 _c
_cl}_d
/o{612 0 55 -13 557 560 _sc
306 484 _m
258 484 220 465 192 427 _c
164 389 150 338 150 273 _c
150 207 163 156 191 118 _c
219 80 257 62 306 62 _c
354 62 392 80 420 118 _c
448 156 462 207 462 273 _c
462 337 448 389 420 427 _c
392 465 354 484 306 484 _c
306 560 _m
384 560 445 534 490 484 _c
534 433 557 363 557 273 _c
557 183 534 113 490 63 _c
445 12 384 -13 306 -13 _c
227 -13 165 12 121 63 _c
77 113 55 183 55 273 _c
55 363 77 433 121 484 _c
165 534 227 560 306 560 _c
_cl}_d
/p{{635 0 91 -207 580 560 _sc
181 82 _m
181 -207 _l
91 -207 _l
91 547 _l
181 547 _l
181 464 _l
199 496 223 520 252 536 _c
281 552 316 560 356 560 _c
422 560 476 533 518 481 _c
559 428 580 359 580 273 _c
580 187 559 117 518 65 _c
476 13 422 -13 356 -13 _c
316 -13 281 -5 252 10 _c
223 25 199 49 181 82 _c
487 273 _m
487 339 473 390 446 428 _c
418 466 381 485 334 485 _c
}_e{286 485 249 466 222 428 _c
194 390 181 339 181 273 _c
181 207 194 155 222 117 _c
249 79 286 61 334 61 _c
381 61 418 79 446 117 _c
473 155 487 207 487 273 _c
_cl}_e}_d
/r{411 0 91 0 411 560 _sc
411 463 _m
401 469 390 473 378 476 _c
366 478 353 480 339 480 _c
288 480 249 463 222 430 _c
194 397 181 350 181 288 _c
181 0 _l
91 0 _l
91 547 _l
181 547 _l
181 462 _l
199 495 224 520 254 536 _c
284 552 321 560 365 560 _c
371 560 378 559 386 559 _c
393 558 401 557 411 555 _c
411 463 _l
_cl}_d
/s{{521 0 54 -13 472 560 _sc
443 531 _m
443 446 _l
417 458 391 468 364 475 _c
336 481 308 485 279 485 _c
234 485 200 478 178 464 _c
156 450 145 430 145 403 _c
145 382 153 366 169 354 _c
185 342 217 330 265 320 _c
296 313 _l
360 299 405 279 432 255 _c
458 230 472 195 472 151 _c
472 100 452 60 412 31 _c
372 1 316 -13 246 -13 _c
216 -13 186 -10 154 -5 _c
}_e{122 0 89 8 54 20 _c
54 113 _l
87 95 120 82 152 74 _c
184 65 216 61 248 61 _c
290 61 323 68 346 82 _c
368 96 380 117 380 144 _c
380 168 371 187 355 200 _c
339 213 303 226 247 238 _c
216 245 _l
160 257 119 275 95 299 _c
70 323 58 356 58 399 _c
58 450 76 490 112 518 _c
148 546 200 560 268 560 _c
301 560 332 557 362 552 _c
391 547 418 540 443 531 _c
}_e{_cl}_e}_d
/t{392 0 27 0 368 702 _sc
183 702 _m
183 547 _l
368 547 _l
368 477 _l
183 477 _l
183 180 _l
183 135 189 106 201 94 _c
213 81 238 75 276 75 _c
368 75 _l
368 0 _l
276 0 _l
206 0 158 13 132 39 _c
106 65 93 112 93 180 _c
93 477 _l
27 477 _l
27 547 _l
93 547 _l
93 702 _l
183 702 _l
_cl}_d
/u{634 0 85 -13 543 560 _sc
85 216 _m
85 547 _l
175 547 _l
175 219 _l
175 167 185 129 205 103 _c
225 77 255 64 296 64 _c
344 64 383 79 411 110 _c
439 141 453 183 453 237 _c
453 547 _l
543 547 _l
543 0 _l
453 0 _l
453 84 _l
431 50 405 26 377 10 _c
348 -5 315 -13 277 -13 _c
214 -13 166 6 134 45 _c
101 83 85 140 85 216 _c
311 560 _m
311 560 _l
_cl}_d
/v{592 0 30 0 562 547 _sc
30 547 _m
125 547 _l
296 88 _l
467 547 _l
562 547 _l
357 0 _l
235 0 _l
30 547 _l
_cl}_d
/y{592 0 30 -207 562 547 _sc
322 -50 _m
296 -114 271 -157 247 -177 _c
223 -197 191 -207 151 -207 _c
79 -207 _l
79 -132 _l
132 -132 _l
156 -132 175 -126 189 -114 _c
203 -102 218 -75 235 -31 _c
251 9 _l
30 547 _l
125 547 _l
296 119 _l
467 547 _l
562 547 _l
322 -50 _l
_cl}_d
/minus{838 0 106 272 732 355 _sc
106 355 _m
732 355 _l
732 272 _l
106 272 _l
106 355 _l
_cl}_d
end readonly def

/BuildGlyph
 {exch begin
 CharStrings exch
 2 copy known not{pop /.notdef}if
 true 3 1 roll get exec
 end}_d

/BuildChar {
 1 index /Encoding get exch get
 1 index /BuildGlyph get exec
}_d

FontName currentdict end definefont pop
end
%%EndProlog
mpldict begin
75.6 223.2 translate
460.8 345.6 0 0 clipbox
gsave
0 0 m
460.8 0 l
460.8 345.6 l
0 345.6 l
cl
1.000 setgray
fill
grestore
gsave
57.6 38.016 m
414.72 38.016 l
414.72 304.128 l
57.6 304.128 l
cl
1.000 setgray
fill
grestore
gsave
357.1 266.1 57.6 38.02 clipbox
78.006857 151.405935 m
88.210286 151.405935 l
88.210286 171.072 l
78.006857 171.072 l
cl
1.000 0.000 0.000 setrgbcolor
fill
grestore
gsave
357.1 266.1 57.6 38.02 clipbox
90.761143 151.405935 m
100.964571 151.405935 l
100.964571 171.072 l
90.761143 171.072 l
cl
1.000 0.000 0.000 setrgbcolor
fill
grestore
gsave
357.1 266.1 57.6 38.02 clipbox
103.515429 151.405935 m
113.718857 151.405935 l
113.718857 171.072 l
103.515429 171.072 l
cl
1.000 0.000 0.000 setrgbcolor
fill
grestore
gsave
357.1 266.1 57.6 38.02 clipbox
116.269714 151.405935 m
126.473143 151.405935 l
126.473143 171.072 l
116.269714 171.072 l
cl
1.000 0.000 0.000 setrgbcolor
fill
grestore
gsave
357.1 266.1 57.6 38.02 clipbox
129.024 151.405935 m
139.227429 151.405935 l
139.227429 171.072 l
129.024 171.072 l
cl
1.000 0.000 0.000 setrgbcolor
fill
grestore
gsave
357.1 266.1 57.6 38.02 clipbox
141.778286 151.405935 m
151.981714 151.405935 l
151.981714 171.072 l
141.778286 171.072 l
cl
1.000 0.000 0.000 setrgbcolor
fill
grestore
gsave
357.1 266.1 57.6 38.02 clipbox
154.532571 151.405935 m
164.736 151.405935 l
164.736 171.072 l
154.532571 171.072 l
cl
1.000 0.000 0.000 setrgbcolor
fill
grestore
gsave
357.1 266.1 57.6 38.02 clipbox
167.286857 151.405935 m
177.490286 151.405935 l
177.490286 171.072 l
167.286857 171.072 l
cl
1.000 0.000 0.000 setrgbcolor
fill
grestore
gsave
357.1 266.1 57.6 38.02 clipbox
180.041143 151.405935 m
190.244571 151.405935 l
190.244571 171.072 l
180.041143 171.072 l
cl
1.000 0.000 0.000 setrgbcolor
fill
grestore
gsave
357.1 266.1 57.6 38.02 clipbox
192.795429 151.405935 m
202.998857 151.405935 l
202.998857 171.072 l
192.795429 171.072 l
cl
1.000 0.000 0.000 setrgbcolor
fill
grestore
gsave
357.1 266.1 57.6 38.02 clipbox
205.549714 151.405935 m
215.753143 151.405935 l
215.753143 171.072 l
205.549714 171.072 l
cl
1.000 0.000 0.000 setrgbcolor
fill
grestore
gsave
357.1 266.1 57.6 38.02 clipbox
218.304 151.405935 m
228.507429 151.405935 l
228.507429 171.072 l
218.304 171.072 l
cl
1.000 0.000 0.000 setrgbcolor
fill
grestore
gsave
357.1 266.1 57.6 38.02 clipbox
231.058286 151.405935 m
241.261714 151.405935 l
241.261714 171.072 l
231.058286 171.072 l
cl
1.000 0.000 0.000 setrgbcolor
fill
grestore
gsave
357.1 266.1 57.6 38.02 clipbox
243.812571 151.405935 m
254.016 151.405935 l
254.016 171.072 l
243.812571 171.072 l
cl
1.000 0.000 0.000 setrgbcolor
fill
grestore
gsave
357.1 266.1 57.6 38.02 clipbox
256.566857 151.405935 m
266.770286 151.405935 l
266.770286 171.072 l
256.566857 171.072 l
cl
1.000 0.000 0.000 setrgbcolor
fill
grestore
gsave
357.1 266.1 57.6 38.02 clipbox
269.321143 151.405935 m
279.524571 151.405935 l
279.524571 171.072 l
269.321143 171.072 l
cl
1.000 0.000 0.000 setrgbcolor
fill
grestore
gsave
357.1 266.1 57.6 38.02 clipbox
282.075429 151.405935 m
292.278857 151.405935 l
292.278857 171.072 l
282.075429 171.072 l
cl
1.000 0.000 0.000 setrgbcolor
fill
grestore
gsave
357.1 266.1 57.6 38.02 clipbox
294.829714 151.405935 m
305.033143 151.405935 l
305.033143 171.072 l
294.829714 171.072 l
cl
1.000 0.000 0.000 setrgbcolor
fill
grestore
gsave
357.1 266.1 57.6 38.02 clipbox
307.584 151.405935 m
317.787429 151.405935 l
317.787429 171.072 l
307.584 171.072 l
cl
1.000 0.000 0.000 setrgbcolor
fill
grestore
gsave
357.1 266.1 57.6 38.02 clipbox
320.338286 151.405935 m
330.541714 151.405935 l
330.541714 171.072 l
320.338286 171.072 l
cl
1.000 0.000 0.000 setrgbcolor
fill
grestore
gsave
357.1 266.1 57.6 38.02 clipbox
333.092571 151.405935 m
343.296 151.405935 l
343.296 171.072 l
333.092571 171.072 l
cl
1.000 0.000 0.000 setrgbcolor
fill
grestore
gsave
357.1 266.1 57.6 38.02 clipbox
345.846857 151.405935 m
356.050286 151.405935 l
356.050286 171.072 l
345.846857 171.072 l
cl
1.000 0.000 0.000 setrgbcolor
fill
grestore
gsave
357.1 266.1 57.6 38.02 clipbox
358.601143 151.405935 m
368.804571 151.405935 l
368.804571 171.072 l
358.601143 171.072 l
cl
1.000 0.000 0.000 setrgbcolor
fill
grestore
gsave
357.1 266.1 57.6 38.02 clipbox
371.355429 151.405935 m
381.558857 151.405935 l
381.558857 171.072 l
371.355429 171.072 l
cl
1.000 0.000 0.000 setrgbcolor
fill
grestore
gsave
357.1 266.1 57.6 38.02 clipbox
78.006857 151.160109 m
88.210286 151.160109 l
88.210286 151.405935 l
78.006857 151.405935 l
cl
1.000 0.647 0.000 setrgbcolor
fill
grestore
gsave
357.1 266.1 57.6 38.02 clipbox
90.761143 151.160109 m
100.964571 151.160109 l
100.964571 151.405935 l
90.761143 151.405935 l
cl
1.000 0.647 0.000 setrgbcolor
fill
grestore
gsave
357.1 266.1 57.6 38.02 clipbox
103.515429 151.160109 m
113.718857 151.160109 l
113.718857 151.405935 l
103.515429 151.405935 l
cl
1.000 0.647 0.000 setrgbcolor
fill
grestore
gsave
357.1 266.1 57.6 38.02 clipbox
116.269714 151.135526 m
126.473143 151.135526 l
126.473143 151.405935 l
116.269714 151.405935 l
cl
1.000 0.647 0.000 setrgbcolor
fill
grestore
gsave
357.1 266.1 57.6 38.02 clipbox
129.024 150.496379 m
139.227429 150.496379 l
139.227429 151.405935 l
129.024 151.405935 l
cl
1.000 0.647 0.000 setrgbcolor
fill
grestore
gsave
357.1 266.1 57.6 38.02 clipbox
141.778286 146.440253 m
151.981714 146.440253 l
151.981714 151.405935 l
141.778286 151.405935 l
cl
1.000 0.647 0.000 setrgbcolor
fill
grestore
gsave
357.1 266.1 57.6 38.02 clipbox
154.532571 140.147112 m
164.736 140.147112 l
164.736 151.405935 l
154.532571 151.405935 l
cl
1.000 0.647 0.000 setrgbcolor
fill
grestore
gsave
357.1 266.1 57.6 38.02 clipbox
167.286857 133.485233 m
177.490286 133.485233 l
177.490286 151.405935 l
167.286857 151.405935 l
cl
1.000 0.647 0.000 setrgbcolor
fill
grestore
gsave
357.1 266.1 57.6 38.02 clipbox
180.041143 127.511666 m
190.244571 127.511666 l
190.244571 151.405935 l
180.041143 151.405935 l
cl
1.000 0.647 0.000 setrgbcolor
fill
grestore
gsave
357.1 266.1 57.6 38.02 clipbox
192.795429 123.775113 m
202.998857 123.775113 l
202.998857 151.405935 l
192.795429 151.405935 l
cl
1.000 0.647 0.000 setrgbcolor
fill
grestore
gsave
357.1 266.1 57.6 38.02 clipbox
205.549714 122.152663 m
215.753143 122.152663 l
215.753143 151.405935 l
205.549714 151.405935 l
cl
1.000 0.647 0.000 setrgbcolor
fill
grestore
gsave
357.1 266.1 57.6 38.02 clipbox
218.304 122.423071 m
228.507429 122.423071 l
228.507429 151.405935 l
218.304 151.405935 l
cl
1.000 0.647 0.000 setrgbcolor
fill
grestore
gsave
357.1 266.1 57.6 38.02 clipbox
231.058286 123.55387 m
241.261714 123.55387 l
241.261714 151.405935 l
231.058286 151.405935 l
cl
1.000 0.647 0.000 setrgbcolor
fill
grestore
gsave
357.1 266.1 57.6 38.02 clipbox
243.812571 124.832164 m
254.016 124.832164 l
254.016 151.405935 l
243.812571 151.405935 l
cl
1.000 0.647 0.000 setrgbcolor
fill
grestore
gsave
357.1 266.1 57.6 38.02 clipbox
256.566857 129.035786 m
266.770286 129.035786 l
266.770286 151.405935 l
256.566857 151.405935 l
cl
1.000 0.647 0.000 setrgbcolor
fill
grestore
gsave
357.1 266.1 57.6 38.02 clipbox
269.321143 131.690704 m
279.524571 131.690704 l
279.524571 151.405935 l
269.321143 151.405935 l
cl
1.000 0.647 0.000 setrgbcolor
fill
grestore
gsave
357.1 266.1 57.6 38.02 clipbox
282.075429 136.140152 m
292.278857 136.140152 l
292.278857 151.405935 l
282.075429 151.405935 l
cl
1.000 0.647 0.000 setrgbcolor
fill
grestore
gsave
357.1 266.1 57.6 38.02 clipbox
294.829714 140.073365 m
305.033143 140.073365 l
305.033143 151.405935 l
294.829714 151.405935 l
cl
1.000 0.647 0.000 setrgbcolor
fill
grestore
gsave
357.1 266.1 57.6 38.02 clipbox
307.584 144.621142 m
317.787429 144.621142 l
317.787429 151.405935 l
307.584 151.405935 l
cl
1.000 0.647 0.000 setrgbcolor
fill
grestore
gsave
357.1 266.1 57.6 38.02 clipbox
320.338286 148.40686 m
330.541714 148.40686 l
330.541714 151.405935 l
320.338286 151.405935 l
cl
1.000 0.647 0.000 setrgbcolor
fill
grestore
gsave
357.1 266.1 57.6 38.02 clipbox
333.092571 148.652686 m
343.296 148.652686 l
343.296 151.405935 l
333.092571 151.405935 l
cl
1.000 0.647 0.000 setrgbcolor
fill
grestore
gsave
357.1 266.1 57.6 38.02 clipbox
345.846857 149.144337 m
356.050286 149.144337 l
356.050286 151.405935 l
345.846857 151.405935 l
cl
1.000 0.647 0.000 setrgbcolor
fill
grestore
gsave
357.1 266.1 57.6 38.02 clipbox
358.601143 151.012614 m
368.804571 151.012614 l
368.804571 151.405935 l
358.601143 151.405935 l
cl
1.000 0.647 0.000 setrgbcolor
fill
grestore
gsave
357.1 266.1 57.6 38.02 clipbox
371.355429 151.184692 m
381.558857 151.184692 l
381.558857 151.405935 l
371.355429 151.405935 l
cl
1.000 0.647 0.000 setrgbcolor
fill
grestore
gsave
357.1 266.1 57.6 38.02 clipbox
78.006857 171.072 m
88.210286 171.072 l
88.210286 171.072 l
78.006857 171.072 l
cl
1.000 1.000 0.000 setrgbcolor
fill
grestore
gsave
357.1 266.1 57.6 38.02 clipbox
90.761143 171.072 m
100.964571 171.072 l
100.964571 171.072 l
90.761143 171.072 l
cl
1.000 1.000 0.000 setrgbcolor
fill
grestore
gsave
357.1 266.1 57.6 38.02 clipbox
103.515429 171.072 m
113.718857 171.072 l
113.718857 171.072 l
103.515429 171.072 l
cl
1.000 1.000 0.000 setrgbcolor
fill
grestore
gsave
357.1 266.1 57.6 38.02 clipbox
116.269714 171.072 m
126.473143 171.072 l
126.473143 171.072 l
116.269714 171.072 l
cl
1.000 1.000 0.000 setrgbcolor
fill
grestore
gsave
357.1 266.1 57.6 38.02 clipbox
129.024 171.072 m
139.227429 171.072 l
139.227429 171.072 l
129.024 171.072 l
cl
1.000 1.000 0.000 setrgbcolor
fill
grestore
gsave
357.1 266.1 57.6 38.02 clipbox
141.778286 171.072 m
151.981714 171.072 l
151.981714 171.072 l
141.778286 171.072 l
cl
1.000 1.000 0.000 setrgbcolor
fill
grestore
gsave
357.1 266.1 57.6 38.02 clipbox
154.532571 171.072 m
164.736 171.072 l
164.736 171.072 l
154.532571 171.072 l
cl
1.000 1.000 0.000 setrgbcolor
fill
grestore
gsave
357.1 266.1 57.6 38.02 clipbox
167.286857 171.072 m
177.490286 171.072 l
177.490286 171.072 l
167.286857 171.072 l
cl
1.000 1.000 0.000 setrgbcolor
fill
grestore
gsave
357.1 266.1 57.6 38.02 clipbox
180.041143 171.072 m
190.244571 171.072 l
190.244571 171.072 l
180.041143 171.072 l
cl
1.000 1.000 0.000 setrgbcolor
fill
grestore
gsave
357.1 266.1 57.6 38.02 clipbox
192.795429 171.072 m
202.998857 171.072 l
202.998857 171.072 l
192.795429 171.072 l
cl
1.000 1.000 0.000 setrgbcolor
fill
grestore
gsave
357.1 266.1 57.6 38.02 clipbox
205.549714 171.072 m
215.753143 171.072 l
215.753143 171.072 l
205.549714 171.072 l
cl
1.000 1.000 0.000 setrgbcolor
fill
grestore
gsave
357.1 266.1 57.6 38.02 clipbox
218.304 171.072 m
228.507429 171.072 l
228.507429 171.072 l
218.304 171.072 l
cl
1.000 1.000 0.000 setrgbcolor
fill
grestore
gsave
357.1 266.1 57.6 38.02 clipbox
231.058286 171.072 m
241.261714 171.072 l
241.261714 171.072 l
231.058286 171.072 l
cl
1.000 1.000 0.000 setrgbcolor
fill
grestore
gsave
357.1 266.1 57.6 38.02 clipbox
243.812571 171.072 m
254.016 171.072 l
254.016 171.072 l
243.812571 171.072 l
cl
1.000 1.000 0.000 setrgbcolor
fill
grestore
gsave
357.1 266.1 57.6 38.02 clipbox
256.566857 171.072 m
266.770286 171.072 l
266.770286 171.072 l
256.566857 171.072 l
cl
1.000 1.000 0.000 setrgbcolor
fill
grestore
gsave
357.1 266.1 57.6 38.02 clipbox
269.321143 171.072 m
279.524571 171.072 l
279.524571 171.072 l
269.321143 171.072 l
cl
1.000 1.000 0.000 setrgbcolor
fill
grestore
gsave
357.1 266.1 57.6 38.02 clipbox
282.075429 171.072 m
292.278857 171.072 l
292.278857 171.072 l
282.075429 171.072 l
cl
1.000 1.000 0.000 setrgbcolor
fill
grestore
gsave
357.1 266.1 57.6 38.02 clipbox
294.829714 171.072 m
305.033143 171.072 l
305.033143 171.072 l
294.829714 171.072 l
cl
1.000 1.000 0.000 setrgbcolor
fill
grestore
gsave
357.1 266.1 57.6 38.02 clipbox
307.584 171.072 m
317.787429 171.072 l
317.787429 171.072 l
307.584 171.072 l
cl
1.000 1.000 0.000 setrgbcolor
fill
grestore
gsave
357.1 266.1 57.6 38.02 clipbox
320.338286 171.072 m
330.541714 171.072 l
330.541714 171.072 l
320.338286 171.072 l
cl
1.000 1.000 0.000 setrgbcolor
fill
grestore
gsave
357.1 266.1 57.6 38.02 clipbox
333.092571 171.072 m
343.296 171.072 l
343.296 171.072 l
333.092571 171.072 l
cl
1.000 1.000 0.000 setrgbcolor
fill
grestore
gsave
357.1 266.1 57.6 38.02 clipbox
345.846857 171.072 m
356.050286 171.072 l
356.050286 171.072 l
345.846857 171.072 l
cl
1.000 1.000 0.000 setrgbcolor
fill
grestore
gsave
357.1 266.1 57.6 38.02 clipbox
358.601143 171.072 m
368.804571 171.072 l
368.804571 171.072 l
358.601143 171.072 l
cl
1.000 1.000 0.000 setrgbcolor
fill
grestore
gsave
357.1 266.1 57.6 38.02 clipbox
371.355429 171.072 m
381.558857 171.072 l
381.558857 171.072 l
371.355429 171.072 l
cl
1.000 1.000 0.000 setrgbcolor
fill
grestore
gsave
357.1 266.1 57.6 38.02 clipbox
78.006857 171.072 m
88.210286 171.072 l
88.210286 234.953088 l
78.006857 234.953088 l
cl
0.502 0.000 0.502 setrgbcolor
fill
grestore
gsave
357.1 266.1 57.6 38.02 clipbox
90.761143 171.072 m
100.964571 171.072 l
100.964571 229.059525 l
90.761143 229.059525 l
cl
0.502 0.000 0.502 setrgbcolor
fill
grestore
gsave
357.1 266.1 57.6 38.02 clipbox
103.515429 171.072 m
113.718857 171.072 l
113.718857 229.060714 l
103.515429 229.060714 l
cl
0.502 0.000 0.502 setrgbcolor
fill
grestore
gsave
357.1 266.1 57.6 38.02 clipbox
116.269714 171.072 m
126.473143 171.072 l
126.473143 229.056984 l
116.269714 229.056984 l
cl
0.502 0.000 0.502 setrgbcolor
fill
grestore
gsave
357.1 266.1 57.6 38.02 clipbox
129.024 171.072 m
139.227429 171.072 l
139.227429 231.315852 l
129.024 231.315852 l
cl
0.502 0.000 0.502 setrgbcolor
fill
grestore
gsave
357.1 266.1 57.6 38.02 clipbox
141.778286 171.072 m
151.981714 171.072 l
151.981714 220.144253 l
141.778286 220.144253 l
cl
0.502 0.000 0.502 setrgbcolor
fill
grestore
gsave
357.1 266.1 57.6 38.02 clipbox
154.532571 171.072 m
164.736 171.072 l
164.736 223.289665 l
154.532571 223.289665 l
cl
0.502 0.000 0.502 setrgbcolor
fill
grestore
gsave
357.1 266.1 57.6 38.02 clipbox
167.286857 171.072 m
177.490286 171.072 l
177.490286 226.326756 l
167.286857 226.326756 l
cl
0.502 0.000 0.502 setrgbcolor
fill
grestore
gsave
357.1 266.1 57.6 38.02 clipbox
180.041143 171.072 m
190.244571 171.072 l
190.244571 242.72043 l
180.041143 242.72043 l
cl
0.502 0.000 0.502 setrgbcolor
fill
grestore
gsave
357.1 266.1 57.6 38.02 clipbox
192.795429 171.072 m
202.998857 171.072 l
202.998857 224.175304 l
192.795429 224.175304 l
cl
0.502 0.000 0.502 setrgbcolor
fill
grestore
gsave
357.1 266.1 57.6 38.02 clipbox
205.549714 171.072 m
215.753143 171.072 l
215.753143 220.726831 l
205.549714 220.726831 l
cl
0.502 0.000 0.502 setrgbcolor
fill
grestore
gsave
357.1 266.1 57.6 38.02 clipbox
218.304 171.072 m
228.507429 171.072 l
228.507429 222.69376 l
218.304 222.69376 l
cl
0.502 0.000 0.502 setrgbcolor
fill
grestore
gsave
357.1 266.1 57.6 38.02 clipbox
231.058286 171.072 m
241.261714 171.072 l
241.261714 254.955011 l
231.058286 254.955011 l
cl
0.502 0.000 0.502 setrgbcolor
fill
grestore
gsave
357.1 266.1 57.6 38.02 clipbox
243.812571 171.072 m
254.016 171.072 l
254.016 255.143005 l
243.812571 255.143005 l
cl
0.502 0.000 0.502 setrgbcolor
fill
grestore
gsave
357.1 266.1 57.6 38.02 clipbox
256.566857 171.072 m
266.770286 171.072 l
266.770286 253.659003 l
256.566857 253.659003 l
cl
0.502 0.000 0.502 setrgbcolor
fill
grestore
gsave
357.1 266.1 57.6 38.02 clipbox
269.321143 171.072 m
279.524571 171.072 l
279.524571 256.427071 l
269.321143 256.427071 l
cl
0.502 0.000 0.502 setrgbcolor
fill
grestore
gsave
357.1 266.1 57.6 38.02 clipbox
282.075429 171.072 m
292.278857 171.072 l
292.278857 255.934946 l
282.075429 255.934946 l
cl
0.502 0.000 0.502 setrgbcolor
fill
grestore
gsave
357.1 266.1 57.6 38.02 clipbox
294.829714 171.072 m
305.033143 171.072 l
305.033143 268.209805 l
294.829714 268.209805 l
cl
0.502 0.000 0.502 setrgbcolor
fill
grestore
gsave
357.1 266.1 57.6 38.02 clipbox
307.584 171.072 m
317.787429 171.072 l
317.787429 286.470917 l
307.584 286.470917 l
cl
0.502 0.000 0.502 setrgbcolor
fill
grestore
gsave
357.1 266.1 57.6 38.02 clipbox
320.338286 171.072 m
330.541714 171.072 l
330.541714 297.792 l
320.338286 297.792 l
cl
0.502 0.000 0.502 setrgbcolor
fill
grestore
gsave
357.1 266.1 57.6 38.02 clipbox
333.092571 171.072 m
343.296 171.072 l
343.296 245.914827 l
333.092571 245.914827 l
cl
0.502 0.000 0.502 setrgbcolor
fill
grestore
gsave
357.1 266.1 57.6 38.02 clipbox
345.846857 171.072 m
356.050286 171.072 l
356.050286 237.630152 l
345.846857 237.630152 l
cl
0.502 0.000 0.502 setrgbcolor
fill
grestore
gsave
357.1 266.1 57.6 38.02 clipbox
358.601143 171.072 m
368.804571 171.072 l
368.804571 251.79085 l
358.601143 251.79085 l
cl
0.502 0.000 0.502 setrgbcolor
fill
grestore
gsave
357.1 266.1 57.6 38.02 clipbox
371.355429 171.072 m
381.558857 171.072 l
381.558857 240.369271 l
371.355429 240.369271 l
cl
0.502 0.000 0.502 setrgbcolor
fill
grestore
0.800 setlinewidth
1 setlinejoin
0 setlinecap
[] 0 setdash
0.000 setgray
gsave
/o {
gsave
newpath
translate
0.8 setlinewidth
1 setlinejoin
0 setlinecap
0 0 m
0 -3.5 l

gsave
0.000 setgray
fill
grestore
stroke
grestore
} bind def
83.1086 38.016 o
grestore
/DejaVuSans findfont
10.000 scalefont
setfont
gsave
79.928884 23.422250 translate
0.000000 rotate
0.000000 0.000000 m /zero glyphshow
grestore
gsave
/o {
gsave
newpath
translate
0.8 setlinewidth
1 setlinejoin
0 setlinecap
0 0 m
0 -3.5 l

gsave
0.000 setgray
fill
grestore
stroke
grestore
} bind def
146.88 38.016 o
grestore
gsave
143.700312 23.422250 translate
0.000000 rotate
0.000000 0.000000 m /five glyphshow
grestore
gsave
/o {
gsave
newpath
translate
0.8 setlinewidth
1 setlinejoin
0 setlinecap
0 0 m
0 -3.5 l

gsave
0.000 setgray
fill
grestore
stroke
grestore
} bind def
210.651 38.016 o
grestore
gsave
204.292054 23.422250 translate
0.000000 rotate
0.000000 0.000000 m /one glyphshow
6.362305 0.000000 m /zero glyphshow
grestore
gsave
/o {
gsave
newpath
translate
0.8 setlinewidth
1 setlinejoin
0 setlinecap
0 0 m
0 -3.5 l

gsave
0.000 setgray
fill
grestore
stroke
grestore
} bind def
274.423 38.016 o
grestore
gsave
268.063482 23.422250 translate
0.000000 rotate
0.000000 0.000000 m /one glyphshow
6.362305 0.000000 m /five glyphshow
grestore
gsave
/o {
gsave
newpath
translate
0.8 setlinewidth
1 setlinejoin
0 setlinecap
0 0 m
0 -3.5 l

gsave
0.000 setgray
fill
grestore
stroke
grestore
} bind def
338.194 38.016 o
grestore
gsave
331.834911 23.422250 translate
0.000000 rotate
0.000000 0.000000 m /two glyphshow
6.362305 0.000000 m /zero glyphshow
grestore
gsave
/o {
gsave
newpath
translate
0.8 setlinewidth
1 setlinejoin
0 setlinecap
0 0 m
0 -3.5 l

gsave
0.000 setgray
fill
grestore
stroke
grestore
} bind def
401.966 38.016 o
grestore
gsave
395.606339 23.422250 translate
0.000000 rotate
0.000000 0.000000 m /two glyphshow
6.362305 0.000000 m /five glyphshow
grestore
gsave
/o {
gsave
newpath
translate
0.8 setlinewidth
1 setlinejoin
0 setlinecap
0 0 m
-3.5 0 l

gsave
0.000 setgray
fill
grestore
stroke
grestore
} bind def
57.6 72.7417 o
grestore
gsave
29.506250 68.944799 translate
0.000000 rotate
0.000000 0.000000 m /minus glyphshow
8.378906 0.000000 m /one glyphshow
14.741211 0.000000 m /zero glyphshow
grestore
gsave
/o {
gsave
newpath
translate
0.8 setlinewidth
1 setlinejoin
0 setlinecap
0 0 m
-3.5 0 l

gsave
0.000 setgray
fill
grestore
stroke
grestore
} bind def
57.6 121.907 o
grestore
gsave
35.865625 118.109962 translate
0.000000 rotate
0.000000 0.000000 m /minus glyphshow
8.378906 0.000000 m /five glyphshow
grestore
gsave
/o {
gsave
newpath
translate
0.8 setlinewidth
1 setlinejoin
0 setlinecap
0 0 m
-3.5 0 l

gsave
0.000 setgray
fill
grestore
stroke
grestore
} bind def
57.6 171.072 o
grestore
gsave
44.240625 167.275125 translate
0.000000 rotate
0.000000 0.000000 m /zero glyphshow
grestore
gsave
/o {
gsave
newpath
translate
0.8 setlinewidth
1 setlinejoin
0 setlinecap
0 0 m
-3.5 0 l

gsave
0.000 setgray
fill
grestore
stroke
grestore
} bind def
57.6 220.237 o
grestore
gsave
44.240625 216.440288 translate
0.000000 rotate
0.000000 0.000000 m /five glyphshow
grestore
gsave
/o {
gsave
newpath
translate
0.8 setlinewidth
1 setlinejoin
0 setlinecap
0 0 m
-3.5 0 l

gsave
0.000 setgray
fill
grestore
stroke
grestore
} bind def
57.6 269.402 o
grestore
gsave
37.881250 265.605451 translate
0.000000 rotate
0.000000 0.000000 m /one glyphshow
6.362305 0.000000 m /zero glyphshow
grestore
1.500 setlinewidth
2 setlinecap
0.000 0.000 1.000 setrgbcolor
gsave
357.1 266.1 57.6 38.02 clipbox
83.108571 171.072 m
95.862857 171.072 l
108.617143 171.072 l
121.371429 171.072 l
134.125714 171.072 l
146.88 171.072 l
159.634286 171.072 l
172.388571 171.072 l
185.142857 171.072 l
197.897143 171.072 l
210.651429 171.072 l
223.405714 171.072 l
236.16 171.072 l
248.914286 171.072 l
261.668571 171.072 l
274.422857 171.072 l
287.177143 171.072 l
299.931429 171.072 l
312.685714 171.072 l
325.44 171.072 l
338.194286 171.072 l
350.948571 171.072 l
363.702857 171.072 l
376.457143 171.072 l
stroke
grestore
1.000 0.000 0.000 setrgbcolor
gsave
357.1 266.1 57.6 38.02 clipbox
83.108571 215.041197 m
95.862857 209.147634 l
108.617143 209.148823 l
121.371429 209.12051 l
134.125714 210.740232 l
146.88 195.512506 l
159.634286 192.364777 l
172.388571 188.739989 l
185.142857 199.160096 l
197.897143 176.878417 l
210.651429 171.807494 l
223.405714 174.044831 l
236.16 207.436881 l
248.914286 208.903169 l
261.668571 211.622789 l
274.422857 217.045775 l
287.177143 221.003098 l
299.931429 237.21117 l
312.685714 260.020059 l
325.44 275.12686 l
338.194286 223.495513 l
350.948571 215.702489 l
363.702857 231.731464 l
376.457143 220.481962 l
stroke
grestore
0.800 setlinewidth
0 setlinejoin
[] 0 setdash
0.000 setgray
gsave
57.6 38.016 m
57.6 304.128 l
stroke
grestore
gsave
414.72 38.016 m
414.72 304.128 l
stroke
grestore
gsave
57.6 38.016 m
414.72 38.016 l
stroke
grestore
gsave
57.6 304.128 m
414.72 304.128 l
stroke
grestore
1.000 setlinewidth
0 setlinecap
0.800 setgray
gsave
360.623125 230.778 m
448.32 230.778 l
449.92 230.778 450.72 231.578 450.72 233.178 c
450.72 337.728 l
450.72 339.328 449.92 340.128 448.32 340.128 c
360.623125 340.128 l
359.023125 340.128 358.223125 339.328 358.223125 337.728 c
358.223125 233.178 l
358.223125 231.578 359.023125 230.778 360.623125 230.778 c
cl
gsave
1.000 setgray
fill
grestore
stroke
grestore
1.500 setlinewidth
1 setlinejoin
2 setlinecap
[] 0 setdash
0.000 0.000 1.000 setrgbcolor
gsave
363.023125 330.403 m
387.023125 330.403 l
stroke
grestore
0.000 setgray
/DejaVuSans findfont
12.000 scalefont
setfont
gsave
396.623125 326.203000 translate
0.000000 rotate
0.000000 0.000000 m /p glyphshow
7.617188 0.000000 m /r glyphshow
12.550781 0.000000 m /i glyphshow
15.884766 0.000000 m /c glyphshow
22.482422 0.000000 m /e glyphshow
grestore
1.000 0.000 0.000 setrgbcolor
gsave
363.023125 312.778 m
387.023125 312.778 l
stroke
grestore
0.000 setgray
gsave
396.623125 308.578000 translate
0.000000 rotate
0.000000 0.000000 m /d glyphshow
7.617188 0.000000 m /e glyphshow
15.000000 0.000000 m /m glyphshow
26.689453 0.000000 m /a glyphshow
34.042969 0.000000 m /n glyphshow
41.648438 0.000000 m /d glyphshow
grestore
gsave
363.023125 290.953 m
387.023125 290.953 l
387.023125 299.353 l
363.023125 299.353 l
cl
1.000 0.000 0.000 setrgbcolor
fill
grestore
gsave
396.623125 290.953000 translate
0.000000 rotate
0.000000 0.000000 m /s glyphshow
6.251953 0.000000 m /u glyphshow
13.857422 0.000000 m /p glyphshow
21.474609 0.000000 m /p glyphshow
29.091797 0.000000 m /l glyphshow
32.425781 0.000000 m /y glyphshow
grestore
gsave
363.023125 273.328 m
387.023125 273.328 l
387.023125 281.728 l
363.023125 281.728 l
cl
1.000 0.647 0.000 setrgbcolor
fill
grestore
gsave
396.623125 273.328000 translate
0.000000 rotate
0.000000 0.000000 m /p glyphshow
7.617188 0.000000 m /v glyphshow
grestore
gsave
363.023125 255.703 m
387.023125 255.703 l
387.023125 264.103 l
363.023125 264.103 l
cl
1.000 1.000 0.000 setrgbcolor
fill
grestore
gsave
396.623125 255.703000 translate
0.000000 rotate
0.000000 0.000000 m /b glyphshow
7.617188 0.000000 m /a glyphshow
14.970703 0.000000 m /t glyphshow
19.675781 0.000000 m /t glyphshow
24.380859 0.000000 m /e glyphshow
31.763672 0.000000 m /r glyphshow
36.697266 0.000000 m /y glyphshow
grestore
gsave
363.023125 238.078 m
387.023125 238.078 l
387.023125 246.478 l
363.023125 246.478 l
cl
0.502 0.000 0.502 setrgbcolor
fill
grestore
gsave
396.623125 238.078000 translate
0.000000 rotate
0.000000 0.000000 m /l glyphshow
3.333984 0.000000 m /o glyphshow
10.675781 0.000000 m /a glyphshow
18.029297 0.000000 m /d glyphshow
grestore

end
showpage
