%!PS-Adobe-3.0 EPSF-3.0
%%Creator: graphviz version 2.38.0 (20140413.2041)
%%Title: %3
%%Pages: 1
%%BoundingBox: 36 36 2142 1933
%%EndComments
save
%%BeginProlog
/DotDict 200 dict def
DotDict begin

/setupLatin1 {
mark
/EncodingVector 256 array def
 EncodingVector 0

ISOLatin1Encoding 0 255 getinterval putinterval
EncodingVector 45 /hyphen put

% Set up ISO Latin 1 character encoding
/starnetISO {
        dup dup findfont dup length dict begin
        { 1 index /FID ne { def }{ pop pop } ifelse
        } forall
        /Encoding EncodingVector def
        currentdict end definefont
} def
/Times-Roman starnetISO def
/Times-Italic starnetISO def
/Times-Bold starnetISO def
/Times-BoldItalic starnetISO def
/Helvetica starnetISO def
/Helvetica-Oblique starnetISO def
/Helvetica-Bold starnetISO def
/Helvetica-BoldOblique starnetISO def
/Courier starnetISO def
/Courier-Oblique starnetISO def
/Courier-Bold starnetISO def
/Courier-BoldOblique starnetISO def
cleartomark
} bind def

%%BeginResource: procset graphviz 0 0
/coord-font-family /Times-Roman def
/default-font-family /Times-Roman def
/coordfont coord-font-family findfont 8 scalefont def

/InvScaleFactor 1.0 def
/set_scale {
       dup 1 exch div /InvScaleFactor exch def
       scale
} bind def

% styles
/solid { [] 0 setdash } bind def
/dashed { [9 InvScaleFactor mul dup ] 0 setdash } bind def
/dotted { [1 InvScaleFactor mul 6 InvScaleFactor mul] 0 setdash } bind def
/invis {/fill {newpath} def /stroke {newpath} def /show {pop newpath} def} bind def
/bold { 2 setlinewidth } bind def
/filled { } bind def
/unfilled { } bind def
/rounded { } bind def
/diagonals { } bind def
/tapered { } bind def

% hooks for setting color 
/nodecolor { sethsbcolor } bind def
/edgecolor { sethsbcolor } bind def
/graphcolor { sethsbcolor } bind def
/nopcolor {pop pop pop} bind def

/beginpage {	% i j npages
	/npages exch def
	/j exch def
	/i exch def
	/str 10 string def
	npages 1 gt {
		gsave
			coordfont setfont
			0 0 moveto
			(\() show i str cvs show (,) show j str cvs show (\)) show
		grestore
	} if
} bind def

/set_font {
	findfont exch
	scalefont setfont
} def

% draw text fitted to its expected width
/alignedtext {			% width text
	/text exch def
	/width exch def
	gsave
		width 0 gt {
			[] 0 setdash
			text stringwidth pop width exch sub text length div 0 text ashow
		} if
	grestore
} def

/boxprim {				% xcorner ycorner xsize ysize
		4 2 roll
		moveto
		2 copy
		exch 0 rlineto
		0 exch rlineto
		pop neg 0 rlineto
		closepath
} bind def

/ellipse_path {
	/ry exch def
	/rx exch def
	/y exch def
	/x exch def
	matrix currentmatrix
	newpath
	x y translate
	rx ry scale
	0 0 1 0 360 arc
	setmatrix
} bind def

/endpage { showpage } bind def
/showpage { } def

/layercolorseq
	[	% layer color sequence - darkest to lightest
		[0 0 0]
		[.2 .8 .8]
		[.4 .8 .8]
		[.6 .8 .8]
		[.8 .8 .8]
	]
def

/layerlen layercolorseq length def

/setlayer {/maxlayer exch def /curlayer exch def
	layercolorseq curlayer 1 sub layerlen mod get
	aload pop sethsbcolor
	/nodecolor {nopcolor} def
	/edgecolor {nopcolor} def
	/graphcolor {nopcolor} def
} bind def

/onlayer { curlayer ne {invis} if } def

/onlayers {
	/myupper exch def
	/mylower exch def
	curlayer mylower lt
	curlayer myupper gt
	or
	{invis} if
} def

/curlayer 0 def

%%EndResource
%%EndProlog
%%BeginSetup
14 default-font-family set_font
1 setmiterlimit
% /arrowlength 10 def
% /arrowwidth 5 def

% make sure pdfmark is harmless for PS-interpreters other than Distiller
/pdfmark where {pop} {userdict /pdfmark /cleartomark load put} ifelse
% make '<<' and '>>' safe on PS Level 1 devices
/languagelevel where {pop languagelevel}{1} ifelse
2 lt {
    userdict (<<) cvn ([) cvn load put
    userdict (>>) cvn ([) cvn load put
} if

%%EndSetup
setupLatin1
%%Page: 1 1
%%PageBoundingBox: 36 36 2142 1933
%%PageOrientation: Portrait
0 0 1 beginpage
gsave
36 36 2106 1897 boxprim clip newpath
1 1 set_scale 0 rotate 40 40 translate
% LO
gsave
0 1 1 nodecolor
1003.05 798.68 184.07 184.07 ellipse_path fill
1 setlinewidth
filled
0 0 0 nodecolor
1003.05 798.68 184.07 184.07 ellipse_path stroke
0 0 0 nodecolor
38 /Arial-Bold set_font
828.55 789.28 moveto 349 (Microgrid Network) alignedtext
grestore
% L11
gsave
0.83137 1 1 nodecolor
1678.44 798.68 131.21 131.21 ellipse_path fill
1 setlinewidth
filled
0 0 0 nodecolor
1678.44 798.68 131.21 131.21 ellipse_path stroke
0 0 0 nodecolor
38 /Arial-Bold set_font
1557.94 789.28 moveto 241 (Sub-network) alignedtext
grestore
% LO->L11
gsave
3 setlinewidth
0 0 0 edgecolor
newpath 1217.91 798.68 moveto
1314.86 798.68 1427.45 798.68 1517.04 798.68 curveto
stroke
0 0 0 edgecolor
newpath 1217.6 788.18 moveto
1187.6 798.68 lineto
1217.6 809.18 lineto
closepath fill
3 setlinewidth
solid
0 0 0 edgecolor
newpath 1217.6 788.18 moveto
1187.6 798.68 lineto
1217.6 809.18 lineto
closepath stroke
0 0 0 edgecolor
newpath 1517.09 809.18 moveto
1547.09 798.68 lineto
1517.09 788.18 lineto
closepath fill
3 setlinewidth
solid
0 0 0 edgecolor
newpath 1517.09 809.18 moveto
1547.09 798.68 lineto
1517.09 788.18 lineto
closepath stroke
grestore
% L12
gsave
0.83137 1 1 nodecolor
1063.5 1471.36 131.21 131.21 ellipse_path fill
1 setlinewidth
filled
0 0 0 nodecolor
1063.5 1471.36 131.21 131.21 ellipse_path stroke
0 0 0 nodecolor
38 /Arial-Bold set_font
943 1461.96 moveto 241 (Sub-network) alignedtext
grestore
% LO->L12
gsave
3 setlinewidth
0 0 0 edgecolor
newpath 1022.28 1012.68 moveto
1030.96 1109.24 1041.03 1221.38 1049.05 1310.61 curveto
stroke
0 0 0 edgecolor
newpath 1032.71 1011.44 moveto
1019.57 982.5 lineto
1011.8 1013.32 lineto
closepath fill
3 setlinewidth
solid
0 0 0 edgecolor
newpath 1032.71 1011.44 moveto
1019.57 982.5 lineto
1011.8 1013.32 lineto
closepath stroke
0 0 0 edgecolor
newpath 1038.6 1311.6 moveto
1051.74 1340.54 lineto
1059.51 1309.72 lineto
closepath fill
3 setlinewidth
solid
0 0 0 edgecolor
newpath 1038.6 1311.6 moveto
1051.74 1340.54 lineto
1059.51 1309.72 lineto
closepath stroke
grestore
% DERS
gsave
0.16471 1 1 nodecolor
450.71 1187.37 126 126 ellipse_path fill
1 setlinewidth
filled
0 0 0 nodecolor
450.71 1187.37 126 126 ellipse_path stroke
0 0 0 nodecolor
38 /Arial-Bold set_font
379.71 1177.97 moveto 142 (Battery) alignedtext
grestore
% LO->DERS
gsave
3 setlinewidth
0 0 0 edgecolor
newpath 827.48 922.23 moveto
746.68 979.1 652.57 1045.33 578.61 1097.37 curveto
stroke
0 0 0 edgecolor
newpath 833.63 930.75 moveto
852.12 904.89 lineto
821.55 913.57 lineto
closepath fill
3 setlinewidth
solid
0 0 0 edgecolor
newpath 833.63 930.75 moveto
852.12 904.89 lineto
821.55 913.57 lineto
closepath stroke
0 0 0 edgecolor
newpath 572.35 1088.94 moveto
553.86 1114.79 lineto
584.43 1106.11 lineto
closepath fill
3 setlinewidth
solid
0 0 0 edgecolor
newpath 572.35 1088.94 moveto
553.86 1114.79 lineto
584.43 1106.11 lineto
closepath stroke
grestore
% L13
gsave
0.83137 1 1 nodecolor
390.27 514.69 131.21 131.21 ellipse_path fill
1 setlinewidth
filled
0 0 0 nodecolor
390.27 514.69 131.21 131.21 ellipse_path stroke
0 0 0 nodecolor
38 /Arial-Bold set_font
269.77 505.29 moveto 241 (Sub-network) alignedtext
grestore
% LO->L13
gsave
3 setlinewidth
0 0 0 edgecolor
newpath 808.11 708.34 moveto
720.14 667.57 617.99 620.23 536.71 582.56 curveto
stroke
0 0 0 edgecolor
newpath 803.97 717.99 moveto
835.6 721.08 lineto
812.8 698.94 lineto
closepath fill
3 setlinewidth
solid
0 0 0 edgecolor
newpath 803.97 717.99 moveto
835.6 721.08 lineto
812.8 698.94 lineto
closepath stroke
0 0 0 edgecolor
newpath 541.07 573.01 moveto
509.44 569.92 lineto
532.24 592.06 lineto
closepath fill
3 setlinewidth
solid
0 0 0 edgecolor
newpath 541.07 573.01 moveto
509.44 569.92 lineto
532.24 592.06 lineto
closepath stroke
grestore
% L11B
gsave
0.16471 1 1 nodecolor
1426.75 615.82 108 108 ellipse_path fill
1 setlinewidth
filled
0 0 0 nodecolor
1426.75 615.82 108 108 ellipse_path stroke
0 0 0 nodecolor
38 /Arial-Bold set_font
1355.75 606.42 moveto 142 (Battery) alignedtext
grestore
% L11->L11B
gsave
3 setlinewidth
0 0 0 edgecolor
newpath 1547.59 703.62 moveto
1544.71 701.52 1541.82 699.42 1538.95 697.33 curveto
stroke
0 0 0 edgecolor
newpath 1541.63 712.26 moveto
1572.07 721.4 lineto
1553.97 695.27 lineto
closepath fill
3 setlinewidth
solid
0 0 0 edgecolor
newpath 1541.63 712.26 moveto
1572.07 721.4 lineto
1553.97 695.27 lineto
closepath stroke
0 0 0 edgecolor
newpath 1544.94 688.71 moveto
1514.5 679.57 lineto
1532.6 705.7 lineto
closepath fill
3 setlinewidth
solid
0 0 0 edgecolor
newpath 1544.94 688.71 moveto
1514.5 679.57 lineto
1532.6 705.7 lineto
closepath stroke
grestore
% L11V
gsave
0.33333 1 1 nodecolor
1774.58 502.8 108 108 ellipse_path fill
1 setlinewidth
filled
0 0 0 nodecolor
1774.58 502.8 108 108 ellipse_path stroke
0 0 0 nodecolor
38 /Arial-Bold set_font
1681.08 493.4 moveto 187 (Appliance) alignedtext
grestore
% L11->L11V
gsave
3 setlinewidth
0 0 0 edgecolor
newpath 1719.07 673.63 moveto
1723.25 660.77 1727.51 647.67 1731.71 634.74 curveto
stroke
0 0 0 edgecolor
newpath 1741.78 637.73 moveto
1741.06 605.95 lineto
1721.81 631.24 lineto
closepath fill
3 setlinewidth
solid
0 0 0 edgecolor
newpath 1741.78 637.73 moveto
1741.06 605.95 lineto
1721.81 631.24 lineto
closepath stroke
grestore
% L11W
gsave
0.33333 1 1 nodecolor
1989.55 798.68 108 108 ellipse_path fill
1 setlinewidth
filled
0 0 0 nodecolor
1989.55 798.68 108 108 ellipse_path stroke
0 0 0 nodecolor
38 /Arial-Bold set_font
1896.05 789.28 moveto 187 (Appliance) alignedtext
grestore
% L11->L11W
gsave
3 setlinewidth
0 0 0 edgecolor
newpath 1809.93 798.68 moveto
1823.45 798.68 1837.23 798.68 1850.83 798.68 curveto
stroke
0 0 0 edgecolor
newpath 1851.09 809.18 moveto
1881.09 798.68 lineto
1851.09 788.18 lineto
closepath fill
3 setlinewidth
solid
0 0 0 edgecolor
newpath 1851.09 809.18 moveto
1881.09 798.68 lineto
1851.09 788.18 lineto
closepath stroke
grestore
% L11A
gsave
0.33333 1 1 nodecolor
1774.58 1094.56 108 108 ellipse_path fill
1 setlinewidth
filled
0 0 0 nodecolor
1774.58 1094.56 108 108 ellipse_path stroke
0 0 0 nodecolor
38 /Arial-Bold set_font
1681.08 1085.16 moveto 187 (Appliance) alignedtext
grestore
% L11->L11A
gsave
3 setlinewidth
0 0 0 edgecolor
newpath 1719.07 923.73 moveto
1723.25 936.6 1727.51 949.7 1731.71 962.63 curveto
stroke
0 0 0 edgecolor
newpath 1721.81 966.12 moveto
1741.06 991.41 lineto
1741.78 959.63 lineto
closepath fill
3 setlinewidth
solid
0 0 0 edgecolor
newpath 1721.81 966.12 moveto
1741.06 991.41 lineto
1741.78 959.63 lineto
closepath stroke
grestore
% L12B
gsave
0.16471 1 1 nodecolor
1223.1 1204.32 108 108 ellipse_path fill
1 setlinewidth
filled
0 0 0 nodecolor
1223.1 1204.32 108 108 ellipse_path stroke
0 0 0 nodecolor
38 /Arial-Bold set_font
1152.1 1194.92 moveto 142 (Battery) alignedtext
grestore
% L12->L12B
gsave
3 setlinewidth
0 0 0 edgecolor
newpath 1146.47 1332.53 moveto
1148.3 1329.47 1150.13 1326.41 1151.96 1323.36 curveto
stroke
0 0 0 edgecolor
newpath 1137.33 1327.36 moveto
1130.95 1358.5 lineto
1155.36 1338.14 lineto
closepath fill
3 setlinewidth
solid
0 0 0 edgecolor
newpath 1137.33 1327.36 moveto
1130.95 1358.5 lineto
1155.36 1338.14 lineto
closepath stroke
0 0 0 edgecolor
newpath 1161.08 1328.55 moveto
1167.46 1297.42 lineto
1143.06 1317.78 lineto
closepath fill
3 setlinewidth
solid
0 0 0 edgecolor
newpath 1161.08 1328.55 moveto
1167.46 1297.42 lineto
1143.06 1317.78 lineto
closepath stroke
grestore
% L12V
gsave
0.33333 1 1 nodecolor
1366.79 1540.63 108 108 ellipse_path fill
1 setlinewidth
filled
0 0 0 nodecolor
1366.79 1540.63 108 108 ellipse_path stroke
0 0 0 nodecolor
38 /Arial-Bold set_font
1273.29 1531.23 moveto 187 (Appliance) alignedtext
grestore
% L12->L12V
gsave
3 setlinewidth
0 0 0 edgecolor
newpath 1191.68 1500.64 moveto
1204.87 1503.65 1218.3 1506.72 1231.55 1509.75 curveto
stroke
0 0 0 edgecolor
newpath 1229.47 1520.04 moveto
1261.06 1516.49 lineto
1234.15 1499.57 lineto
closepath fill
3 setlinewidth
solid
0 0 0 edgecolor
newpath 1229.47 1520.04 moveto
1261.06 1516.49 lineto
1234.15 1499.57 lineto
closepath stroke
grestore
% L12W
gsave
0.33333 1 1 nodecolor
1091.34 1781.22 108 108 ellipse_path fill
1 setlinewidth
filled
0 0 0 nodecolor
1091.34 1781.22 108 108 ellipse_path stroke
0 0 0 nodecolor
38 /Arial-Bold set_font
997.84 1771.82 moveto 187 (Appliance) alignedtext
grestore
% L12->L12W
gsave
3 setlinewidth
0 0 0 edgecolor
newpath 1075.27 1602.32 moveto
1076.48 1615.79 1077.71 1629.51 1078.93 1643.06 curveto
stroke
0 0 0 edgecolor
newpath 1068.49 1644.26 moveto
1081.63 1673.2 lineto
1089.41 1642.38 lineto
closepath fill
3 setlinewidth
solid
0 0 0 edgecolor
newpath 1068.49 1644.26 moveto
1081.63 1673.2 lineto
1089.41 1642.38 lineto
closepath stroke
grestore
% L12A
gsave
0.33333 1 1 nodecolor
777.41 1593.6 108 108 ellipse_path fill
1 setlinewidth
filled
0 0 0 nodecolor
777.41 1593.6 108 108 ellipse_path stroke
0 0 0 nodecolor
38 /Arial-Bold set_font
683.91 1584.2 moveto 187 (Appliance) alignedtext
grestore
% L12->L12A
gsave
3 setlinewidth
0 0 0 edgecolor
newpath 942.59 1523.02 moveto
930.15 1528.34 917.48 1533.75 904.98 1539.09 curveto
stroke
0 0 0 edgecolor
newpath 900.61 1529.54 moveto
877.15 1550.98 lineto
908.86 1548.85 lineto
closepath fill
3 setlinewidth
solid
0 0 0 edgecolor
newpath 900.61 1529.54 moveto
877.15 1550.98 lineto
908.86 1548.85 lineto
closepath stroke
grestore
% DERG
gsave
0.10588 1 1 nodecolor
942.6 126 126 126 ellipse_path fill
1 setlinewidth
filled
0 0 0 nodecolor
942.6 126 126 126 ellipse_path stroke
0 0 0 nodecolor
38 /Arial-Bold set_font
917.6 116.6 moveto 50 (PV) alignedtext
grestore
% DERG->LO
gsave
3 setlinewidth
0 0 0 edgecolor
newpath 953.9 251.74 moveto
962.31 345.25 973.97 475.11 983.83 584.83 curveto
stroke
0 0 0 edgecolor
newpath 973.39 585.89 moveto
986.53 614.83 lineto
994.3 584.01 lineto
closepath fill
3 setlinewidth
solid
0 0 0 edgecolor
newpath 973.39 585.89 moveto
986.53 614.83 lineto
994.3 584.01 lineto
closepath stroke
grestore
% DERC
gsave
0 1 1 nodecolor
1340.75 213.78 126 126 ellipse_path fill
1 setlinewidth
filled
0 0 0 nodecolor
1340.75 213.78 126 126 ellipse_path stroke
0 0 0 nodecolor
38 /Arial-Bold set_font
1300.25 204.38 moveto 81 (Grid) alignedtext
grestore
% DERC->LO
gsave
3 setlinewidth
0 0 0 edgecolor
newpath 1262.49 349.32 moveto
1217.28 427.62 1159.77 527.23 1110.39 612.76 curveto
stroke
0 0 0 edgecolor
newpath 1271.72 354.34 moveto
1277.62 323.11 lineto
1253.53 343.84 lineto
closepath fill
3 setlinewidth
solid
0 0 0 edgecolor
newpath 1271.72 354.34 moveto
1277.62 323.11 lineto
1253.53 343.84 lineto
closepath stroke
0 0 0 edgecolor
newpath 1101.26 607.59 moveto
1095.35 638.82 lineto
1119.44 618.09 lineto
closepath fill
3 setlinewidth
solid
0 0 0 edgecolor
newpath 1101.26 607.59 moveto
1095.35 638.82 lineto
1119.44 618.09 lineto
closepath stroke
grestore
% L13W
gsave
0.33333 1 1 nodecolor
418.11 824.55 108 108 ellipse_path fill
1 setlinewidth
filled
0 0 0 nodecolor
418.11 824.55 108 108 ellipse_path stroke
0 0 0 nodecolor
38 /Arial-Bold set_font
324.61 815.15 moveto 187 (Appliance) alignedtext
grestore
% L13->L13W
gsave
3 setlinewidth
0 0 0 edgecolor
newpath 402.03 645.65 moveto
403.25 659.12 404.48 672.84 405.7 686.38 curveto
stroke
0 0 0 edgecolor
newpath 395.26 687.58 moveto
408.4 716.52 lineto
416.18 685.7 lineto
closepath fill
3 setlinewidth
solid
0 0 0 edgecolor
newpath 395.26 687.58 moveto
408.4 716.52 lineto
416.18 685.7 lineto
closepath stroke
grestore
% L13A
gsave
0.33333 1 1 nodecolor
108 383.87 108 108 ellipse_path fill
1 setlinewidth
filled
0 0 0 nodecolor
108 383.87 108 108 ellipse_path stroke
0 0 0 nodecolor
38 /Arial-Bold set_font
14.5 374.47 moveto 187 (Appliance) alignedtext
grestore
% L13->L13A
gsave
3 setlinewidth
0 0 0 edgecolor
newpath 270.97 459.4 moveto
258.7 453.72 246.2 447.92 233.86 442.21 curveto
stroke
0 0 0 edgecolor
newpath 238.04 432.57 moveto
206.41 429.48 lineto
229.21 451.62 lineto
closepath fill
3 setlinewidth
solid
0 0 0 edgecolor
newpath 238.04 432.57 moveto
206.41 429.48 lineto
229.21 451.62 lineto
closepath stroke
grestore
% L11P
gsave
0.10588 1 1 nodecolor
1426.75 981.55 108 108 ellipse_path fill
1 setlinewidth
filled
0 0 0 nodecolor
1426.75 981.55 108 108 ellipse_path stroke
0 0 0 nodecolor
38 /Arial-Bold set_font
1401.75 972.15 moveto 50 (PV) alignedtext
grestore
% L11P->L11
gsave
3 setlinewidth
0 0 0 edgecolor
newpath 1514.43 917.85 moveto
1525.17 910.04 1536.33 901.94 1547.54 893.79 curveto
stroke
0 0 0 edgecolor
newpath 1553.92 902.13 moveto
1572.02 876 lineto
1541.58 885.14 lineto
closepath fill
3 setlinewidth
solid
0 0 0 edgecolor
newpath 1553.92 902.13 moveto
1572.02 876 lineto
1541.58 885.14 lineto
closepath stroke
grestore
% L12P
gsave
0.10588 1 1 nodecolor
858.84 1237.05 108 108 ellipse_path fill
1 setlinewidth
filled
0 0 0 nodecolor
858.84 1237.05 108 108 ellipse_path stroke
0 0 0 nodecolor
38 /Arial-Bold set_font
833.84 1227.65 moveto 50 (PV) alignedtext
grestore
% L12P->L12
gsave
3 setlinewidth
0 0 0 edgecolor
newpath 930.13 1318.67 moveto
938.87 1328.68 947.94 1339.06 957.05 1349.49 curveto
stroke
0 0 0 edgecolor
newpath 949.32 1356.6 moveto
976.96 1372.29 lineto
965.13 1342.79 lineto
closepath fill
3 setlinewidth
solid
0 0 0 edgecolor
newpath 949.32 1356.6 moveto
976.96 1372.29 lineto
965.13 1342.79 lineto
closepath stroke
grestore
% L13P
gsave
0.10588 1 1 nodecolor
644.69 335.65 108 108 ellipse_path fill
1 setlinewidth
filled
0 0 0 nodecolor
644.69 335.65 108 108 ellipse_path stroke
0 0 0 nodecolor
38 /Arial-Bold set_font
619.69 326.25 moveto 50 (PV) alignedtext
grestore
% L13P->L13
gsave
3 setlinewidth
0 0 0 edgecolor
newpath 556.06 398.02 moveto
545.2 405.66 533.93 413.59 522.6 421.57 curveto
stroke
0 0 0 edgecolor
newpath 516.34 413.13 moveto
497.85 438.98 lineto
528.42 430.31 lineto
closepath fill
3 setlinewidth
solid
0 0 0 edgecolor
newpath 516.34 413.13 moveto
497.85 438.98 lineto
528.42 430.31 lineto
closepath stroke
grestore
endpage
showpage
grestore
%%PageTrailer
%%EndPage: 1
%%Trailer
end
restore
%%EOF
