%!PS-Adobe-3.0 EPSF-3.0
%%Title: img/unscheduled-profiles.eps
%%Creator: matplotlib version 2.0.0, http://matplotlib.org/
%%CreationDate: Sun Jun  2 10:28:25 2019
%%Orientation: portrait
%%BoundingBox: 75 223 536 568
%%EndComments
%%BeginProlog
/mpldict 8 dict def
mpldict begin
/m { moveto } bind def
/l { lineto } bind def
/r { rlineto } bind def
/c { curveto } bind def
/cl { closepath } bind def
/box {
m
1 index 0 r
0 exch r
neg 0 r
cl
} bind def
/clipbox {
box
clip
newpath
} bind def
%!PS-Adobe-3.0 Resource-Font
%%Title: DejaVu Sans
%%Copyright: Copyright (c) 2003 by Bitstream, Inc. All Rights Reserved. Copyright (c) 2006 by Tavmjong Bah. All Rights Reserved. DejaVu changes are in public domain 
%%Creator: Converted from TrueType to type 3 by PPR
25 dict begin
/_d{bind def}bind def
/_m{moveto}_d
/_l{lineto}_d
/_cl{closepath eofill}_d
/_c{curveto}_d
/_sc{7 -1 roll{setcachedevice}{pop pop pop pop pop pop}ifelse}_d
/_e{exec}_d
/FontName /DejaVuSans def
/PaintType 0 def
/FontMatrix[.001 0 0 .001 0 0]def
/FontBBox[-1021 -463 1793 1232]def
/FontType 3 def
/Encoding [ /space /parenleft /parenright /period /zero /one /two /three /four /five /six /seven /H /P /T /W /c /d /e /h /i /k /m /n /o /r /s /t /u /w ] def
/FontInfo 10 dict dup begin
/FamilyName (DejaVu Sans) def
/FullName (DejaVu Sans) def
/Notice (Copyright (c) 2003 by Bitstream, Inc. All Rights Reserved. Copyright (c) 2006 by Tavmjong Bah. All Rights Reserved. DejaVu changes are in public domain ) def
/Weight (Book) def
/Version (Version 2.35) def
/ItalicAngle 0.0 def
/isFixedPitch false def
/UnderlinePosition -130 def
/UnderlineThickness 90 def
end readonly def
/CharStrings 30 dict dup begin
/space{318 0 0 0 0 0 _sc
}_d
/parenleft{390 0 86 -131 310 759 _sc
310 759 _m
266 683 234 609 213 536 _c
191 463 181 389 181 314 _c
181 238 191 164 213 91 _c
234 17 266 -56 310 -131 _c
232 -131 _l
183 -54 146 20 122 94 _c
98 168 86 241 86 314 _c
86 386 98 459 122 533 _c
146 607 182 682 232 759 _c
310 759 _l
_cl}_d
/parenright{390 0 80 -131 304 759 _sc
80 759 _m
158 759 _l
206 682 243 607 267 533 _c
291 459 304 386 304 314 _c
304 241 291 168 267 94 _c
243 20 206 -54 158 -131 _c
80 -131 _l
123 -56 155 17 177 91 _c
198 164 209 238 209 314 _c
209 389 198 463 177 536 _c
155 609 123 683 80 759 _c
_cl}_d
/period{318 0 107 0 210 124 _sc
107 124 _m
210 124 _l
210 0 _l
107 0 _l
107 124 _l
_cl}_d
/zero{636 0 66 -13 570 742 _sc
318 664 _m
267 664 229 639 203 589 _c
177 539 165 464 165 364 _c
165 264 177 189 203 139 _c
229 89 267 64 318 64 _c
369 64 407 89 433 139 _c
458 189 471 264 471 364 _c
471 464 458 539 433 589 _c
407 639 369 664 318 664 _c
318 742 _m
399 742 461 709 505 645 _c
548 580 570 486 570 364 _c
570 241 548 147 505 83 _c
461 19 399 -13 318 -13 _c
236 -13 173 19 130 83 _c
87 147 66 241 66 364 _c
66 486 87 580 130 645 _c
173 709 236 742 318 742 _c
_cl}_d
/one{636 0 110 0 544 729 _sc
124 83 _m
285 83 _l
285 639 _l
110 604 _l
110 694 _l
284 729 _l
383 729 _l
383 83 _l
544 83 _l
544 0 _l
124 0 _l
124 83 _l
_cl}_d
/two{{636 0 73 0 536 742 _sc
192 83 _m
536 83 _l
536 0 _l
73 0 _l
73 83 _l
110 121 161 173 226 239 _c
290 304 331 346 348 365 _c
380 400 402 430 414 455 _c
426 479 433 504 433 528 _c
433 566 419 598 392 622 _c
365 646 330 659 286 659 _c
255 659 222 653 188 643 _c
154 632 117 616 78 594 _c
78 694 _l
118 710 155 722 189 730 _c
223 738 255 742 284 742 _c
}_e{359 742 419 723 464 685 _c
509 647 532 597 532 534 _c
532 504 526 475 515 449 _c
504 422 484 390 454 354 _c
446 344 420 317 376 272 _c
332 227 271 164 192 83 _c
_cl}_e}_d
/three{{636 0 76 -13 556 742 _sc
406 393 _m
453 383 490 362 516 330 _c
542 298 556 258 556 212 _c
556 140 531 84 482 45 _c
432 6 362 -13 271 -13 _c
240 -13 208 -10 176 -4 _c
144 1 110 10 76 22 _c
76 117 _l
103 101 133 89 166 81 _c
198 73 232 69 268 69 _c
330 69 377 81 409 105 _c
441 129 458 165 458 212 _c
458 254 443 288 413 312 _c
383 336 341 349 287 349 _c
}_e{202 349 _l
202 430 _l
291 430 _l
339 430 376 439 402 459 _c
428 478 441 506 441 543 _c
441 580 427 609 401 629 _c
374 649 336 659 287 659 _c
260 659 231 656 200 650 _c
169 644 135 635 98 623 _c
98 711 _l
135 721 170 729 203 734 _c
235 739 266 742 296 742 _c
370 742 429 725 473 691 _c
517 657 539 611 539 553 _c
539 513 527 479 504 451 _c
481 423 448 403 406 393 _c
_cl}_e}_d
/four{636 0 49 0 580 729 _sc
378 643 _m
129 254 _l
378 254 _l
378 643 _l
352 729 _m
476 729 _l
476 254 _l
580 254 _l
580 172 _l
476 172 _l
476 0 _l
378 0 _l
378 172 _l
49 172 _l
49 267 _l
352 729 _l
_cl}_d
/five{{636 0 77 -13 549 729 _sc
108 729 _m
495 729 _l
495 646 _l
198 646 _l
198 467 _l
212 472 227 476 241 478 _c
255 480 270 482 284 482 _c
365 482 429 459 477 415 _c
525 370 549 310 549 234 _c
549 155 524 94 475 51 _c
426 8 357 -13 269 -13 _c
238 -13 207 -10 175 -6 _c
143 -1 111 6 77 17 _c
77 116 _l
106 100 136 88 168 80 _c
199 72 232 69 267 69 _c
}_e{323 69 368 83 401 113 _c
433 143 450 183 450 234 _c
450 284 433 324 401 354 _c
368 384 323 399 267 399 _c
241 399 214 396 188 390 _c
162 384 135 375 108 363 _c
108 729 _l
_cl}_e}_d
/six{{636 0 70 -13 573 742 _sc
330 404 _m
286 404 251 388 225 358 _c
199 328 186 286 186 234 _c
186 181 199 139 225 109 _c
251 79 286 64 330 64 _c
374 64 409 79 435 109 _c
461 139 474 181 474 234 _c
474 286 461 328 435 358 _c
409 388 374 404 330 404 _c
526 713 _m
526 623 _l
501 635 476 644 451 650 _c
425 656 400 659 376 659 _c
310 659 260 637 226 593 _c
}_e{192 549 172 482 168 394 _c
187 422 211 444 240 459 _c
269 474 301 482 336 482 _c
409 482 467 459 509 415 _c
551 371 573 310 573 234 _c
573 159 550 99 506 54 _c
462 9 403 -13 330 -13 _c
246 -13 181 19 137 83 _c
92 147 70 241 70 364 _c
70 479 97 571 152 639 _c
206 707 280 742 372 742 _c
396 742 421 739 447 735 _c
472 730 498 723 526 713 _c
_cl}_e}_d
/seven{636 0 82 0 551 729 _sc
82 729 _m
551 729 _l
551 687 _l
286 0 _l
183 0 _l
432 646 _l
82 646 _l
82 729 _l
_cl}_d
/H{752 0 98 0 654 729 _sc
98 729 _m
197 729 _l
197 430 _l
555 430 _l
555 729 _l
654 729 _l
654 0 _l
555 0 _l
555 347 _l
197 347 _l
197 0 _l
98 0 _l
98 729 _l
_cl}_d
/P{603 0 98 0 569 729 _sc
197 648 _m
197 374 _l
321 374 _l
367 374 402 385 427 409 _c
452 433 465 467 465 511 _c
465 555 452 588 427 612 _c
402 636 367 648 321 648 _c
197 648 _l
98 729 _m
321 729 _l
402 729 464 710 506 673 _c
548 636 569 582 569 511 _c
569 439 548 384 506 348 _c
464 311 402 293 321 293 _c
197 293 _l
197 0 _l
98 0 _l
98 729 _l
_cl}_d
/T{611 0 -2 0 614 729 _sc
-2 729 _m
614 729 _l
614 646 _l
355 646 _l
355 0 _l
256 0 _l
256 646 _l
-2 646 _l
-2 729 _l
_cl}_d
/W{989 0 33 0 956 729 _sc
33 729 _m
133 729 _l
286 113 _l
439 729 _l
550 729 _l
703 113 _l
856 729 _l
956 729 _l
773 0 _l
649 0 _l
495 633 _l
340 0 _l
216 0 _l
33 729 _l
_cl}_d
/c{{550 0 55 -13 488 560 _sc
488 526 _m
488 442 _l
462 456 437 466 411 473 _c
385 480 360 484 334 484 _c
276 484 230 465 198 428 _c
166 391 150 339 150 273 _c
150 206 166 154 198 117 _c
230 80 276 62 334 62 _c
360 62 385 65 411 72 _c
437 79 462 90 488 104 _c
488 21 _l
462 9 436 0 410 -5 _c
383 -10 354 -13 324 -13 _c
242 -13 176 12 128 64 _c
}_e{79 115 55 185 55 273 _c
55 362 79 432 128 483 _c
177 534 244 560 330 560 _c
358 560 385 557 411 551 _c
437 545 463 537 488 526 _c
_cl}_e}_d
/d{{635 0 55 -13 544 760 _sc
454 464 _m
454 760 _l
544 760 _l
544 0 _l
454 0 _l
454 82 _l
435 49 411 25 382 10 _c
353 -5 319 -13 279 -13 _c
213 -13 159 13 117 65 _c
75 117 55 187 55 273 _c
55 359 75 428 117 481 _c
159 533 213 560 279 560 _c
319 560 353 552 382 536 _c
411 520 435 496 454 464 _c
148 273 _m
148 207 161 155 188 117 _c
215 79 253 61 301 61 _c
}_e{348 61 385 79 413 117 _c
440 155 454 207 454 273 _c
454 339 440 390 413 428 _c
385 466 348 485 301 485 _c
253 485 215 466 188 428 _c
161 390 148 339 148 273 _c
_cl}_e}_d
/e{{615 0 55 -13 562 560 _sc
562 296 _m
562 252 _l
149 252 _l
153 190 171 142 205 110 _c
238 78 284 62 344 62 _c
378 62 412 66 444 74 _c
476 82 509 95 541 113 _c
541 28 _l
509 14 476 3 442 -3 _c
408 -9 373 -13 339 -13 _c
251 -13 182 12 131 62 _c
80 112 55 181 55 268 _c
55 357 79 428 127 481 _c
175 533 241 560 323 560 _c
397 560 455 536 498 489 _c
}_e{540 441 562 377 562 296 _c
472 322 _m
471 371 457 410 431 440 _c
404 469 368 484 324 484 _c
274 484 234 469 204 441 _c
174 413 156 373 152 322 _c
472 322 _l
_cl}_e}_d
/h{634 0 91 0 549 760 _sc
549 330 _m
549 0 _l
459 0 _l
459 327 _l
459 379 448 417 428 443 _c
408 469 378 482 338 482 _c
289 482 251 466 223 435 _c
195 404 181 362 181 309 _c
181 0 _l
91 0 _l
91 760 _l
181 760 _l
181 462 _l
202 494 227 519 257 535 _c
286 551 320 560 358 560 _c
420 560 468 540 500 501 _c
532 462 549 405 549 330 _c
_cl}_d
/i{278 0 94 0 184 760 _sc
94 547 _m
184 547 _l
184 0 _l
94 0 _l
94 547 _l
94 760 _m
184 760 _l
184 646 _l
94 646 _l
94 760 _l
_cl}_d
/k{579 0 91 0 576 760 _sc
91 760 _m
181 760 _l
181 311 _l
449 547 _l
564 547 _l
274 291 _l
576 0 _l
459 0 _l
181 267 _l
181 0 _l
91 0 _l
91 760 _l
_cl}_d
/m{{974 0 91 0 889 560 _sc
520 442 _m
542 482 569 511 600 531 _c
631 550 668 560 711 560 _c
767 560 811 540 842 500 _c
873 460 889 403 889 330 _c
889 0 _l
799 0 _l
799 327 _l
799 379 789 418 771 444 _c
752 469 724 482 686 482 _c
639 482 602 466 575 435 _c
548 404 535 362 535 309 _c
535 0 _l
445 0 _l
445 327 _l
445 379 435 418 417 444 _c
398 469 369 482 331 482 _c
}_e{285 482 248 466 221 435 _c
194 404 181 362 181 309 _c
181 0 _l
91 0 _l
91 547 _l
181 547 _l
181 462 _l
201 495 226 520 255 536 _c
283 552 317 560 357 560 _c
397 560 430 550 458 530 _c
486 510 506 480 520 442 _c
_cl}_e}_d
/n{634 0 91 0 549 560 _sc
549 330 _m
549 0 _l
459 0 _l
459 327 _l
459 379 448 417 428 443 _c
408 469 378 482 338 482 _c
289 482 251 466 223 435 _c
195 404 181 362 181 309 _c
181 0 _l
91 0 _l
91 547 _l
181 547 _l
181 462 _l
202 494 227 519 257 535 _c
286 551 320 560 358 560 _c
420 560 468 540 500 501 _c
532 462 549 405 549 330 _c
_cl}_d
/o{612 0 55 -13 557 560 _sc
306 484 _m
258 484 220 465 192 427 _c
164 389 150 338 150 273 _c
150 207 163 156 191 118 _c
219 80 257 62 306 62 _c
354 62 392 80 420 118 _c
448 156 462 207 462 273 _c
462 337 448 389 420 427 _c
392 465 354 484 306 484 _c
306 560 _m
384 560 445 534 490 484 _c
534 433 557 363 557 273 _c
557 183 534 113 490 63 _c
445 12 384 -13 306 -13 _c
227 -13 165 12 121 63 _c
77 113 55 183 55 273 _c
55 363 77 433 121 484 _c
165 534 227 560 306 560 _c
_cl}_d
/r{411 0 91 0 411 560 _sc
411 463 _m
401 469 390 473 378 476 _c
366 478 353 480 339 480 _c
288 480 249 463 222 430 _c
194 397 181 350 181 288 _c
181 0 _l
91 0 _l
91 547 _l
181 547 _l
181 462 _l
199 495 224 520 254 536 _c
284 552 321 560 365 560 _c
371 560 378 559 386 559 _c
393 558 401 557 411 555 _c
411 463 _l
_cl}_d
/s{{521 0 54 -13 472 560 _sc
443 531 _m
443 446 _l
417 458 391 468 364 475 _c
336 481 308 485 279 485 _c
234 485 200 478 178 464 _c
156 450 145 430 145 403 _c
145 382 153 366 169 354 _c
185 342 217 330 265 320 _c
296 313 _l
360 299 405 279 432 255 _c
458 230 472 195 472 151 _c
472 100 452 60 412 31 _c
372 1 316 -13 246 -13 _c
216 -13 186 -10 154 -5 _c
}_e{122 0 89 8 54 20 _c
54 113 _l
87 95 120 82 152 74 _c
184 65 216 61 248 61 _c
290 61 323 68 346 82 _c
368 96 380 117 380 144 _c
380 168 371 187 355 200 _c
339 213 303 226 247 238 _c
216 245 _l
160 257 119 275 95 299 _c
70 323 58 356 58 399 _c
58 450 76 490 112 518 _c
148 546 200 560 268 560 _c
301 560 332 557 362 552 _c
391 547 418 540 443 531 _c
}_e{_cl}_e}_d
/t{392 0 27 0 368 702 _sc
183 702 _m
183 547 _l
368 547 _l
368 477 _l
183 477 _l
183 180 _l
183 135 189 106 201 94 _c
213 81 238 75 276 75 _c
368 75 _l
368 0 _l
276 0 _l
206 0 158 13 132 39 _c
106 65 93 112 93 180 _c
93 477 _l
27 477 _l
27 547 _l
93 547 _l
93 702 _l
183 702 _l
_cl}_d
/u{634 0 85 -13 543 560 _sc
85 216 _m
85 547 _l
175 547 _l
175 219 _l
175 167 185 129 205 103 _c
225 77 255 64 296 64 _c
344 64 383 79 411 110 _c
439 141 453 183 453 237 _c
453 547 _l
543 547 _l
543 0 _l
453 0 _l
453 84 _l
431 50 405 26 377 10 _c
348 -5 315 -13 277 -13 _c
214 -13 166 6 134 45 _c
101 83 85 140 85 216 _c
311 560 _m
311 560 _l
_cl}_d
/w{818 0 42 0 776 547 _sc
42 547 _m
132 547 _l
244 120 _l
356 547 _l
462 547 _l
574 120 _l
686 547 _l
776 547 _l
633 0 _l
527 0 _l
409 448 _l
291 0 _l
185 0 _l
42 547 _l
_cl}_d
end readonly def

/BuildGlyph
 {exch begin
 CharStrings exch
 2 copy known not{pop /.notdef}if
 true 3 1 roll get exec
 end}_d

/BuildChar {
 1 index /Encoding get exch get
 1 index /BuildGlyph get exec
}_d

FontName currentdict end definefont pop
end
%%EndProlog
mpldict begin
75.6 223.2 translate
460.8 345.6 0 0 clipbox
gsave
0 0 m
460.8 0 l
460.8 345.6 l
0 345.6 l
cl
1.000 setgray
fill
grestore
gsave
57.6 38.016 m
414.72 38.016 l
414.72 304.128 l
57.6 304.128 l
cl
1.000 setgray
fill
grestore
gsave
357.1 266.1 57.6 38.02 clipbox
73.832727 38.016 m
84.745485 38.016 l
84.745485 38.016 l
73.832727 38.016 l
cl
0.122 0.467 0.706 setrgbcolor
fill
grestore
gsave
357.1 266.1 57.6 38.02 clipbox
87.473675 38.016 m
98.386432 38.016 l
98.386432 38.016 l
87.473675 38.016 l
cl
0.122 0.467 0.706 setrgbcolor
fill
grestore
gsave
357.1 266.1 57.6 38.02 clipbox
101.114622 38.016 m
112.02738 38.016 l
112.02738 38.016 l
101.114622 38.016 l
cl
0.122 0.467 0.706 setrgbcolor
fill
grestore
gsave
357.1 266.1 57.6 38.02 clipbox
114.755569 38.016 m
125.668327 38.016 l
125.668327 38.016 l
114.755569 38.016 l
cl
0.122 0.467 0.706 setrgbcolor
fill
grestore
gsave
357.1 266.1 57.6 38.02 clipbox
128.396516 38.016 m
139.309274 38.016 l
139.309274 38.016 l
128.396516 38.016 l
cl
0.122 0.467 0.706 setrgbcolor
fill
grestore
gsave
357.1 266.1 57.6 38.02 clipbox
142.037464 38.016 m
152.950222 38.016 l
152.950222 38.016 l
142.037464 38.016 l
cl
0.122 0.467 0.706 setrgbcolor
fill
grestore
gsave
357.1 266.1 57.6 38.02 clipbox
155.678411 38.016 m
166.591169 38.016 l
166.591169 93.330286 l
155.678411 93.330286 l
cl
0.122 0.467 0.706 setrgbcolor
fill
grestore
gsave
357.1 266.1 57.6 38.02 clipbox
169.319358 38.016 m
180.232116 38.016 l
180.232116 68.187429 l
169.319358 68.187429 l
cl
0.122 0.467 0.706 setrgbcolor
fill
grestore
gsave
357.1 266.1 57.6 38.02 clipbox
182.960306 38.016 m
193.873063 38.016 l
193.873063 38.016 l
182.960306 38.016 l
cl
0.122 0.467 0.706 setrgbcolor
fill
grestore
gsave
357.1 266.1 57.6 38.02 clipbox
196.601253 38.016 m
207.514011 38.016 l
207.514011 38.016 l
196.601253 38.016 l
cl
0.122 0.467 0.706 setrgbcolor
fill
grestore
gsave
357.1 266.1 57.6 38.02 clipbox
210.2422 38.016 m
221.154958 38.016 l
221.154958 38.016 l
210.2422 38.016 l
cl
0.122 0.467 0.706 setrgbcolor
fill
grestore
gsave
357.1 266.1 57.6 38.02 clipbox
223.883147 38.016 m
234.795905 38.016 l
234.795905 38.016 l
223.883147 38.016 l
cl
0.122 0.467 0.706 setrgbcolor
fill
grestore
gsave
357.1 266.1 57.6 38.02 clipbox
237.524095 38.016 m
248.436853 38.016 l
248.436853 38.016 l
237.524095 38.016 l
cl
0.122 0.467 0.706 setrgbcolor
fill
grestore
gsave
357.1 266.1 57.6 38.02 clipbox
251.165042 38.016 m
262.0778 38.016 l
262.0778 38.016 l
251.165042 38.016 l
cl
0.122 0.467 0.706 setrgbcolor
fill
grestore
gsave
357.1 266.1 57.6 38.02 clipbox
264.805989 38.016 m
275.718747 38.016 l
275.718747 38.016 l
264.805989 38.016 l
cl
0.122 0.467 0.706 setrgbcolor
fill
grestore
gsave
357.1 266.1 57.6 38.02 clipbox
278.446937 38.016 m
289.359694 38.016 l
289.359694 38.016 l
278.446937 38.016 l
cl
0.122 0.467 0.706 setrgbcolor
fill
grestore
gsave
357.1 266.1 57.6 38.02 clipbox
292.087884 38.016 m
303.000642 38.016 l
303.000642 38.016 l
292.087884 38.016 l
cl
0.122 0.467 0.706 setrgbcolor
fill
grestore
gsave
357.1 266.1 57.6 38.02 clipbox
305.728831 38.016 m
316.641589 38.016 l
316.641589 38.016 l
305.728831 38.016 l
cl
0.122 0.467 0.706 setrgbcolor
fill
grestore
gsave
357.1 266.1 57.6 38.02 clipbox
319.369778 38.016 m
330.282536 38.016 l
330.282536 63.158857 l
319.369778 63.158857 l
cl
0.122 0.467 0.706 setrgbcolor
fill
grestore
gsave
357.1 266.1 57.6 38.02 clipbox
333.010726 38.016 m
343.923484 38.016 l
343.923484 68.187429 l
333.010726 68.187429 l
cl
0.122 0.467 0.706 setrgbcolor
fill
grestore
gsave
357.1 266.1 57.6 38.02 clipbox
346.651673 38.016 m
357.564431 38.016 l
357.564431 68.187429 l
346.651673 68.187429 l
cl
0.122 0.467 0.706 setrgbcolor
fill
grestore
gsave
357.1 266.1 57.6 38.02 clipbox
360.29262 38.016 m
371.205378 38.016 l
371.205378 39.021714 l
360.29262 39.021714 l
cl
0.122 0.467 0.706 setrgbcolor
fill
grestore
gsave
357.1 266.1 57.6 38.02 clipbox
373.933568 38.016 m
384.846325 38.016 l
384.846325 48.073143 l
373.933568 48.073143 l
cl
0.122 0.467 0.706 setrgbcolor
fill
grestore
gsave
357.1 266.1 57.6 38.02 clipbox
387.574515 38.016 m
398.487273 38.016 l
398.487273 38.016 l
387.574515 38.016 l
cl
0.122 0.467 0.706 setrgbcolor
fill
grestore
gsave
357.1 266.1 57.6 38.02 clipbox
73.832727 38.016 m
84.745485 38.016 l
84.745485 38.016 l
73.832727 38.016 l
cl
1.000 0.498 0.055 setrgbcolor
fill
grestore
gsave
357.1 266.1 57.6 38.02 clipbox
87.473675 38.016 m
98.386432 38.016 l
98.386432 38.016 l
87.473675 38.016 l
cl
1.000 0.498 0.055 setrgbcolor
fill
grestore
gsave
357.1 266.1 57.6 38.02 clipbox
101.114622 38.016 m
112.02738 38.016 l
112.02738 38.016 l
101.114622 38.016 l
cl
1.000 0.498 0.055 setrgbcolor
fill
grestore
gsave
357.1 266.1 57.6 38.02 clipbox
114.755569 38.016 m
125.668327 38.016 l
125.668327 38.016 l
114.755569 38.016 l
cl
1.000 0.498 0.055 setrgbcolor
fill
grestore
gsave
357.1 266.1 57.6 38.02 clipbox
128.396516 38.016 m
139.309274 38.016 l
139.309274 38.016 l
128.396516 38.016 l
cl
1.000 0.498 0.055 setrgbcolor
fill
grestore
gsave
357.1 266.1 57.6 38.02 clipbox
142.037464 38.016 m
152.950222 38.016 l
152.950222 63.158857 l
142.037464 63.158857 l
cl
1.000 0.498 0.055 setrgbcolor
fill
grestore
gsave
357.1 266.1 57.6 38.02 clipbox
155.678411 93.330286 m
166.591169 93.330286 l
166.591169 118.473143 l
155.678411 118.473143 l
cl
1.000 0.498 0.055 setrgbcolor
fill
grestore
gsave
357.1 266.1 57.6 38.02 clipbox
169.319358 68.187429 m
180.232116 68.187429 l
180.232116 103.387429 l
169.319358 103.387429 l
cl
1.000 0.498 0.055 setrgbcolor
fill
grestore
gsave
357.1 266.1 57.6 38.02 clipbox
182.960306 38.016 m
193.873063 38.016 l
193.873063 38.016 l
182.960306 38.016 l
cl
1.000 0.498 0.055 setrgbcolor
fill
grestore
gsave
357.1 266.1 57.6 38.02 clipbox
196.601253 38.016 m
207.514011 38.016 l
207.514011 38.016 l
196.601253 38.016 l
cl
1.000 0.498 0.055 setrgbcolor
fill
grestore
gsave
357.1 266.1 57.6 38.02 clipbox
210.2422 38.016 m
221.154958 38.016 l
221.154958 38.016 l
210.2422 38.016 l
cl
1.000 0.498 0.055 setrgbcolor
fill
grestore
gsave
357.1 266.1 57.6 38.02 clipbox
223.883147 38.016 m
234.795905 38.016 l
234.795905 38.016 l
223.883147 38.016 l
cl
1.000 0.498 0.055 setrgbcolor
fill
grestore
gsave
357.1 266.1 57.6 38.02 clipbox
237.524095 38.016 m
248.436853 38.016 l
248.436853 38.016 l
237.524095 38.016 l
cl
1.000 0.498 0.055 setrgbcolor
fill
grestore
gsave
357.1 266.1 57.6 38.02 clipbox
251.165042 38.016 m
262.0778 38.016 l
262.0778 38.016 l
251.165042 38.016 l
cl
1.000 0.498 0.055 setrgbcolor
fill
grestore
gsave
357.1 266.1 57.6 38.02 clipbox
264.805989 38.016 m
275.718747 38.016 l
275.718747 38.016 l
264.805989 38.016 l
cl
1.000 0.498 0.055 setrgbcolor
fill
grestore
gsave
357.1 266.1 57.6 38.02 clipbox
278.446937 38.016 m
289.359694 38.016 l
289.359694 38.016 l
278.446937 38.016 l
cl
1.000 0.498 0.055 setrgbcolor
fill
grestore
gsave
357.1 266.1 57.6 38.02 clipbox
292.087884 38.016 m
303.000642 38.016 l
303.000642 38.016 l
292.087884 38.016 l
cl
1.000 0.498 0.055 setrgbcolor
fill
grestore
gsave
357.1 266.1 57.6 38.02 clipbox
305.728831 38.016 m
316.641589 38.016 l
316.641589 38.016 l
305.728831 38.016 l
cl
1.000 0.498 0.055 setrgbcolor
fill
grestore
gsave
357.1 266.1 57.6 38.02 clipbox
319.369778 63.158857 m
330.282536 63.158857 l
330.282536 93.330286 l
319.369778 93.330286 l
cl
1.000 0.498 0.055 setrgbcolor
fill
grestore
gsave
357.1 266.1 57.6 38.02 clipbox
333.010726 68.187429 m
343.923484 68.187429 l
343.923484 98.358857 l
333.010726 98.358857 l
cl
1.000 0.498 0.055 setrgbcolor
fill
grestore
gsave
357.1 266.1 57.6 38.02 clipbox
346.651673 68.187429 m
357.564431 68.187429 l
357.564431 108.416 l
346.651673 108.416 l
cl
1.000 0.498 0.055 setrgbcolor
fill
grestore
gsave
357.1 266.1 57.6 38.02 clipbox
360.29262 39.021714 m
371.205378 39.021714 l
371.205378 49.078857 l
360.29262 49.078857 l
cl
1.000 0.498 0.055 setrgbcolor
fill
grestore
gsave
357.1 266.1 57.6 38.02 clipbox
373.933568 48.073143 m
384.846325 48.073143 l
384.846325 48.073143 l
373.933568 48.073143 l
cl
1.000 0.498 0.055 setrgbcolor
fill
grestore
gsave
357.1 266.1 57.6 38.02 clipbox
387.574515 38.016 m
398.487273 38.016 l
398.487273 38.016 l
387.574515 38.016 l
cl
1.000 0.498 0.055 setrgbcolor
fill
grestore
gsave
357.1 266.1 57.6 38.02 clipbox
73.832727 38.016 m
84.745485 38.016 l
84.745485 38.016 l
73.832727 38.016 l
cl
0.173 0.627 0.173 setrgbcolor
fill
grestore
gsave
357.1 266.1 57.6 38.02 clipbox
87.473675 38.016 m
98.386432 38.016 l
98.386432 38.016 l
87.473675 38.016 l
cl
0.173 0.627 0.173 setrgbcolor
fill
grestore
gsave
357.1 266.1 57.6 38.02 clipbox
101.114622 38.016 m
112.02738 38.016 l
112.02738 38.016 l
101.114622 38.016 l
cl
0.173 0.627 0.173 setrgbcolor
fill
grestore
gsave
357.1 266.1 57.6 38.02 clipbox
114.755569 38.016 m
125.668327 38.016 l
125.668327 38.016 l
114.755569 38.016 l
cl
0.173 0.627 0.173 setrgbcolor
fill
grestore
gsave
357.1 266.1 57.6 38.02 clipbox
128.396516 38.016 m
139.309274 38.016 l
139.309274 38.016 l
128.396516 38.016 l
cl
0.173 0.627 0.173 setrgbcolor
fill
grestore
gsave
357.1 266.1 57.6 38.02 clipbox
142.037464 63.158857 m
152.950222 63.158857 l
152.950222 63.158857 l
142.037464 63.158857 l
cl
0.173 0.627 0.173 setrgbcolor
fill
grestore
gsave
357.1 266.1 57.6 38.02 clipbox
155.678411 118.473143 m
166.591169 118.473143 l
166.591169 143.616 l
155.678411 143.616 l
cl
0.173 0.627 0.173 setrgbcolor
fill
grestore
gsave
357.1 266.1 57.6 38.02 clipbox
169.319358 103.387429 m
180.232116 103.387429 l
180.232116 158.701714 l
169.319358 158.701714 l
cl
0.173 0.627 0.173 setrgbcolor
fill
grestore
gsave
357.1 266.1 57.6 38.02 clipbox
182.960306 38.016 m
193.873063 38.016 l
193.873063 53.101714 l
182.960306 53.101714 l
cl
0.173 0.627 0.173 setrgbcolor
fill
grestore
gsave
357.1 266.1 57.6 38.02 clipbox
196.601253 38.016 m
207.514011 38.016 l
207.514011 48.073143 l
196.601253 48.073143 l
cl
0.173 0.627 0.173 setrgbcolor
fill
grestore
gsave
357.1 266.1 57.6 38.02 clipbox
210.2422 38.016 m
221.154958 38.016 l
221.154958 48.073143 l
210.2422 48.073143 l
cl
0.173 0.627 0.173 setrgbcolor
fill
grestore
gsave
357.1 266.1 57.6 38.02 clipbox
223.883147 38.016 m
234.795905 38.016 l
234.795905 58.130286 l
223.883147 58.130286 l
cl
0.173 0.627 0.173 setrgbcolor
fill
grestore
gsave
357.1 266.1 57.6 38.02 clipbox
237.524095 38.016 m
248.436853 38.016 l
248.436853 38.016 l
237.524095 38.016 l
cl
0.173 0.627 0.173 setrgbcolor
fill
grestore
gsave
357.1 266.1 57.6 38.02 clipbox
251.165042 38.016 m
262.0778 38.016 l
262.0778 38.016 l
251.165042 38.016 l
cl
0.173 0.627 0.173 setrgbcolor
fill
grestore
gsave
357.1 266.1 57.6 38.02 clipbox
264.805989 38.016 m
275.718747 38.016 l
275.718747 38.016 l
264.805989 38.016 l
cl
0.173 0.627 0.173 setrgbcolor
fill
grestore
gsave
357.1 266.1 57.6 38.02 clipbox
278.446937 38.016 m
289.359694 38.016 l
289.359694 38.016 l
278.446937 38.016 l
cl
0.173 0.627 0.173 setrgbcolor
fill
grestore
gsave
357.1 266.1 57.6 38.02 clipbox
292.087884 38.016 m
303.000642 38.016 l
303.000642 48.073143 l
292.087884 48.073143 l
cl
0.173 0.627 0.173 setrgbcolor
fill
grestore
gsave
357.1 266.1 57.6 38.02 clipbox
305.728831 38.016 m
316.641589 38.016 l
316.641589 53.101714 l
305.728831 53.101714 l
cl
0.173 0.627 0.173 setrgbcolor
fill
grestore
gsave
357.1 266.1 57.6 38.02 clipbox
319.369778 93.330286 m
330.282536 93.330286 l
330.282536 103.387429 l
319.369778 103.387429 l
cl
0.173 0.627 0.173 setrgbcolor
fill
grestore
gsave
357.1 266.1 57.6 38.02 clipbox
333.010726 98.358857 m
343.923484 98.358857 l
343.923484 118.473143 l
333.010726 118.473143 l
cl
0.173 0.627 0.173 setrgbcolor
fill
grestore
gsave
357.1 266.1 57.6 38.02 clipbox
346.651673 108.416 m
357.564431 108.416 l
357.564431 138.587429 l
346.651673 138.587429 l
cl
0.173 0.627 0.173 setrgbcolor
fill
grestore
gsave
357.1 266.1 57.6 38.02 clipbox
360.29262 49.078857 m
371.205378 49.078857 l
371.205378 59.136 l
360.29262 59.136 l
cl
0.173 0.627 0.173 setrgbcolor
fill
grestore
gsave
357.1 266.1 57.6 38.02 clipbox
373.933568 48.073143 m
384.846325 48.073143 l
384.846325 48.073143 l
373.933568 48.073143 l
cl
0.173 0.627 0.173 setrgbcolor
fill
grestore
gsave
357.1 266.1 57.6 38.02 clipbox
387.574515 38.016 m
398.487273 38.016 l
398.487273 38.016 l
387.574515 38.016 l
cl
0.173 0.627 0.173 setrgbcolor
fill
grestore
gsave
357.1 266.1 57.6 38.02 clipbox
73.832727 38.016 m
84.745485 38.016 l
84.745485 38.016 l
73.832727 38.016 l
cl
0.839 0.153 0.157 setrgbcolor
fill
grestore
gsave
357.1 266.1 57.6 38.02 clipbox
87.473675 38.016 m
98.386432 38.016 l
98.386432 38.016 l
87.473675 38.016 l
cl
0.839 0.153 0.157 setrgbcolor
fill
grestore
gsave
357.1 266.1 57.6 38.02 clipbox
101.114622 38.016 m
112.02738 38.016 l
112.02738 38.016 l
101.114622 38.016 l
cl
0.839 0.153 0.157 setrgbcolor
fill
grestore
gsave
357.1 266.1 57.6 38.02 clipbox
114.755569 38.016 m
125.668327 38.016 l
125.668327 38.016 l
114.755569 38.016 l
cl
0.839 0.153 0.157 setrgbcolor
fill
grestore
gsave
357.1 266.1 57.6 38.02 clipbox
128.396516 38.016 m
139.309274 38.016 l
139.309274 38.016 l
128.396516 38.016 l
cl
0.839 0.153 0.157 setrgbcolor
fill
grestore
gsave
357.1 266.1 57.6 38.02 clipbox
142.037464 63.158857 m
152.950222 63.158857 l
152.950222 63.158857 l
142.037464 63.158857 l
cl
0.839 0.153 0.157 setrgbcolor
fill
grestore
gsave
357.1 266.1 57.6 38.02 clipbox
155.678411 143.616 m
166.591169 143.616 l
166.591169 143.616 l
155.678411 143.616 l
cl
0.839 0.153 0.157 setrgbcolor
fill
grestore
gsave
357.1 266.1 57.6 38.02 clipbox
169.319358 158.701714 m
180.232116 158.701714 l
180.232116 214.016 l
169.319358 214.016 l
cl
0.839 0.153 0.157 setrgbcolor
fill
grestore
gsave
357.1 266.1 57.6 38.02 clipbox
182.960306 53.101714 m
193.873063 53.101714 l
193.873063 83.273143 l
182.960306 83.273143 l
cl
0.839 0.153 0.157 setrgbcolor
fill
grestore
gsave
357.1 266.1 57.6 38.02 clipbox
196.601253 48.073143 m
207.514011 48.073143 l
207.514011 48.073143 l
196.601253 48.073143 l
cl
0.839 0.153 0.157 setrgbcolor
fill
grestore
gsave
357.1 266.1 57.6 38.02 clipbox
210.2422 48.073143 m
221.154958 48.073143 l
221.154958 48.073143 l
210.2422 48.073143 l
cl
0.839 0.153 0.157 setrgbcolor
fill
grestore
gsave
357.1 266.1 57.6 38.02 clipbox
223.883147 58.130286 m
234.795905 58.130286 l
234.795905 58.130286 l
223.883147 58.130286 l
cl
0.839 0.153 0.157 setrgbcolor
fill
grestore
gsave
357.1 266.1 57.6 38.02 clipbox
237.524095 38.016 m
248.436853 38.016 l
248.436853 38.016 l
237.524095 38.016 l
cl
0.839 0.153 0.157 setrgbcolor
fill
grestore
gsave
357.1 266.1 57.6 38.02 clipbox
251.165042 38.016 m
262.0778 38.016 l
262.0778 38.016 l
251.165042 38.016 l
cl
0.839 0.153 0.157 setrgbcolor
fill
grestore
gsave
357.1 266.1 57.6 38.02 clipbox
264.805989 38.016 m
275.718747 38.016 l
275.718747 38.016 l
264.805989 38.016 l
cl
0.839 0.153 0.157 setrgbcolor
fill
grestore
gsave
357.1 266.1 57.6 38.02 clipbox
278.446937 38.016 m
289.359694 38.016 l
289.359694 38.016 l
278.446937 38.016 l
cl
0.839 0.153 0.157 setrgbcolor
fill
grestore
gsave
357.1 266.1 57.6 38.02 clipbox
292.087884 48.073143 m
303.000642 48.073143 l
303.000642 48.073143 l
292.087884 48.073143 l
cl
0.839 0.153 0.157 setrgbcolor
fill
grestore
gsave
357.1 266.1 57.6 38.02 clipbox
305.728831 53.101714 m
316.641589 53.101714 l
316.641589 53.101714 l
305.728831 53.101714 l
cl
0.839 0.153 0.157 setrgbcolor
fill
grestore
gsave
357.1 266.1 57.6 38.02 clipbox
319.369778 103.387429 m
330.282536 103.387429 l
330.282536 103.387429 l
319.369778 103.387429 l
cl
0.839 0.153 0.157 setrgbcolor
fill
grestore
gsave
357.1 266.1 57.6 38.02 clipbox
333.010726 118.473143 m
343.923484 118.473143 l
343.923484 143.616 l
333.010726 143.616 l
cl
0.839 0.153 0.157 setrgbcolor
fill
grestore
gsave
357.1 266.1 57.6 38.02 clipbox
346.651673 138.587429 m
357.564431 138.587429 l
357.564431 168.758857 l
346.651673 168.758857 l
cl
0.839 0.153 0.157 setrgbcolor
fill
grestore
gsave
357.1 266.1 57.6 38.02 clipbox
360.29262 59.136 m
371.205378 59.136 l
371.205378 89.307429 l
360.29262 89.307429 l
cl
0.839 0.153 0.157 setrgbcolor
fill
grestore
gsave
357.1 266.1 57.6 38.02 clipbox
373.933568 48.073143 m
384.846325 48.073143 l
384.846325 49.078857 l
373.933568 49.078857 l
cl
0.839 0.153 0.157 setrgbcolor
fill
grestore
gsave
357.1 266.1 57.6 38.02 clipbox
387.574515 38.016 m
398.487273 38.016 l
398.487273 48.073143 l
387.574515 48.073143 l
cl
0.839 0.153 0.157 setrgbcolor
fill
grestore
gsave
357.1 266.1 57.6 38.02 clipbox
73.832727 38.016 m
84.745485 38.016 l
84.745485 38.016 l
73.832727 38.016 l
cl
0.580 0.404 0.741 setrgbcolor
fill
grestore
gsave
357.1 266.1 57.6 38.02 clipbox
87.473675 38.016 m
98.386432 38.016 l
98.386432 38.016 l
87.473675 38.016 l
cl
0.580 0.404 0.741 setrgbcolor
fill
grestore
gsave
357.1 266.1 57.6 38.02 clipbox
101.114622 38.016 m
112.02738 38.016 l
112.02738 38.016 l
101.114622 38.016 l
cl
0.580 0.404 0.741 setrgbcolor
fill
grestore
gsave
357.1 266.1 57.6 38.02 clipbox
114.755569 38.016 m
125.668327 38.016 l
125.668327 38.016 l
114.755569 38.016 l
cl
0.580 0.404 0.741 setrgbcolor
fill
grestore
gsave
357.1 266.1 57.6 38.02 clipbox
128.396516 38.016 m
139.309274 38.016 l
139.309274 38.016 l
128.396516 38.016 l
cl
0.580 0.404 0.741 setrgbcolor
fill
grestore
gsave
357.1 266.1 57.6 38.02 clipbox
142.037464 63.158857 m
152.950222 63.158857 l
152.950222 63.158857 l
142.037464 63.158857 l
cl
0.580 0.404 0.741 setrgbcolor
fill
grestore
gsave
357.1 266.1 57.6 38.02 clipbox
155.678411 143.616 m
166.591169 143.616 l
166.591169 143.616 l
155.678411 143.616 l
cl
0.580 0.404 0.741 setrgbcolor
fill
grestore
gsave
357.1 266.1 57.6 38.02 clipbox
169.319358 214.016 m
180.232116 214.016 l
180.232116 239.158857 l
169.319358 239.158857 l
cl
0.580 0.404 0.741 setrgbcolor
fill
grestore
gsave
357.1 266.1 57.6 38.02 clipbox
182.960306 83.273143 m
193.873063 83.273143 l
193.873063 108.416 l
182.960306 108.416 l
cl
0.580 0.404 0.741 setrgbcolor
fill
grestore
gsave
357.1 266.1 57.6 38.02 clipbox
196.601253 48.073143 m
207.514011 48.073143 l
207.514011 83.273143 l
196.601253 83.273143 l
cl
0.580 0.404 0.741 setrgbcolor
fill
grestore
gsave
357.1 266.1 57.6 38.02 clipbox
210.2422 48.073143 m
221.154958 48.073143 l
221.154958 48.073143 l
210.2422 48.073143 l
cl
0.580 0.404 0.741 setrgbcolor
fill
grestore
gsave
357.1 266.1 57.6 38.02 clipbox
223.883147 58.130286 m
234.795905 58.130286 l
234.795905 58.130286 l
223.883147 58.130286 l
cl
0.580 0.404 0.741 setrgbcolor
fill
grestore
gsave
357.1 266.1 57.6 38.02 clipbox
237.524095 38.016 m
248.436853 38.016 l
248.436853 38.016 l
237.524095 38.016 l
cl
0.580 0.404 0.741 setrgbcolor
fill
grestore
gsave
357.1 266.1 57.6 38.02 clipbox
251.165042 38.016 m
262.0778 38.016 l
262.0778 38.016 l
251.165042 38.016 l
cl
0.580 0.404 0.741 setrgbcolor
fill
grestore
gsave
357.1 266.1 57.6 38.02 clipbox
264.805989 38.016 m
275.718747 38.016 l
275.718747 38.016 l
264.805989 38.016 l
cl
0.580 0.404 0.741 setrgbcolor
fill
grestore
gsave
357.1 266.1 57.6 38.02 clipbox
278.446937 38.016 m
289.359694 38.016 l
289.359694 38.016 l
278.446937 38.016 l
cl
0.580 0.404 0.741 setrgbcolor
fill
grestore
gsave
357.1 266.1 57.6 38.02 clipbox
292.087884 48.073143 m
303.000642 48.073143 l
303.000642 48.073143 l
292.087884 48.073143 l
cl
0.580 0.404 0.741 setrgbcolor
fill
grestore
gsave
357.1 266.1 57.6 38.02 clipbox
305.728831 53.101714 m
316.641589 53.101714 l
316.641589 53.101714 l
305.728831 53.101714 l
cl
0.580 0.404 0.741 setrgbcolor
fill
grestore
gsave
357.1 266.1 57.6 38.02 clipbox
319.369778 103.387429 m
330.282536 103.387429 l
330.282536 103.387429 l
319.369778 103.387429 l
cl
0.580 0.404 0.741 setrgbcolor
fill
grestore
gsave
357.1 266.1 57.6 38.02 clipbox
333.010726 143.616 m
343.923484 143.616 l
343.923484 143.616 l
333.010726 143.616 l
cl
0.580 0.404 0.741 setrgbcolor
fill
grestore
gsave
357.1 266.1 57.6 38.02 clipbox
346.651673 168.758857 m
357.564431 168.758857 l
357.564431 198.930286 l
346.651673 198.930286 l
cl
0.580 0.404 0.741 setrgbcolor
fill
grestore
gsave
357.1 266.1 57.6 38.02 clipbox
360.29262 89.307429 m
371.205378 89.307429 l
371.205378 119.478857 l
360.29262 119.478857 l
cl
0.580 0.404 0.741 setrgbcolor
fill
grestore
gsave
357.1 266.1 57.6 38.02 clipbox
373.933568 49.078857 m
384.846325 49.078857 l
384.846325 89.307429 l
373.933568 89.307429 l
cl
0.580 0.404 0.741 setrgbcolor
fill
grestore
gsave
357.1 266.1 57.6 38.02 clipbox
387.574515 48.073143 m
398.487273 48.073143 l
398.487273 58.130286 l
387.574515 58.130286 l
cl
0.580 0.404 0.741 setrgbcolor
fill
grestore
gsave
357.1 266.1 57.6 38.02 clipbox
73.832727 38.016 m
84.745485 38.016 l
84.745485 40.027429 l
73.832727 40.027429 l
cl
0.549 0.337 0.294 setrgbcolor
fill
grestore
gsave
357.1 266.1 57.6 38.02 clipbox
87.473675 38.016 m
98.386432 38.016 l
98.386432 40.027429 l
87.473675 40.027429 l
cl
0.549 0.337 0.294 setrgbcolor
fill
grestore
gsave
357.1 266.1 57.6 38.02 clipbox
101.114622 38.016 m
112.02738 38.016 l
112.02738 40.027429 l
101.114622 40.027429 l
cl
0.549 0.337 0.294 setrgbcolor
fill
grestore
gsave
357.1 266.1 57.6 38.02 clipbox
114.755569 38.016 m
125.668327 38.016 l
125.668327 40.027429 l
114.755569 40.027429 l
cl
0.549 0.337 0.294 setrgbcolor
fill
grestore
gsave
357.1 266.1 57.6 38.02 clipbox
128.396516 38.016 m
139.309274 38.016 l
139.309274 63.158857 l
128.396516 63.158857 l
cl
0.549 0.337 0.294 setrgbcolor
fill
grestore
gsave
357.1 266.1 57.6 38.02 clipbox
142.037464 63.158857 m
152.950222 63.158857 l
152.950222 98.358857 l
142.037464 98.358857 l
cl
0.549 0.337 0.294 setrgbcolor
fill
grestore
gsave
357.1 266.1 57.6 38.02 clipbox
155.678411 143.616 m
166.591169 143.616 l
166.591169 145.627429 l
155.678411 145.627429 l
cl
0.549 0.337 0.294 setrgbcolor
fill
grestore
gsave
357.1 266.1 57.6 38.02 clipbox
169.319358 239.158857 m
180.232116 239.158857 l
180.232116 241.170286 l
169.319358 241.170286 l
cl
0.549 0.337 0.294 setrgbcolor
fill
grestore
gsave
357.1 266.1 57.6 38.02 clipbox
182.960306 108.416 m
193.873063 108.416 l
193.873063 110.427429 l
182.960306 110.427429 l
cl
0.549 0.337 0.294 setrgbcolor
fill
grestore
gsave
357.1 266.1 57.6 38.02 clipbox
196.601253 83.273143 m
207.514011 83.273143 l
207.514011 85.284571 l
196.601253 85.284571 l
cl
0.549 0.337 0.294 setrgbcolor
fill
grestore
gsave
357.1 266.1 57.6 38.02 clipbox
210.2422 48.073143 m
221.154958 48.073143 l
221.154958 50.084571 l
210.2422 50.084571 l
cl
0.549 0.337 0.294 setrgbcolor
fill
grestore
gsave
357.1 266.1 57.6 38.02 clipbox
223.883147 58.130286 m
234.795905 58.130286 l
234.795905 60.141714 l
223.883147 60.141714 l
cl
0.549 0.337 0.294 setrgbcolor
fill
grestore
gsave
357.1 266.1 57.6 38.02 clipbox
237.524095 38.016 m
248.436853 38.016 l
248.436853 58.130286 l
237.524095 58.130286 l
cl
0.549 0.337 0.294 setrgbcolor
fill
grestore
gsave
357.1 266.1 57.6 38.02 clipbox
251.165042 38.016 m
262.0778 38.016 l
262.0778 40.027429 l
251.165042 40.027429 l
cl
0.549 0.337 0.294 setrgbcolor
fill
grestore
gsave
357.1 266.1 57.6 38.02 clipbox
264.805989 38.016 m
275.718747 38.016 l
275.718747 40.027429 l
264.805989 40.027429 l
cl
0.549 0.337 0.294 setrgbcolor
fill
grestore
gsave
357.1 266.1 57.6 38.02 clipbox
278.446937 38.016 m
289.359694 38.016 l
289.359694 93.330286 l
278.446937 93.330286 l
cl
0.549 0.337 0.294 setrgbcolor
fill
grestore
gsave
357.1 266.1 57.6 38.02 clipbox
292.087884 48.073143 m
303.000642 48.073143 l
303.000642 78.244571 l
292.087884 78.244571 l
cl
0.549 0.337 0.294 setrgbcolor
fill
grestore
gsave
357.1 266.1 57.6 38.02 clipbox
305.728831 53.101714 m
316.641589 53.101714 l
316.641589 73.216 l
305.728831 73.216 l
cl
0.549 0.337 0.294 setrgbcolor
fill
grestore
gsave
357.1 266.1 57.6 38.02 clipbox
319.369778 103.387429 m
330.282536 103.387429 l
330.282536 105.398857 l
319.369778 105.398857 l
cl
0.549 0.337 0.294 setrgbcolor
fill
grestore
gsave
357.1 266.1 57.6 38.02 clipbox
333.010726 143.616 m
343.923484 143.616 l
343.923484 145.627429 l
333.010726 145.627429 l
cl
0.549 0.337 0.294 setrgbcolor
fill
grestore
gsave
357.1 266.1 57.6 38.02 clipbox
346.651673 198.930286 m
357.564431 198.930286 l
357.564431 200.941714 l
346.651673 200.941714 l
cl
0.549 0.337 0.294 setrgbcolor
fill
grestore
gsave
357.1 266.1 57.6 38.02 clipbox
360.29262 119.478857 m
371.205378 119.478857 l
371.205378 121.490286 l
360.29262 121.490286 l
cl
0.549 0.337 0.294 setrgbcolor
fill
grestore
gsave
357.1 266.1 57.6 38.02 clipbox
373.933568 89.307429 m
384.846325 89.307429 l
384.846325 91.318857 l
373.933568 91.318857 l
cl
0.549 0.337 0.294 setrgbcolor
fill
grestore
gsave
357.1 266.1 57.6 38.02 clipbox
387.574515 58.130286 m
398.487273 58.130286 l
398.487273 60.141714 l
387.574515 60.141714 l
cl
0.549 0.337 0.294 setrgbcolor
fill
grestore
gsave
357.1 266.1 57.6 38.02 clipbox
73.832727 40.027429 m
84.745485 40.027429 l
84.745485 40.027429 l
73.832727 40.027429 l
cl
0.890 0.467 0.761 setrgbcolor
fill
grestore
gsave
357.1 266.1 57.6 38.02 clipbox
87.473675 40.027429 m
98.386432 40.027429 l
98.386432 40.027429 l
87.473675 40.027429 l
cl
0.890 0.467 0.761 setrgbcolor
fill
grestore
gsave
357.1 266.1 57.6 38.02 clipbox
101.114622 40.027429 m
112.02738 40.027429 l
112.02738 40.027429 l
101.114622 40.027429 l
cl
0.890 0.467 0.761 setrgbcolor
fill
grestore
gsave
357.1 266.1 57.6 38.02 clipbox
114.755569 40.027429 m
125.668327 40.027429 l
125.668327 40.027429 l
114.755569 40.027429 l
cl
0.890 0.467 0.761 setrgbcolor
fill
grestore
gsave
357.1 266.1 57.6 38.02 clipbox
128.396516 63.158857 m
139.309274 63.158857 l
139.309274 63.158857 l
128.396516 63.158857 l
cl
0.890 0.467 0.761 setrgbcolor
fill
grestore
gsave
357.1 266.1 57.6 38.02 clipbox
142.037464 98.358857 m
152.950222 98.358857 l
152.950222 98.358857 l
142.037464 98.358857 l
cl
0.890 0.467 0.761 setrgbcolor
fill
grestore
gsave
357.1 266.1 57.6 38.02 clipbox
155.678411 145.627429 m
166.591169 145.627429 l
166.591169 145.627429 l
155.678411 145.627429 l
cl
0.890 0.467 0.761 setrgbcolor
fill
grestore
gsave
357.1 266.1 57.6 38.02 clipbox
169.319358 241.170286 m
180.232116 241.170286 l
180.232116 271.341714 l
169.319358 271.341714 l
cl
0.890 0.467 0.761 setrgbcolor
fill
grestore
gsave
357.1 266.1 57.6 38.02 clipbox
182.960306 110.427429 m
193.873063 110.427429 l
193.873063 110.427429 l
182.960306 110.427429 l
cl
0.890 0.467 0.761 setrgbcolor
fill
grestore
gsave
357.1 266.1 57.6 38.02 clipbox
196.601253 85.284571 m
207.514011 85.284571 l
207.514011 85.284571 l
196.601253 85.284571 l
cl
0.890 0.467 0.761 setrgbcolor
fill
grestore
gsave
357.1 266.1 57.6 38.02 clipbox
210.2422 50.084571 m
221.154958 50.084571 l
221.154958 50.084571 l
210.2422 50.084571 l
cl
0.890 0.467 0.761 setrgbcolor
fill
grestore
gsave
357.1 266.1 57.6 38.02 clipbox
223.883147 60.141714 m
234.795905 60.141714 l
234.795905 60.141714 l
223.883147 60.141714 l
cl
0.890 0.467 0.761 setrgbcolor
fill
grestore
gsave
357.1 266.1 57.6 38.02 clipbox
237.524095 58.130286 m
248.436853 58.130286 l
248.436853 68.187429 l
237.524095 68.187429 l
cl
0.890 0.467 0.761 setrgbcolor
fill
grestore
gsave
357.1 266.1 57.6 38.02 clipbox
251.165042 40.027429 m
262.0778 40.027429 l
262.0778 80.256 l
251.165042 80.256 l
cl
0.890 0.467 0.761 setrgbcolor
fill
grestore
gsave
357.1 266.1 57.6 38.02 clipbox
264.805989 40.027429 m
275.718747 40.027429 l
275.718747 65.170286 l
264.805989 65.170286 l
cl
0.890 0.467 0.761 setrgbcolor
fill
grestore
gsave
357.1 266.1 57.6 38.02 clipbox
278.446937 93.330286 m
289.359694 93.330286 l
289.359694 93.330286 l
278.446937 93.330286 l
cl
0.890 0.467 0.761 setrgbcolor
fill
grestore
gsave
357.1 266.1 57.6 38.02 clipbox
292.087884 78.244571 m
303.000642 78.244571 l
303.000642 78.244571 l
292.087884 78.244571 l
cl
0.890 0.467 0.761 setrgbcolor
fill
grestore
gsave
357.1 266.1 57.6 38.02 clipbox
305.728831 73.216 m
316.641589 73.216 l
316.641589 98.358857 l
305.728831 98.358857 l
cl
0.890 0.467 0.761 setrgbcolor
fill
grestore
gsave
357.1 266.1 57.6 38.02 clipbox
319.369778 105.398857 m
330.282536 105.398857 l
330.282536 135.570286 l
319.369778 135.570286 l
cl
0.890 0.467 0.761 setrgbcolor
fill
grestore
gsave
357.1 266.1 57.6 38.02 clipbox
333.010726 145.627429 m
343.923484 145.627429 l
343.923484 180.827429 l
333.010726 180.827429 l
cl
0.890 0.467 0.761 setrgbcolor
fill
grestore
gsave
357.1 266.1 57.6 38.02 clipbox
346.651673 200.941714 m
357.564431 200.941714 l
357.564431 210.998857 l
346.651673 210.998857 l
cl
0.890 0.467 0.761 setrgbcolor
fill
grestore
gsave
357.1 266.1 57.6 38.02 clipbox
360.29262 121.490286 m
371.205378 121.490286 l
371.205378 121.490286 l
360.29262 121.490286 l
cl
0.890 0.467 0.761 setrgbcolor
fill
grestore
gsave
357.1 266.1 57.6 38.02 clipbox
373.933568 91.318857 m
384.846325 91.318857 l
384.846325 91.318857 l
373.933568 91.318857 l
cl
0.890 0.467 0.761 setrgbcolor
fill
grestore
gsave
357.1 266.1 57.6 38.02 clipbox
387.574515 60.141714 m
398.487273 60.141714 l
398.487273 60.141714 l
387.574515 60.141714 l
cl
0.890 0.467 0.761 setrgbcolor
fill
grestore
gsave
357.1 266.1 57.6 38.02 clipbox
73.832727 40.027429 m
84.745485 40.027429 l
84.745485 45.056 l
73.832727 45.056 l
cl
0.498 setgray
fill
grestore
gsave
357.1 266.1 57.6 38.02 clipbox
87.473675 40.027429 m
98.386432 40.027429 l
98.386432 45.056 l
87.473675 45.056 l
cl
0.498 setgray
fill
grestore
gsave
357.1 266.1 57.6 38.02 clipbox
101.114622 40.027429 m
112.02738 40.027429 l
112.02738 45.056 l
101.114622 45.056 l
cl
0.498 setgray
fill
grestore
gsave
357.1 266.1 57.6 38.02 clipbox
114.755569 40.027429 m
125.668327 40.027429 l
125.668327 45.056 l
114.755569 45.056 l
cl
0.498 setgray
fill
grestore
gsave
357.1 266.1 57.6 38.02 clipbox
128.396516 63.158857 m
139.309274 63.158857 l
139.309274 68.187429 l
128.396516 68.187429 l
cl
0.498 setgray
fill
grestore
gsave
357.1 266.1 57.6 38.02 clipbox
142.037464 98.358857 m
152.950222 98.358857 l
152.950222 118.473143 l
142.037464 118.473143 l
cl
0.498 setgray
fill
grestore
gsave
357.1 266.1 57.6 38.02 clipbox
155.678411 145.627429 m
166.591169 145.627429 l
166.591169 150.656 l
155.678411 150.656 l
cl
0.498 setgray
fill
grestore
gsave
357.1 266.1 57.6 38.02 clipbox
169.319358 271.341714 m
180.232116 271.341714 l
180.232116 291.456 l
169.319358 291.456 l
cl
0.498 setgray
fill
grestore
gsave
357.1 266.1 57.6 38.02 clipbox
182.960306 110.427429 m
193.873063 110.427429 l
193.873063 110.427429 l
182.960306 110.427429 l
cl
0.498 setgray
fill
grestore
gsave
357.1 266.1 57.6 38.02 clipbox
196.601253 85.284571 m
207.514011 85.284571 l
207.514011 85.284571 l
196.601253 85.284571 l
cl
0.498 setgray
fill
grestore
gsave
357.1 266.1 57.6 38.02 clipbox
210.2422 50.084571 m
221.154958 50.084571 l
221.154958 50.084571 l
210.2422 50.084571 l
cl
0.498 setgray
fill
grestore
gsave
357.1 266.1 57.6 38.02 clipbox
223.883147 60.141714 m
234.795905 60.141714 l
234.795905 70.198857 l
223.883147 70.198857 l
cl
0.498 setgray
fill
grestore
gsave
357.1 266.1 57.6 38.02 clipbox
237.524095 68.187429 m
248.436853 68.187429 l
248.436853 78.244571 l
237.524095 78.244571 l
cl
0.498 setgray
fill
grestore
gsave
357.1 266.1 57.6 38.02 clipbox
251.165042 80.256 m
262.0778 80.256 l
262.0778 80.256 l
251.165042 80.256 l
cl
0.498 setgray
fill
grestore
gsave
357.1 266.1 57.6 38.02 clipbox
264.805989 65.170286 m
275.718747 65.170286 l
275.718747 65.170286 l
264.805989 65.170286 l
cl
0.498 setgray
fill
grestore
gsave
357.1 266.1 57.6 38.02 clipbox
278.446937 93.330286 m
289.359694 93.330286 l
289.359694 93.330286 l
278.446937 93.330286 l
cl
0.498 setgray
fill
grestore
gsave
357.1 266.1 57.6 38.02 clipbox
292.087884 78.244571 m
303.000642 78.244571 l
303.000642 88.301714 l
292.087884 88.301714 l
cl
0.498 setgray
fill
grestore
gsave
357.1 266.1 57.6 38.02 clipbox
305.728831 98.358857 m
316.641589 98.358857 l
316.641589 153.673143 l
305.728831 153.673143 l
cl
0.498 setgray
fill
grestore
gsave
357.1 266.1 57.6 38.02 clipbox
319.369778 135.570286 m
330.282536 135.570286 l
330.282536 135.570286 l
319.369778 135.570286 l
cl
0.498 setgray
fill
grestore
gsave
357.1 266.1 57.6 38.02 clipbox
333.010726 180.827429 m
343.923484 180.827429 l
343.923484 190.884571 l
333.010726 190.884571 l
cl
0.498 setgray
fill
grestore
gsave
357.1 266.1 57.6 38.02 clipbox
346.651673 210.998857 m
357.564431 210.998857 l
357.564431 221.056 l
346.651673 221.056 l
cl
0.498 setgray
fill
grestore
gsave
357.1 266.1 57.6 38.02 clipbox
360.29262 121.490286 m
371.205378 121.490286 l
371.205378 136.576 l
360.29262 136.576 l
cl
0.498 setgray
fill
grestore
gsave
357.1 266.1 57.6 38.02 clipbox
373.933568 91.318857 m
384.846325 91.318857 l
384.846325 116.461714 l
373.933568 116.461714 l
cl
0.498 setgray
fill
grestore
gsave
357.1 266.1 57.6 38.02 clipbox
387.574515 60.141714 m
398.487273 60.141714 l
398.487273 60.141714 l
387.574515 60.141714 l
cl
0.498 setgray
fill
grestore
0.800 setlinewidth
1 setlinejoin
0 setlinecap
[] 0 setdash
0.000 setgray
gsave
/o {
gsave
newpath
translate
0.8 setlinewidth
1 setlinejoin
0 setlinecap
0 0 m
0 -3.5 l

gsave
0.000 setgray
fill
grestore
stroke
grestore
} bind def
79.2891 38.016 o
grestore
/DejaVuSans findfont
10.000 scalefont
setfont
gsave
76.109419 23.422250 translate
0.000000 rotate
0.000000 0.000000 m /zero glyphshow
grestore
gsave
/o {
gsave
newpath
translate
0.8 setlinewidth
1 setlinejoin
0 setlinecap
0 0 m
0 -3.5 l

gsave
0.000 setgray
fill
grestore
stroke
grestore
} bind def
147.494 38.016 o
grestore
gsave
144.314155 23.422250 translate
0.000000 rotate
0.000000 0.000000 m /five glyphshow
grestore
gsave
/o {
gsave
newpath
translate
0.8 setlinewidth
1 setlinejoin
0 setlinecap
0 0 m
0 -3.5 l

gsave
0.000 setgray
fill
grestore
stroke
grestore
} bind def
215.699 38.016 o
grestore
gsave
209.339204 23.422250 translate
0.000000 rotate
0.000000 0.000000 m /one glyphshow
6.362305 0.000000 m /zero glyphshow
grestore
gsave
/o {
gsave
newpath
translate
0.8 setlinewidth
1 setlinejoin
0 setlinecap
0 0 m
0 -3.5 l

gsave
0.000 setgray
fill
grestore
stroke
grestore
} bind def
283.903 38.016 o
grestore
gsave
277.543941 23.422250 translate
0.000000 rotate
0.000000 0.000000 m /one glyphshow
6.362305 0.000000 m /five glyphshow
grestore
gsave
/o {
gsave
newpath
translate
0.8 setlinewidth
1 setlinejoin
0 setlinecap
0 0 m
0 -3.5 l

gsave
0.000 setgray
fill
grestore
stroke
grestore
} bind def
352.108 38.016 o
grestore
gsave
345.748677 23.422250 translate
0.000000 rotate
0.000000 0.000000 m /two glyphshow
6.362305 0.000000 m /zero glyphshow
grestore
gsave
214.503750 9.750375 translate
0.000000 rotate
0.000000 0.000000 m /T glyphshow
6.108398 0.000000 m /i glyphshow
8.886719 0.000000 m /m glyphshow
18.627930 0.000000 m /e glyphshow
24.780273 0.000000 m /space glyphshow
27.958984 0.000000 m /parenleft glyphshow
31.860352 0.000000 m /H glyphshow
39.379883 0.000000 m /parenright glyphshow
grestore
gsave
/o {
gsave
newpath
translate
0.8 setlinewidth
1 setlinejoin
0 setlinecap
0 0 m
-3.5 0 l

gsave
0.000 setgray
fill
grestore
stroke
grestore
} bind def
57.6 38.016 o
grestore
gsave
34.693750 34.219125 translate
0.000000 rotate
0.000000 0.000000 m /zero glyphshow
6.362305 0.000000 m /period glyphshow
9.541016 0.000000 m /zero glyphshow
grestore
gsave
/o {
gsave
newpath
translate
0.8 setlinewidth
1 setlinejoin
0 setlinecap
0 0 m
-3.5 0 l

gsave
0.000 setgray
fill
grestore
stroke
grestore
} bind def
57.6 88.3017 o
grestore
gsave
34.693750 84.504839 translate
0.000000 rotate
0.000000 0.000000 m /zero glyphshow
6.362305 0.000000 m /period glyphshow
9.541016 0.000000 m /five glyphshow
grestore
gsave
/o {
gsave
newpath
translate
0.8 setlinewidth
1 setlinejoin
0 setlinecap
0 0 m
-3.5 0 l

gsave
0.000 setgray
fill
grestore
stroke
grestore
} bind def
57.6 138.587 o
grestore
gsave
34.693750 134.790554 translate
0.000000 rotate
0.000000 0.000000 m /one glyphshow
6.362305 0.000000 m /period glyphshow
9.541016 0.000000 m /zero glyphshow
grestore
gsave
/o {
gsave
newpath
translate
0.8 setlinewidth
1 setlinejoin
0 setlinecap
0 0 m
-3.5 0 l

gsave
0.000 setgray
fill
grestore
stroke
grestore
} bind def
57.6 188.873 o
grestore
gsave
34.693750 185.076268 translate
0.000000 rotate
0.000000 0.000000 m /one glyphshow
6.362305 0.000000 m /period glyphshow
9.541016 0.000000 m /five glyphshow
grestore
gsave
/o {
gsave
newpath
translate
0.8 setlinewidth
1 setlinejoin
0 setlinecap
0 0 m
-3.5 0 l

gsave
0.000 setgray
fill
grestore
stroke
grestore
} bind def
57.6 239.159 o
grestore
gsave
34.693750 235.361982 translate
0.000000 rotate
0.000000 0.000000 m /two glyphshow
6.362305 0.000000 m /period glyphshow
9.541016 0.000000 m /zero glyphshow
grestore
gsave
/o {
gsave
newpath
translate
0.8 setlinewidth
1 setlinejoin
0 setlinecap
0 0 m
-3.5 0 l

gsave
0.000 setgray
fill
grestore
stroke
grestore
} bind def
57.6 289.445 o
grestore
gsave
34.693750 285.647696 translate
0.000000 rotate
0.000000 0.000000 m /two glyphshow
6.362305 0.000000 m /period glyphshow
9.541016 0.000000 m /five glyphshow
grestore
gsave
28.615625 142.423562 translate
90.000000 rotate
0.000000 0.000000 m /P glyphshow
6.030273 0.000000 m /o glyphshow
12.148438 0.000000 m /w glyphshow
20.327148 0.000000 m /e glyphshow
26.479492 0.000000 m /r glyphshow
30.590820 0.000000 m /space glyphshow
33.769531 0.000000 m /parenleft glyphshow
37.670898 0.000000 m /k glyphshow
43.461914 0.000000 m /W glyphshow
53.349609 0.000000 m /parenright glyphshow
grestore
0 setlinejoin
2 setlinecap
[] 0 setdash
gsave
57.6 38.016 m
57.6 304.128 l
stroke
grestore
gsave
414.72 38.016 m
414.72 304.128 l
stroke
grestore
gsave
57.6 38.016 m
414.72 38.016 l
stroke
grestore
gsave
57.6 304.128 m
414.72 304.128 l
stroke
grestore
1.000 setlinewidth
0 setlinecap
0.800 setgray
gsave
202.848 171.072 m
325.0605 171.072 l
326.6605 171.072 327.4605 171.872 327.4605 173.472 c
327.4605 313.272 l
327.4605 314.872 326.6605 315.672 325.0605 315.672 c
202.848 315.672 l
201.248 315.672 200.448 314.872 200.448 313.272 c
200.448 173.472 l
200.448 171.872 201.248 171.072 202.848 171.072 c
cl
gsave
1.000 setgray
fill
grestore
stroke
grestore
gsave
205.248 301.747 m
229.248 301.747 l
229.248 310.147 l
205.248 310.147 l
cl
0.122 0.467 0.706 setrgbcolor
fill
grestore
0.000 setgray
/DejaVuSans findfont
12.000 scalefont
setfont
gsave
238.848000 301.747000 translate
0.000000 rotate
0.000000 0.000000 m /s glyphshow
6.251953 0.000000 m /i glyphshow
9.585938 0.000000 m /t glyphshow
14.291016 0.000000 m /e glyphshow
21.673828 0.000000 m /zero glyphshow
29.308594 0.000000 m /period glyphshow
33.123047 0.000000 m /u glyphshow
40.728516 0.000000 m /n glyphshow
48.333984 0.000000 m /s glyphshow
54.585938 0.000000 m /c glyphshow
61.183594 0.000000 m /h glyphshow
68.789062 0.000000 m /e glyphshow
76.171875 0.000000 m /d glyphshow
grestore
gsave
205.248 284.122 m
229.248 284.122 l
229.248 292.522 l
205.248 292.522 l
cl
1.000 0.498 0.055 setrgbcolor
fill
grestore
gsave
238.848000 284.122000 translate
0.000000 rotate
0.000000 0.000000 m /s glyphshow
6.251953 0.000000 m /i glyphshow
9.585938 0.000000 m /t glyphshow
14.291016 0.000000 m /e glyphshow
21.673828 0.000000 m /one glyphshow
29.308594 0.000000 m /period glyphshow
33.123047 0.000000 m /u glyphshow
40.728516 0.000000 m /n glyphshow
48.333984 0.000000 m /s glyphshow
54.585938 0.000000 m /c glyphshow
61.183594 0.000000 m /h glyphshow
68.789062 0.000000 m /e glyphshow
76.171875 0.000000 m /d glyphshow
grestore
gsave
205.248 266.497 m
229.248 266.497 l
229.248 274.897 l
205.248 274.897 l
cl
0.173 0.627 0.173 setrgbcolor
fill
grestore
gsave
238.848000 266.497000 translate
0.000000 rotate
0.000000 0.000000 m /s glyphshow
6.251953 0.000000 m /i glyphshow
9.585938 0.000000 m /t glyphshow
14.291016 0.000000 m /e glyphshow
21.673828 0.000000 m /two glyphshow
29.308594 0.000000 m /period glyphshow
33.123047 0.000000 m /u glyphshow
40.728516 0.000000 m /n glyphshow
48.333984 0.000000 m /s glyphshow
54.585938 0.000000 m /c glyphshow
61.183594 0.000000 m /h glyphshow
68.789062 0.000000 m /e glyphshow
76.171875 0.000000 m /d glyphshow
grestore
gsave
205.248 248.872 m
229.248 248.872 l
229.248 257.272 l
205.248 257.272 l
cl
0.839 0.153 0.157 setrgbcolor
fill
grestore
gsave
238.848000 248.872000 translate
0.000000 rotate
0.000000 0.000000 m /s glyphshow
6.251953 0.000000 m /i glyphshow
9.585938 0.000000 m /t glyphshow
14.291016 0.000000 m /e glyphshow
21.673828 0.000000 m /three glyphshow
29.308594 0.000000 m /period glyphshow
33.123047 0.000000 m /u glyphshow
40.728516 0.000000 m /n glyphshow
48.333984 0.000000 m /s glyphshow
54.585938 0.000000 m /c glyphshow
61.183594 0.000000 m /h glyphshow
68.789062 0.000000 m /e glyphshow
76.171875 0.000000 m /d glyphshow
grestore
gsave
205.248 231.247 m
229.248 231.247 l
229.248 239.647 l
205.248 239.647 l
cl
0.580 0.404 0.741 setrgbcolor
fill
grestore
gsave
238.848000 231.247000 translate
0.000000 rotate
0.000000 0.000000 m /s glyphshow
6.251953 0.000000 m /i glyphshow
9.585938 0.000000 m /t glyphshow
14.291016 0.000000 m /e glyphshow
21.673828 0.000000 m /four glyphshow
29.308594 0.000000 m /period glyphshow
33.123047 0.000000 m /u glyphshow
40.728516 0.000000 m /n glyphshow
48.333984 0.000000 m /s glyphshow
54.585938 0.000000 m /c glyphshow
61.183594 0.000000 m /h glyphshow
68.789062 0.000000 m /e glyphshow
76.171875 0.000000 m /d glyphshow
grestore
gsave
205.248 213.622 m
229.248 213.622 l
229.248 222.022 l
205.248 222.022 l
cl
0.549 0.337 0.294 setrgbcolor
fill
grestore
gsave
238.848000 213.622000 translate
0.000000 rotate
0.000000 0.000000 m /s glyphshow
6.251953 0.000000 m /i glyphshow
9.585938 0.000000 m /t glyphshow
14.291016 0.000000 m /e glyphshow
21.673828 0.000000 m /five glyphshow
29.308594 0.000000 m /period glyphshow
33.123047 0.000000 m /u glyphshow
40.728516 0.000000 m /n glyphshow
48.333984 0.000000 m /s glyphshow
54.585938 0.000000 m /c glyphshow
61.183594 0.000000 m /h glyphshow
68.789062 0.000000 m /e glyphshow
76.171875 0.000000 m /d glyphshow
grestore
gsave
205.248 195.997 m
229.248 195.997 l
229.248 204.397 l
205.248 204.397 l
cl
0.890 0.467 0.761 setrgbcolor
fill
grestore
gsave
238.848000 195.997000 translate
0.000000 rotate
0.000000 0.000000 m /s glyphshow
6.251953 0.000000 m /i glyphshow
9.585938 0.000000 m /t glyphshow
14.291016 0.000000 m /e glyphshow
21.673828 0.000000 m /six glyphshow
29.308594 0.000000 m /period glyphshow
33.123047 0.000000 m /u glyphshow
40.728516 0.000000 m /n glyphshow
48.333984 0.000000 m /s glyphshow
54.585938 0.000000 m /c glyphshow
61.183594 0.000000 m /h glyphshow
68.789062 0.000000 m /e glyphshow
76.171875 0.000000 m /d glyphshow
grestore
gsave
205.248 178.372 m
229.248 178.372 l
229.248 186.772 l
205.248 186.772 l
cl
0.498 setgray
fill
grestore
gsave
238.848000 178.372000 translate
0.000000 rotate
0.000000 0.000000 m /s glyphshow
6.251953 0.000000 m /i glyphshow
9.585938 0.000000 m /t glyphshow
14.291016 0.000000 m /e glyphshow
21.673828 0.000000 m /seven glyphshow
29.308594 0.000000 m /period glyphshow
33.123047 0.000000 m /u glyphshow
40.728516 0.000000 m /n glyphshow
48.333984 0.000000 m /s glyphshow
54.585938 0.000000 m /c glyphshow
61.183594 0.000000 m /h glyphshow
68.789062 0.000000 m /e glyphshow
76.171875 0.000000 m /d glyphshow
grestore

end
showpage
