%!PS-Adobe-3.0 EPSF-3.0
%%Title: scenario2.py-network-latest-report/animation-site7-0000.eps
%%Creator: matplotlib version 2.0.0, http://matplotlib.org/
%%CreationDate: Sun Jun  2 09:13:38 2019
%%Orientation: portrait
%%BoundingBox: 75 223 536 568
%%EndComments
%%BeginProlog
/mpldict 8 dict def
mpldict begin
/m { moveto } bind def
/l { lineto } bind def
/r { rlineto } bind def
/c { curveto } bind def
/cl { closepath } bind def
/box {
m
1 index 0 r
0 exch r
neg 0 r
cl
} bind def
/clipbox {
box
clip
newpath
} bind def
%!PS-Adobe-3.0 Resource-Font
%%Title: DejaVu Sans
%%Copyright: Copyright (c) 2003 by Bitstream, Inc. All Rights Reserved. Copyright (c) 2006 by Tavmjong Bah. All Rights Reserved. DejaVu changes are in public domain 
%%Creator: Converted from TrueType to type 3 by PPR
25 dict begin
/_d{bind def}bind def
/_m{moveto}_d
/_l{lineto}_d
/_cl{closepath eofill}_d
/_c{curveto}_d
/_sc{7 -1 roll{setcachedevice}{pop pop pop pop pop pop}ifelse}_d
/_e{exec}_d
/FontName /DejaVuSans def
/PaintType 0 def
/FontMatrix[.001 0 0 .001 0 0]def
/FontBBox[-1021 -463 1793 1232]def
/FontType 3 def
/Encoding [ /period /zero /one /two /five /seven /c /d /e /f /g /h /i /l /m /n /p /r /s /t /u /v /w /z ] def
/FontInfo 10 dict dup begin
/FamilyName (DejaVu Sans) def
/FullName (DejaVu Sans) def
/Notice (Copyright (c) 2003 by Bitstream, Inc. All Rights Reserved. Copyright (c) 2006 by Tavmjong Bah. All Rights Reserved. DejaVu changes are in public domain ) def
/Weight (Book) def
/Version (Version 2.35) def
/ItalicAngle 0.0 def
/isFixedPitch false def
/UnderlinePosition -130 def
/UnderlineThickness 90 def
end readonly def
/CharStrings 24 dict dup begin
/period{318 0 107 0 210 124 _sc
107 124 _m
210 124 _l
210 0 _l
107 0 _l
107 124 _l
_cl}_d
/zero{636 0 66 -13 570 742 _sc
318 664 _m
267 664 229 639 203 589 _c
177 539 165 464 165 364 _c
165 264 177 189 203 139 _c
229 89 267 64 318 64 _c
369 64 407 89 433 139 _c
458 189 471 264 471 364 _c
471 464 458 539 433 589 _c
407 639 369 664 318 664 _c
318 742 _m
399 742 461 709 505 645 _c
548 580 570 486 570 364 _c
570 241 548 147 505 83 _c
461 19 399 -13 318 -13 _c
236 -13 173 19 130 83 _c
87 147 66 241 66 364 _c
66 486 87 580 130 645 _c
173 709 236 742 318 742 _c
_cl}_d
/one{636 0 110 0 544 729 _sc
124 83 _m
285 83 _l
285 639 _l
110 604 _l
110 694 _l
284 729 _l
383 729 _l
383 83 _l
544 83 _l
544 0 _l
124 0 _l
124 83 _l
_cl}_d
/two{{636 0 73 0 536 742 _sc
192 83 _m
536 83 _l
536 0 _l
73 0 _l
73 83 _l
110 121 161 173 226 239 _c
290 304 331 346 348 365 _c
380 400 402 430 414 455 _c
426 479 433 504 433 528 _c
433 566 419 598 392 622 _c
365 646 330 659 286 659 _c
255 659 222 653 188 643 _c
154 632 117 616 78 594 _c
78 694 _l
118 710 155 722 189 730 _c
223 738 255 742 284 742 _c
}_e{359 742 419 723 464 685 _c
509 647 532 597 532 534 _c
532 504 526 475 515 449 _c
504 422 484 390 454 354 _c
446 344 420 317 376 272 _c
332 227 271 164 192 83 _c
_cl}_e}_d
/five{{636 0 77 -13 549 729 _sc
108 729 _m
495 729 _l
495 646 _l
198 646 _l
198 467 _l
212 472 227 476 241 478 _c
255 480 270 482 284 482 _c
365 482 429 459 477 415 _c
525 370 549 310 549 234 _c
549 155 524 94 475 51 _c
426 8 357 -13 269 -13 _c
238 -13 207 -10 175 -6 _c
143 -1 111 6 77 17 _c
77 116 _l
106 100 136 88 168 80 _c
199 72 232 69 267 69 _c
}_e{323 69 368 83 401 113 _c
433 143 450 183 450 234 _c
450 284 433 324 401 354 _c
368 384 323 399 267 399 _c
241 399 214 396 188 390 _c
162 384 135 375 108 363 _c
108 729 _l
_cl}_e}_d
/seven{636 0 82 0 551 729 _sc
82 729 _m
551 729 _l
551 687 _l
286 0 _l
183 0 _l
432 646 _l
82 646 _l
82 729 _l
_cl}_d
/c{{550 0 55 -13 488 560 _sc
488 526 _m
488 442 _l
462 456 437 466 411 473 _c
385 480 360 484 334 484 _c
276 484 230 465 198 428 _c
166 391 150 339 150 273 _c
150 206 166 154 198 117 _c
230 80 276 62 334 62 _c
360 62 385 65 411 72 _c
437 79 462 90 488 104 _c
488 21 _l
462 9 436 0 410 -5 _c
383 -10 354 -13 324 -13 _c
242 -13 176 12 128 64 _c
}_e{79 115 55 185 55 273 _c
55 362 79 432 128 483 _c
177 534 244 560 330 560 _c
358 560 385 557 411 551 _c
437 545 463 537 488 526 _c
_cl}_e}_d
/d{{635 0 55 -13 544 760 _sc
454 464 _m
454 760 _l
544 760 _l
544 0 _l
454 0 _l
454 82 _l
435 49 411 25 382 10 _c
353 -5 319 -13 279 -13 _c
213 -13 159 13 117 65 _c
75 117 55 187 55 273 _c
55 359 75 428 117 481 _c
159 533 213 560 279 560 _c
319 560 353 552 382 536 _c
411 520 435 496 454 464 _c
148 273 _m
148 207 161 155 188 117 _c
215 79 253 61 301 61 _c
}_e{348 61 385 79 413 117 _c
440 155 454 207 454 273 _c
454 339 440 390 413 428 _c
385 466 348 485 301 485 _c
253 485 215 466 188 428 _c
161 390 148 339 148 273 _c
_cl}_e}_d
/e{{615 0 55 -13 562 560 _sc
562 296 _m
562 252 _l
149 252 _l
153 190 171 142 205 110 _c
238 78 284 62 344 62 _c
378 62 412 66 444 74 _c
476 82 509 95 541 113 _c
541 28 _l
509 14 476 3 442 -3 _c
408 -9 373 -13 339 -13 _c
251 -13 182 12 131 62 _c
80 112 55 181 55 268 _c
55 357 79 428 127 481 _c
175 533 241 560 323 560 _c
397 560 455 536 498 489 _c
}_e{540 441 562 377 562 296 _c
472 322 _m
471 371 457 410 431 440 _c
404 469 368 484 324 484 _c
274 484 234 469 204 441 _c
174 413 156 373 152 322 _c
472 322 _l
_cl}_e}_d
/f{352 0 23 0 371 760 _sc
371 760 _m
371 685 _l
285 685 _l
253 685 230 678 218 665 _c
205 652 199 629 199 595 _c
199 547 _l
347 547 _l
347 477 _l
199 477 _l
199 0 _l
109 0 _l
109 477 _l
23 477 _l
23 547 _l
109 547 _l
109 585 _l
109 645 123 690 151 718 _c
179 746 224 760 286 760 _c
371 760 _l
_cl}_d
/g{{635 0 55 -207 544 560 _sc
454 280 _m
454 344 440 395 414 431 _c
387 467 349 485 301 485 _c
253 485 215 467 188 431 _c
161 395 148 344 148 280 _c
148 215 161 165 188 129 _c
215 93 253 75 301 75 _c
349 75 387 93 414 129 _c
440 165 454 215 454 280 _c
544 68 _m
544 -24 523 -93 482 -139 _c
440 -184 377 -207 292 -207 _c
260 -207 231 -204 203 -200 _c
175 -195 147 -188 121 -178 _c
}_e{121 -91 _l
147 -105 173 -115 199 -122 _c
225 -129 251 -133 278 -133 _c
336 -133 380 -117 410 -87 _c
439 -56 454 -10 454 52 _c
454 96 _l
435 64 411 40 382 24 _c
353 8 319 0 279 0 _c
211 0 157 25 116 76 _c
75 127 55 195 55 280 _c
55 364 75 432 116 483 _c
157 534 211 560 279 560 _c
319 560 353 552 382 536 _c
411 520 435 496 454 464 _c
454 547 _l
544 547 _l
}_e{544 68 _l
_cl}_e}_d
/h{634 0 91 0 549 760 _sc
549 330 _m
549 0 _l
459 0 _l
459 327 _l
459 379 448 417 428 443 _c
408 469 378 482 338 482 _c
289 482 251 466 223 435 _c
195 404 181 362 181 309 _c
181 0 _l
91 0 _l
91 760 _l
181 760 _l
181 462 _l
202 494 227 519 257 535 _c
286 551 320 560 358 560 _c
420 560 468 540 500 501 _c
532 462 549 405 549 330 _c
_cl}_d
/i{278 0 94 0 184 760 _sc
94 547 _m
184 547 _l
184 0 _l
94 0 _l
94 547 _l
94 760 _m
184 760 _l
184 646 _l
94 646 _l
94 760 _l
_cl}_d
/l{278 0 94 0 184 760 _sc
94 760 _m
184 760 _l
184 0 _l
94 0 _l
94 760 _l
_cl}_d
/m{{974 0 91 0 889 560 _sc
520 442 _m
542 482 569 511 600 531 _c
631 550 668 560 711 560 _c
767 560 811 540 842 500 _c
873 460 889 403 889 330 _c
889 0 _l
799 0 _l
799 327 _l
799 379 789 418 771 444 _c
752 469 724 482 686 482 _c
639 482 602 466 575 435 _c
548 404 535 362 535 309 _c
535 0 _l
445 0 _l
445 327 _l
445 379 435 418 417 444 _c
398 469 369 482 331 482 _c
}_e{285 482 248 466 221 435 _c
194 404 181 362 181 309 _c
181 0 _l
91 0 _l
91 547 _l
181 547 _l
181 462 _l
201 495 226 520 255 536 _c
283 552 317 560 357 560 _c
397 560 430 550 458 530 _c
486 510 506 480 520 442 _c
_cl}_e}_d
/n{634 0 91 0 549 560 _sc
549 330 _m
549 0 _l
459 0 _l
459 327 _l
459 379 448 417 428 443 _c
408 469 378 482 338 482 _c
289 482 251 466 223 435 _c
195 404 181 362 181 309 _c
181 0 _l
91 0 _l
91 547 _l
181 547 _l
181 462 _l
202 494 227 519 257 535 _c
286 551 320 560 358 560 _c
420 560 468 540 500 501 _c
532 462 549 405 549 330 _c
_cl}_d
/p{{635 0 91 -207 580 560 _sc
181 82 _m
181 -207 _l
91 -207 _l
91 547 _l
181 547 _l
181 464 _l
199 496 223 520 252 536 _c
281 552 316 560 356 560 _c
422 560 476 533 518 481 _c
559 428 580 359 580 273 _c
580 187 559 117 518 65 _c
476 13 422 -13 356 -13 _c
316 -13 281 -5 252 10 _c
223 25 199 49 181 82 _c
487 273 _m
487 339 473 390 446 428 _c
418 466 381 485 334 485 _c
}_e{286 485 249 466 222 428 _c
194 390 181 339 181 273 _c
181 207 194 155 222 117 _c
249 79 286 61 334 61 _c
381 61 418 79 446 117 _c
473 155 487 207 487 273 _c
_cl}_e}_d
/r{411 0 91 0 411 560 _sc
411 463 _m
401 469 390 473 378 476 _c
366 478 353 480 339 480 _c
288 480 249 463 222 430 _c
194 397 181 350 181 288 _c
181 0 _l
91 0 _l
91 547 _l
181 547 _l
181 462 _l
199 495 224 520 254 536 _c
284 552 321 560 365 560 _c
371 560 378 559 386 559 _c
393 558 401 557 411 555 _c
411 463 _l
_cl}_d
/s{{521 0 54 -13 472 560 _sc
443 531 _m
443 446 _l
417 458 391 468 364 475 _c
336 481 308 485 279 485 _c
234 485 200 478 178 464 _c
156 450 145 430 145 403 _c
145 382 153 366 169 354 _c
185 342 217 330 265 320 _c
296 313 _l
360 299 405 279 432 255 _c
458 230 472 195 472 151 _c
472 100 452 60 412 31 _c
372 1 316 -13 246 -13 _c
216 -13 186 -10 154 -5 _c
}_e{122 0 89 8 54 20 _c
54 113 _l
87 95 120 82 152 74 _c
184 65 216 61 248 61 _c
290 61 323 68 346 82 _c
368 96 380 117 380 144 _c
380 168 371 187 355 200 _c
339 213 303 226 247 238 _c
216 245 _l
160 257 119 275 95 299 _c
70 323 58 356 58 399 _c
58 450 76 490 112 518 _c
148 546 200 560 268 560 _c
301 560 332 557 362 552 _c
391 547 418 540 443 531 _c
}_e{_cl}_e}_d
/t{392 0 27 0 368 702 _sc
183 702 _m
183 547 _l
368 547 _l
368 477 _l
183 477 _l
183 180 _l
183 135 189 106 201 94 _c
213 81 238 75 276 75 _c
368 75 _l
368 0 _l
276 0 _l
206 0 158 13 132 39 _c
106 65 93 112 93 180 _c
93 477 _l
27 477 _l
27 547 _l
93 547 _l
93 702 _l
183 702 _l
_cl}_d
/u{634 0 85 -13 543 560 _sc
85 216 _m
85 547 _l
175 547 _l
175 219 _l
175 167 185 129 205 103 _c
225 77 255 64 296 64 _c
344 64 383 79 411 110 _c
439 141 453 183 453 237 _c
453 547 _l
543 547 _l
543 0 _l
453 0 _l
453 84 _l
431 50 405 26 377 10 _c
348 -5 315 -13 277 -13 _c
214 -13 166 6 134 45 _c
101 83 85 140 85 216 _c
311 560 _m
311 560 _l
_cl}_d
/v{592 0 30 0 562 547 _sc
30 547 _m
125 547 _l
296 88 _l
467 547 _l
562 547 _l
357 0 _l
235 0 _l
30 547 _l
_cl}_d
/w{818 0 42 0 776 547 _sc
42 547 _m
132 547 _l
244 120 _l
356 547 _l
462 547 _l
574 120 _l
686 547 _l
776 547 _l
633 0 _l
527 0 _l
409 448 _l
291 0 _l
185 0 _l
42 547 _l
_cl}_d
/z{525 0 43 0 482 547 _sc
55 547 _m
482 547 _l
482 465 _l
144 72 _l
482 72 _l
482 0 _l
43 0 _l
43 82 _l
381 475 _l
55 475 _l
55 547 _l
_cl}_d
end readonly def

/BuildGlyph
 {exch begin
 CharStrings exch
 2 copy known not{pop /.notdef}if
 true 3 1 roll get exec
 end}_d

/BuildChar {
 1 index /Encoding get exch get
 1 index /BuildGlyph get exec
}_d

FontName currentdict end definefont pop
end
%%EndProlog
mpldict begin
75.6 223.2 translate
460.8 345.6 0 0 clipbox
gsave
0 0 m
460.8 0 l
460.8 345.6 l
0 345.6 l
cl
1.000 setgray
fill
grestore
gsave
57.6 38.016 m
414.72 38.016 l
414.72 304.128 l
57.6 304.128 l
cl
1.000 setgray
fill
grestore
gsave
357.1 266.1 57.6 38.02 clipbox
78.006857 38.016 m
88.210286 38.016 l
88.210286 44.226811 l
78.006857 44.226811 l
cl
1.000 0.000 0.000 setrgbcolor
fill
grestore
gsave
357.1 266.1 57.6 38.02 clipbox
90.761143 38.016 m
100.964571 38.016 l
100.964571 44.226811 l
90.761143 44.226811 l
cl
1.000 0.000 0.000 setrgbcolor
fill
grestore
gsave
357.1 266.1 57.6 38.02 clipbox
103.515429 38.016 m
113.718857 38.016 l
113.718857 44.226811 l
103.515429 44.226811 l
cl
1.000 0.000 0.000 setrgbcolor
fill
grestore
gsave
357.1 266.1 57.6 38.02 clipbox
116.269714 38.016 m
126.473143 38.016 l
126.473143 44.226811 l
116.269714 44.226811 l
cl
1.000 0.000 0.000 setrgbcolor
fill
grestore
gsave
357.1 266.1 57.6 38.02 clipbox
129.024 38.016 m
139.227429 38.016 l
139.227429 44.226811 l
129.024 44.226811 l
cl
1.000 0.000 0.000 setrgbcolor
fill
grestore
gsave
357.1 266.1 57.6 38.02 clipbox
141.778286 38.016 m
151.981714 38.016 l
151.981714 62.859246 l
141.778286 62.859246 l
cl
1.000 0.000 0.000 setrgbcolor
fill
grestore
gsave
357.1 266.1 57.6 38.02 clipbox
154.532571 38.016 m
164.736 38.016 l
164.736 44.226811 l
154.532571 44.226811 l
cl
1.000 0.000 0.000 setrgbcolor
fill
grestore
gsave
357.1 266.1 57.6 38.02 clipbox
167.286857 38.016 m
177.490286 38.016 l
177.490286 62.859246 l
167.286857 62.859246 l
cl
1.000 0.000 0.000 setrgbcolor
fill
grestore
gsave
357.1 266.1 57.6 38.02 clipbox
180.041143 38.016 m
190.244571 38.016 l
190.244571 38.016 l
180.041143 38.016 l
cl
1.000 0.000 0.000 setrgbcolor
fill
grestore
gsave
357.1 266.1 57.6 38.02 clipbox
192.795429 38.016 m
202.998857 38.016 l
202.998857 38.016 l
192.795429 38.016 l
cl
1.000 0.000 0.000 setrgbcolor
fill
grestore
gsave
357.1 266.1 57.6 38.02 clipbox
205.549714 38.016 m
215.753143 38.016 l
215.753143 38.016 l
205.549714 38.016 l
cl
1.000 0.000 0.000 setrgbcolor
fill
grestore
gsave
357.1 266.1 57.6 38.02 clipbox
218.304 38.016 m
228.507429 38.016 l
228.507429 50.437623 l
218.304 50.437623 l
cl
1.000 0.000 0.000 setrgbcolor
fill
grestore
gsave
357.1 266.1 57.6 38.02 clipbox
231.058286 38.016 m
241.261714 38.016 l
241.261714 50.437623 l
231.058286 50.437623 l
cl
1.000 0.000 0.000 setrgbcolor
fill
grestore
gsave
357.1 266.1 57.6 38.02 clipbox
243.812571 38.016 m
254.016 38.016 l
254.016 38.016 l
243.812571 38.016 l
cl
1.000 0.000 0.000 setrgbcolor
fill
grestore
gsave
357.1 266.1 57.6 38.02 clipbox
256.566857 38.016 m
266.770286 38.016 l
266.770286 38.016 l
256.566857 38.016 l
cl
1.000 0.000 0.000 setrgbcolor
fill
grestore
gsave
357.1 266.1 57.6 38.02 clipbox
269.321143 38.016 m
279.524571 38.016 l
279.524571 38.016 l
269.321143 38.016 l
cl
1.000 0.000 0.000 setrgbcolor
fill
grestore
gsave
357.1 266.1 57.6 38.02 clipbox
282.075429 38.016 m
292.278857 38.016 l
292.278857 50.437623 l
282.075429 50.437623 l
cl
1.000 0.000 0.000 setrgbcolor
fill
grestore
gsave
357.1 266.1 57.6 38.02 clipbox
294.829714 38.016 m
305.033143 38.016 l
305.033143 106.334926 l
294.829714 106.334926 l
cl
1.000 0.000 0.000 setrgbcolor
fill
grestore
gsave
357.1 266.1 57.6 38.02 clipbox
307.584 38.016 m
317.787429 38.016 l
317.787429 38.016 l
307.584 38.016 l
cl
1.000 0.000 0.000 setrgbcolor
fill
grestore
gsave
357.1 266.1 57.6 38.02 clipbox
320.338286 38.016 m
330.541714 38.016 l
330.541714 50.437623 l
320.338286 50.437623 l
cl
1.000 0.000 0.000 setrgbcolor
fill
grestore
gsave
357.1 266.1 57.6 38.02 clipbox
333.092571 38.016 m
343.296 38.016 l
343.296 50.437623 l
333.092571 50.437623 l
cl
1.000 0.000 0.000 setrgbcolor
fill
grestore
gsave
357.1 266.1 57.6 38.02 clipbox
345.846857 38.016 m
356.050286 38.016 l
356.050286 56.648434 l
345.846857 56.648434 l
cl
1.000 0.000 0.000 setrgbcolor
fill
grestore
gsave
357.1 266.1 57.6 38.02 clipbox
358.601143 38.016 m
368.804571 38.016 l
368.804571 69.070057 l
358.601143 69.070057 l
cl
1.000 0.000 0.000 setrgbcolor
fill
grestore
gsave
357.1 266.1 57.6 38.02 clipbox
371.355429 38.016 m
381.558857 38.016 l
381.558857 38.016 l
371.355429 38.016 l
cl
1.000 0.000 0.000 setrgbcolor
fill
grestore
gsave
357.1 266.1 57.6 38.02 clipbox
78.006857 44.226811 m
88.210286 44.226811 l
88.210286 59.133754 l
78.006857 59.133754 l
cl
1.000 0.647 0.000 setrgbcolor
fill
grestore
gsave
357.1 266.1 57.6 38.02 clipbox
90.761143 44.226811 m
100.964571 44.226811 l
100.964571 59.134162 l
90.761143 59.134162 l
cl
1.000 0.647 0.000 setrgbcolor
fill
grestore
gsave
357.1 266.1 57.6 38.02 clipbox
103.515429 44.226811 m
113.718857 44.226811 l
113.718857 59.132777 l
103.515429 59.132777 l
cl
1.000 0.647 0.000 setrgbcolor
fill
grestore
gsave
357.1 266.1 57.6 38.02 clipbox
116.269714 44.226811 m
126.473143 44.226811 l
126.473143 59.13221 l
116.269714 59.13221 l
cl
1.000 0.647 0.000 setrgbcolor
fill
grestore
gsave
357.1 266.1 57.6 38.02 clipbox
129.024 44.226811 m
139.227429 44.226811 l
139.227429 59.135201 l
129.024 59.135201 l
cl
1.000 0.647 0.000 setrgbcolor
fill
grestore
gsave
357.1 266.1 57.6 38.02 clipbox
141.778286 62.859246 m
151.981714 62.859246 l
151.981714 77.765721 l
141.778286 77.765721 l
cl
1.000 0.647 0.000 setrgbcolor
fill
grestore
gsave
357.1 266.1 57.6 38.02 clipbox
154.532571 44.226811 m
164.736 44.226811 l
164.736 59.135558 l
154.532571 59.135558 l
cl
1.000 0.647 0.000 setrgbcolor
fill
grestore
gsave
357.1 266.1 57.6 38.02 clipbox
167.286857 62.859246 m
177.490286 62.859246 l
177.490286 77.775031 l
167.286857 77.775031 l
cl
1.000 0.647 0.000 setrgbcolor
fill
grestore
gsave
357.1 266.1 57.6 38.02 clipbox
180.041143 38.016 m
190.244571 38.016 l
190.244571 52.928673 l
180.041143 52.928673 l
cl
1.000 0.647 0.000 setrgbcolor
fill
grestore
gsave
357.1 266.1 57.6 38.02 clipbox
192.795429 38.016 m
202.998857 38.016 l
202.998857 52.910777 l
192.795429 52.910777 l
cl
1.000 0.647 0.000 setrgbcolor
fill
grestore
gsave
357.1 266.1 57.6 38.02 clipbox
205.549714 38.016 m
215.753143 38.016 l
215.753143 52.911019 l
205.549714 52.911019 l
cl
1.000 0.647 0.000 setrgbcolor
fill
grestore
gsave
357.1 266.1 57.6 38.02 clipbox
218.304 50.437623 m
228.507429 50.437623 l
228.507429 65.34991 l
218.304 65.34991 l
cl
1.000 0.647 0.000 setrgbcolor
fill
grestore
gsave
357.1 266.1 57.6 38.02 clipbox
231.058286 50.437623 m
241.261714 50.437623 l
241.261714 65.349401 l
231.058286 65.349401 l
cl
1.000 0.647 0.000 setrgbcolor
fill
grestore
gsave
357.1 266.1 57.6 38.02 clipbox
243.812571 38.016 m
254.016 38.016 l
254.016 52.924375 l
243.812571 52.924375 l
cl
1.000 0.647 0.000 setrgbcolor
fill
grestore
gsave
357.1 266.1 57.6 38.02 clipbox
256.566857 38.016 m
266.770286 38.016 l
266.770286 52.925491 l
256.566857 52.925491 l
cl
1.000 0.647 0.000 setrgbcolor
fill
grestore
gsave
357.1 266.1 57.6 38.02 clipbox
269.321143 38.016 m
279.524571 38.016 l
279.524571 52.92917 l
269.321143 52.92917 l
cl
1.000 0.647 0.000 setrgbcolor
fill
grestore
gsave
357.1 266.1 57.6 38.02 clipbox
282.075429 50.437623 m
292.278857 50.437623 l
292.278857 65.356351 l
282.075429 65.356351 l
cl
1.000 0.647 0.000 setrgbcolor
fill
grestore
gsave
357.1 266.1 57.6 38.02 clipbox
294.829714 106.334926 m
305.033143 106.334926 l
305.033143 121.25061 l
294.829714 121.25061 l
cl
1.000 0.647 0.000 setrgbcolor
fill
grestore
gsave
357.1 266.1 57.6 38.02 clipbox
307.584 38.016 m
317.787429 38.016 l
317.787429 52.902183 l
307.584 52.902183 l
cl
1.000 0.647 0.000 setrgbcolor
fill
grestore
gsave
357.1 266.1 57.6 38.02 clipbox
320.338286 50.437623 m
330.541714 50.437623 l
330.541714 65.326982 l
320.338286 65.326982 l
cl
1.000 0.647 0.000 setrgbcolor
fill
grestore
gsave
357.1 266.1 57.6 38.02 clipbox
333.092571 50.437623 m
343.296 50.437623 l
343.296 65.362578 l
333.092571 65.362578 l
cl
1.000 0.647 0.000 setrgbcolor
fill
grestore
gsave
357.1 266.1 57.6 38.02 clipbox
345.846857 56.648434 m
356.050286 56.648434 l
356.050286 71.554797 l
345.846857 71.554797 l
cl
1.000 0.647 0.000 setrgbcolor
fill
grestore
gsave
357.1 266.1 57.6 38.02 clipbox
358.601143 69.070057 m
368.804571 69.070057 l
368.804571 83.961651 l
358.601143 83.961651 l
cl
1.000 0.647 0.000 setrgbcolor
fill
grestore
gsave
357.1 266.1 57.6 38.02 clipbox
371.355429 38.016 m
381.558857 38.016 l
381.558857 52.925075 l
371.355429 52.925075 l
cl
1.000 0.647 0.000 setrgbcolor
fill
grestore
gsave
357.1 266.1 57.6 38.02 clipbox
78.006857 59.133754 m
88.210286 59.133754 l
88.210286 83.974606 l
78.006857 83.974606 l
cl
1.000 1.000 0.000 setrgbcolor
fill
grestore
gsave
357.1 266.1 57.6 38.02 clipbox
90.761143 59.134162 m
100.964571 59.134162 l
100.964571 59.134162 l
90.761143 59.134162 l
cl
1.000 1.000 0.000 setrgbcolor
fill
grestore
gsave
357.1 266.1 57.6 38.02 clipbox
103.515429 59.132777 m
113.718857 59.132777 l
113.718857 59.132777 l
103.515429 59.132777 l
cl
1.000 1.000 0.000 setrgbcolor
fill
grestore
gsave
357.1 266.1 57.6 38.02 clipbox
116.269714 59.13221 m
126.473143 59.13221 l
126.473143 59.13221 l
116.269714 59.13221 l
cl
1.000 1.000 0.000 setrgbcolor
fill
grestore
gsave
357.1 266.1 57.6 38.02 clipbox
129.024 59.135201 m
139.227429 59.135201 l
139.227429 59.135201 l
129.024 59.135201 l
cl
1.000 1.000 0.000 setrgbcolor
fill
grestore
gsave
357.1 266.1 57.6 38.02 clipbox
141.778286 77.765721 m
151.981714 77.765721 l
151.981714 77.765721 l
141.778286 77.765721 l
cl
1.000 1.000 0.000 setrgbcolor
fill
grestore
gsave
357.1 266.1 57.6 38.02 clipbox
154.532571 59.135558 m
164.736 59.135558 l
164.736 59.135558 l
154.532571 59.135558 l
cl
1.000 1.000 0.000 setrgbcolor
fill
grestore
gsave
357.1 266.1 57.6 38.02 clipbox
167.286857 77.775031 m
177.490286 77.775031 l
177.490286 77.775031 l
167.286857 77.775031 l
cl
1.000 1.000 0.000 setrgbcolor
fill
grestore
gsave
357.1 266.1 57.6 38.02 clipbox
180.041143 52.928673 m
190.244571 52.928673 l
190.244571 52.928673 l
180.041143 52.928673 l
cl
1.000 1.000 0.000 setrgbcolor
fill
grestore
gsave
357.1 266.1 57.6 38.02 clipbox
192.795429 52.910777 m
202.998857 52.910777 l
202.998857 52.910777 l
192.795429 52.910777 l
cl
1.000 1.000 0.000 setrgbcolor
fill
grestore
gsave
357.1 266.1 57.6 38.02 clipbox
205.549714 52.911019 m
215.753143 52.911019 l
215.753143 52.911019 l
205.549714 52.911019 l
cl
1.000 1.000 0.000 setrgbcolor
fill
grestore
gsave
357.1 266.1 57.6 38.02 clipbox
218.304 65.34991 m
228.507429 65.34991 l
228.507429 65.34991 l
218.304 65.34991 l
cl
1.000 1.000 0.000 setrgbcolor
fill
grestore
gsave
357.1 266.1 57.6 38.02 clipbox
231.058286 65.349401 m
241.261714 65.349401 l
241.261714 65.349401 l
231.058286 65.349401 l
cl
1.000 1.000 0.000 setrgbcolor
fill
grestore
gsave
357.1 266.1 57.6 38.02 clipbox
243.812571 52.924375 m
254.016 52.924375 l
254.016 52.924375 l
243.812571 52.924375 l
cl
1.000 1.000 0.000 setrgbcolor
fill
grestore
gsave
357.1 266.1 57.6 38.02 clipbox
256.566857 52.925491 m
266.770286 52.925491 l
266.770286 52.925491 l
256.566857 52.925491 l
cl
1.000 1.000 0.000 setrgbcolor
fill
grestore
gsave
357.1 266.1 57.6 38.02 clipbox
269.321143 52.92917 m
279.524571 52.92917 l
279.524571 52.92917 l
269.321143 52.92917 l
cl
1.000 1.000 0.000 setrgbcolor
fill
grestore
gsave
357.1 266.1 57.6 38.02 clipbox
282.075429 65.356351 m
292.278857 65.356351 l
292.278857 65.356351 l
282.075429 65.356351 l
cl
1.000 1.000 0.000 setrgbcolor
fill
grestore
gsave
357.1 266.1 57.6 38.02 clipbox
294.829714 121.25061 m
305.033143 121.25061 l
305.033143 121.25061 l
294.829714 121.25061 l
cl
1.000 1.000 0.000 setrgbcolor
fill
grestore
gsave
357.1 266.1 57.6 38.02 clipbox
307.584 52.902183 m
317.787429 52.902183 l
317.787429 52.902183 l
307.584 52.902183 l
cl
1.000 1.000 0.000 setrgbcolor
fill
grestore
gsave
357.1 266.1 57.6 38.02 clipbox
320.338286 65.326982 m
330.541714 65.326982 l
330.541714 90.167834 l
320.338286 90.167834 l
cl
1.000 1.000 0.000 setrgbcolor
fill
grestore
gsave
357.1 266.1 57.6 38.02 clipbox
333.092571 65.362578 m
343.296 65.362578 l
343.296 90.20343 l
333.092571 90.20343 l
cl
1.000 1.000 0.000 setrgbcolor
fill
grestore
gsave
357.1 266.1 57.6 38.02 clipbox
345.846857 71.554797 m
356.050286 71.554797 l
356.050286 96.395649 l
345.846857 96.395649 l
cl
1.000 1.000 0.000 setrgbcolor
fill
grestore
gsave
357.1 266.1 57.6 38.02 clipbox
358.601143 83.961651 m
368.804571 83.961651 l
368.804571 108.802503 l
358.601143 108.802503 l
cl
1.000 1.000 0.000 setrgbcolor
fill
grestore
gsave
357.1 266.1 57.6 38.02 clipbox
371.355429 52.925075 m
381.558857 52.925075 l
381.558857 77.765927 l
371.355429 77.765927 l
cl
1.000 1.000 0.000 setrgbcolor
fill
grestore
gsave
357.1 266.1 57.6 38.02 clipbox
78.006857 83.974606 m
88.210286 83.974606 l
88.210286 151.728912 l
78.006857 151.728912 l
cl
0.502 0.000 0.502 setrgbcolor
fill
grestore
gsave
357.1 266.1 57.6 38.02 clipbox
90.761143 59.134162 m
100.964571 59.134162 l
100.964571 126.888468 l
90.761143 126.888468 l
cl
0.502 0.000 0.502 setrgbcolor
fill
grestore
gsave
357.1 266.1 57.6 38.02 clipbox
103.515429 59.132777 m
113.718857 59.132777 l
113.718857 126.887083 l
103.515429 126.887083 l
cl
0.502 0.000 0.502 setrgbcolor
fill
grestore
gsave
357.1 266.1 57.6 38.02 clipbox
116.269714 59.13221 m
126.473143 59.13221 l
126.473143 126.886517 l
116.269714 126.886517 l
cl
0.502 0.000 0.502 setrgbcolor
fill
grestore
gsave
357.1 266.1 57.6 38.02 clipbox
129.024 59.135201 m
139.227429 59.135201 l
139.227429 126.889507 l
129.024 126.889507 l
cl
0.502 0.000 0.502 setrgbcolor
fill
grestore
gsave
357.1 266.1 57.6 38.02 clipbox
141.778286 77.765721 m
151.981714 77.765721 l
151.981714 145.520027 l
141.778286 145.520027 l
cl
0.502 0.000 0.502 setrgbcolor
fill
grestore
gsave
357.1 266.1 57.6 38.02 clipbox
154.532571 59.135558 m
164.736 59.135558 l
164.736 126.889864 l
154.532571 126.889864 l
cl
0.502 0.000 0.502 setrgbcolor
fill
grestore
gsave
357.1 266.1 57.6 38.02 clipbox
167.286857 77.775031 m
177.490286 77.775031 l
177.490286 145.529338 l
167.286857 145.529338 l
cl
0.502 0.000 0.502 setrgbcolor
fill
grestore
gsave
357.1 266.1 57.6 38.02 clipbox
180.041143 52.928673 m
190.244571 52.928673 l
190.244571 120.682979 l
180.041143 120.682979 l
cl
0.502 0.000 0.502 setrgbcolor
fill
grestore
gsave
357.1 266.1 57.6 38.02 clipbox
192.795429 52.910777 m
202.998857 52.910777 l
202.998857 52.910777 l
192.795429 52.910777 l
cl
0.502 0.000 0.502 setrgbcolor
fill
grestore
gsave
357.1 266.1 57.6 38.02 clipbox
205.549714 52.911019 m
215.753143 52.911019 l
215.753143 52.911019 l
205.549714 52.911019 l
cl
0.502 0.000 0.502 setrgbcolor
fill
grestore
gsave
357.1 266.1 57.6 38.02 clipbox
218.304 65.34991 m
228.507429 65.34991 l
228.507429 65.34991 l
218.304 65.34991 l
cl
0.502 0.000 0.502 setrgbcolor
fill
grestore
gsave
357.1 266.1 57.6 38.02 clipbox
231.058286 65.349401 m
241.261714 65.349401 l
241.261714 65.349401 l
231.058286 65.349401 l
cl
0.502 0.000 0.502 setrgbcolor
fill
grestore
gsave
357.1 266.1 57.6 38.02 clipbox
243.812571 52.924375 m
254.016 52.924375 l
254.016 52.924375 l
243.812571 52.924375 l
cl
0.502 0.000 0.502 setrgbcolor
fill
grestore
gsave
357.1 266.1 57.6 38.02 clipbox
256.566857 52.925491 m
266.770286 52.925491 l
266.770286 52.925491 l
256.566857 52.925491 l
cl
0.502 0.000 0.502 setrgbcolor
fill
grestore
gsave
357.1 266.1 57.6 38.02 clipbox
269.321143 52.92917 m
279.524571 52.92917 l
279.524571 52.92917 l
269.321143 52.92917 l
cl
0.502 0.000 0.502 setrgbcolor
fill
grestore
gsave
357.1 266.1 57.6 38.02 clipbox
282.075429 65.356351 m
292.278857 65.356351 l
292.278857 65.356351 l
282.075429 65.356351 l
cl
0.502 0.000 0.502 setrgbcolor
fill
grestore
gsave
357.1 266.1 57.6 38.02 clipbox
294.829714 121.25061 m
305.033143 121.25061 l
305.033143 121.25061 l
294.829714 121.25061 l
cl
0.502 0.000 0.502 setrgbcolor
fill
grestore
gsave
357.1 266.1 57.6 38.02 clipbox
307.584 52.902183 m
317.787429 52.902183 l
317.787429 52.902183 l
307.584 52.902183 l
cl
0.502 0.000 0.502 setrgbcolor
fill
grestore
gsave
357.1 266.1 57.6 38.02 clipbox
320.338286 90.167834 m
330.541714 90.167834 l
330.541714 90.167834 l
320.338286 90.167834 l
cl
0.502 0.000 0.502 setrgbcolor
fill
grestore
gsave
357.1 266.1 57.6 38.02 clipbox
333.092571 90.20343 m
343.296 90.20343 l
343.296 90.20343 l
333.092571 90.20343 l
cl
0.502 0.000 0.502 setrgbcolor
fill
grestore
gsave
357.1 266.1 57.6 38.02 clipbox
345.846857 96.395649 m
356.050286 96.395649 l
356.050286 96.395649 l
345.846857 96.395649 l
cl
0.502 0.000 0.502 setrgbcolor
fill
grestore
gsave
357.1 266.1 57.6 38.02 clipbox
358.601143 108.802503 m
368.804571 108.802503 l
368.804571 176.55681 l
358.601143 176.55681 l
cl
0.502 0.000 0.502 setrgbcolor
fill
grestore
gsave
357.1 266.1 57.6 38.02 clipbox
371.355429 77.765927 m
381.558857 77.765927 l
381.558857 145.520233 l
371.355429 145.520233 l
cl
0.502 0.000 0.502 setrgbcolor
fill
grestore
gsave
357.1 266.1 57.6 38.02 clipbox
78.006857 151.728912 m
88.210286 151.728912 l
88.210286 151.728912 l
78.006857 151.728912 l
cl
1.000 0.000 1.000 setrgbcolor
fill
grestore
gsave
357.1 266.1 57.6 38.02 clipbox
90.761143 126.888468 m
100.964571 126.888468 l
100.964571 126.888468 l
90.761143 126.888468 l
cl
1.000 0.000 1.000 setrgbcolor
fill
grestore
gsave
357.1 266.1 57.6 38.02 clipbox
103.515429 126.887083 m
113.718857 126.887083 l
113.718857 126.887083 l
103.515429 126.887083 l
cl
1.000 0.000 1.000 setrgbcolor
fill
grestore
gsave
357.1 266.1 57.6 38.02 clipbox
116.269714 126.886517 m
126.473143 126.886517 l
126.473143 126.886517 l
116.269714 126.886517 l
cl
1.000 0.000 1.000 setrgbcolor
fill
grestore
gsave
357.1 266.1 57.6 38.02 clipbox
129.024 126.889507 m
139.227429 126.889507 l
139.227429 126.889507 l
129.024 126.889507 l
cl
1.000 0.000 1.000 setrgbcolor
fill
grestore
gsave
357.1 266.1 57.6 38.02 clipbox
141.778286 145.520027 m
151.981714 145.520027 l
151.981714 145.520027 l
141.778286 145.520027 l
cl
1.000 0.000 1.000 setrgbcolor
fill
grestore
gsave
357.1 266.1 57.6 38.02 clipbox
154.532571 126.889864 m
164.736 126.889864 l
164.736 126.889864 l
154.532571 126.889864 l
cl
1.000 0.000 1.000 setrgbcolor
fill
grestore
gsave
357.1 266.1 57.6 38.02 clipbox
167.286857 145.529338 m
177.490286 145.529338 l
177.490286 145.529338 l
167.286857 145.529338 l
cl
1.000 0.000 1.000 setrgbcolor
fill
grestore
gsave
357.1 266.1 57.6 38.02 clipbox
180.041143 120.682979 m
190.244571 120.682979 l
190.244571 186.931634 l
180.041143 186.931634 l
cl
1.000 0.000 1.000 setrgbcolor
fill
grestore
gsave
357.1 266.1 57.6 38.02 clipbox
192.795429 52.910777 m
202.998857 52.910777 l
202.998857 119.159432 l
192.795429 119.159432 l
cl
1.000 0.000 1.000 setrgbcolor
fill
grestore
gsave
357.1 266.1 57.6 38.02 clipbox
205.549714 52.911019 m
215.753143 52.911019 l
215.753143 119.159674 l
205.549714 119.159674 l
cl
1.000 0.000 1.000 setrgbcolor
fill
grestore
gsave
357.1 266.1 57.6 38.02 clipbox
218.304 65.34991 m
228.507429 65.34991 l
228.507429 131.598565 l
218.304 131.598565 l
cl
1.000 0.000 1.000 setrgbcolor
fill
grestore
gsave
357.1 266.1 57.6 38.02 clipbox
231.058286 65.349401 m
241.261714 65.349401 l
241.261714 131.598056 l
231.058286 131.598056 l
cl
1.000 0.000 1.000 setrgbcolor
fill
grestore
gsave
357.1 266.1 57.6 38.02 clipbox
243.812571 52.924375 m
254.016 52.924375 l
254.016 119.17303 l
243.812571 119.17303 l
cl
1.000 0.000 1.000 setrgbcolor
fill
grestore
gsave
357.1 266.1 57.6 38.02 clipbox
256.566857 52.925491 m
266.770286 52.925491 l
266.770286 119.174147 l
256.566857 119.174147 l
cl
1.000 0.000 1.000 setrgbcolor
fill
grestore
gsave
357.1 266.1 57.6 38.02 clipbox
269.321143 52.92917 m
279.524571 52.92917 l
279.524571 119.177825 l
269.321143 119.177825 l
cl
1.000 0.000 1.000 setrgbcolor
fill
grestore
gsave
357.1 266.1 57.6 38.02 clipbox
282.075429 65.356351 m
292.278857 65.356351 l
292.278857 131.605006 l
282.075429 131.605006 l
cl
1.000 0.000 1.000 setrgbcolor
fill
grestore
gsave
357.1 266.1 57.6 38.02 clipbox
294.829714 121.25061 m
305.033143 121.25061 l
305.033143 187.499265 l
294.829714 187.499265 l
cl
1.000 0.000 1.000 setrgbcolor
fill
grestore
gsave
357.1 266.1 57.6 38.02 clipbox
307.584 52.902183 m
317.787429 52.902183 l
317.787429 119.150838 l
307.584 119.150838 l
cl
1.000 0.000 1.000 setrgbcolor
fill
grestore
gsave
357.1 266.1 57.6 38.02 clipbox
320.338286 90.167834 m
330.541714 90.167834 l
330.541714 156.416489 l
320.338286 156.416489 l
cl
1.000 0.000 1.000 setrgbcolor
fill
grestore
gsave
357.1 266.1 57.6 38.02 clipbox
333.092571 90.20343 m
343.296 90.20343 l
343.296 90.20343 l
333.092571 90.20343 l
cl
1.000 0.000 1.000 setrgbcolor
fill
grestore
gsave
357.1 266.1 57.6 38.02 clipbox
345.846857 96.395649 m
356.050286 96.395649 l
356.050286 96.395649 l
345.846857 96.395649 l
cl
1.000 0.000 1.000 setrgbcolor
fill
grestore
gsave
357.1 266.1 57.6 38.02 clipbox
358.601143 176.55681 m
368.804571 176.55681 l
368.804571 176.55681 l
358.601143 176.55681 l
cl
1.000 0.000 1.000 setrgbcolor
fill
grestore
gsave
357.1 266.1 57.6 38.02 clipbox
371.355429 145.520233 m
381.558857 145.520233 l
381.558857 145.520233 l
371.355429 145.520233 l
cl
1.000 0.000 1.000 setrgbcolor
fill
grestore
gsave
357.1 266.1 57.6 38.02 clipbox
78.006857 151.728912 m
88.210286 151.728912 l
88.210286 182.787049 l
78.006857 182.787049 l
cl
0.000 1.000 0.000 setrgbcolor
fill
grestore
gsave
357.1 266.1 57.6 38.02 clipbox
90.761143 126.888468 m
100.964571 126.888468 l
100.964571 157.943909 l
90.761143 157.943909 l
cl
0.000 1.000 0.000 setrgbcolor
fill
grestore
gsave
357.1 266.1 57.6 38.02 clipbox
103.515429 126.887083 m
113.718857 126.887083 l
113.718857 157.939344 l
103.515429 157.939344 l
cl
0.000 1.000 0.000 setrgbcolor
fill
grestore
gsave
357.1 266.1 57.6 38.02 clipbox
116.269714 126.886517 m
126.473143 126.886517 l
126.473143 157.938028 l
116.269714 157.938028 l
cl
0.000 1.000 0.000 setrgbcolor
fill
grestore
gsave
357.1 266.1 57.6 38.02 clipbox
129.024 126.889507 m
139.227429 126.889507 l
139.227429 157.943402 l
129.024 157.943402 l
cl
0.000 1.000 0.000 setrgbcolor
fill
grestore
gsave
357.1 266.1 57.6 38.02 clipbox
141.778286 145.520027 m
151.981714 145.520027 l
151.981714 176.577737 l
141.778286 176.577737 l
cl
0.000 1.000 0.000 setrgbcolor
fill
grestore
gsave
357.1 266.1 57.6 38.02 clipbox
154.532571 126.889864 m
164.736 126.889864 l
164.736 157.950123 l
154.532571 157.950123 l
cl
0.000 1.000 0.000 setrgbcolor
fill
grestore
gsave
357.1 266.1 57.6 38.02 clipbox
167.286857 145.529338 m
177.490286 145.529338 l
177.490286 176.589252 l
167.286857 176.589252 l
cl
0.000 1.000 0.000 setrgbcolor
fill
grestore
gsave
357.1 266.1 57.6 38.02 clipbox
180.041143 186.931634 m
190.244571 186.931634 l
190.244571 217.988531 l
180.041143 217.988531 l
cl
0.000 1.000 0.000 setrgbcolor
fill
grestore
gsave
357.1 266.1 57.6 38.02 clipbox
192.795429 119.159432 m
202.998857 119.159432 l
202.998857 150.211729 l
192.795429 150.211729 l
cl
0.000 1.000 0.000 setrgbcolor
fill
grestore
gsave
357.1 266.1 57.6 38.02 clipbox
205.549714 119.159674 m
215.753143 119.159674 l
215.753143 150.207502 l
205.549714 150.207502 l
cl
0.000 1.000 0.000 setrgbcolor
fill
grestore
gsave
357.1 266.1 57.6 38.02 clipbox
218.304 131.598565 m
228.507429 131.598565 l
228.507429 162.645355 l
218.304 162.645355 l
cl
0.000 1.000 0.000 setrgbcolor
fill
grestore
gsave
357.1 266.1 57.6 38.02 clipbox
231.058286 131.598056 m
241.261714 131.598056 l
241.261714 162.649448 l
231.058286 162.649448 l
cl
0.000 1.000 0.000 setrgbcolor
fill
grestore
gsave
357.1 266.1 57.6 38.02 clipbox
243.812571 119.17303 m
254.016 119.17303 l
254.016 150.22971 l
243.812571 150.22971 l
cl
0.000 1.000 0.000 setrgbcolor
fill
grestore
gsave
357.1 266.1 57.6 38.02 clipbox
256.566857 119.174147 m
266.770286 119.174147 l
266.770286 150.231409 l
256.566857 150.231409 l
cl
0.000 1.000 0.000 setrgbcolor
fill
grestore
gsave
357.1 266.1 57.6 38.02 clipbox
269.321143 119.177825 m
279.524571 119.177825 l
279.524571 150.239044 l
269.321143 150.239044 l
cl
0.000 1.000 0.000 setrgbcolor
fill
grestore
gsave
357.1 266.1 57.6 38.02 clipbox
282.075429 131.605006 m
292.278857 131.605006 l
292.278857 162.661254 l
282.075429 162.661254 l
cl
0.000 1.000 0.000 setrgbcolor
fill
grestore
gsave
357.1 266.1 57.6 38.02 clipbox
294.829714 187.499265 m
305.033143 187.499265 l
305.033143 218.554268 l
294.829714 218.554268 l
cl
0.000 1.000 0.000 setrgbcolor
fill
grestore
gsave
357.1 266.1 57.6 38.02 clipbox
307.584 119.150838 m
317.787429 119.150838 l
317.787429 150.197726 l
307.584 150.197726 l
cl
0.000 1.000 0.000 setrgbcolor
fill
grestore
gsave
357.1 266.1 57.6 38.02 clipbox
320.338286 156.416489 m
330.541714 156.416489 l
330.541714 187.473213 l
320.338286 187.473213 l
cl
0.000 1.000 0.000 setrgbcolor
fill
grestore
gsave
357.1 266.1 57.6 38.02 clipbox
333.092571 90.20343 m
343.296 90.20343 l
343.296 121.258799 l
333.092571 121.258799 l
cl
0.000 1.000 0.000 setrgbcolor
fill
grestore
gsave
357.1 266.1 57.6 38.02 clipbox
345.846857 96.395649 m
356.050286 96.395649 l
356.050286 127.454074 l
345.846857 127.454074 l
cl
0.000 1.000 0.000 setrgbcolor
fill
grestore
gsave
357.1 266.1 57.6 38.02 clipbox
358.601143 176.55681 m
368.804571 176.55681 l
368.804571 207.613888 l
358.601143 207.613888 l
cl
0.000 1.000 0.000 setrgbcolor
fill
grestore
gsave
357.1 266.1 57.6 38.02 clipbox
371.355429 145.520233 m
381.558857 145.520233 l
381.558857 176.580682 l
371.355429 176.580682 l
cl
0.000 1.000 0.000 setrgbcolor
fill
grestore
0.800 setlinewidth
1 setlinejoin
0 setlinecap
[] 0 setdash
0.000 setgray
gsave
/o {
gsave
newpath
translate
0.8 setlinewidth
1 setlinejoin
0 setlinecap
0 0 m
0 -3.5 l

gsave
0.000 setgray
fill
grestore
stroke
grestore
} bind def
83.1086 38.016 o
grestore
/DejaVuSans findfont
10.000 scalefont
setfont
gsave
79.928884 23.422250 translate
0.000000 rotate
0.000000 0.000000 m /zero glyphshow
grestore
gsave
/o {
gsave
newpath
translate
0.8 setlinewidth
1 setlinejoin
0 setlinecap
0 0 m
0 -3.5 l

gsave
0.000 setgray
fill
grestore
stroke
grestore
} bind def
146.88 38.016 o
grestore
gsave
143.700312 23.422250 translate
0.000000 rotate
0.000000 0.000000 m /five glyphshow
grestore
gsave
/o {
gsave
newpath
translate
0.8 setlinewidth
1 setlinejoin
0 setlinecap
0 0 m
0 -3.5 l

gsave
0.000 setgray
fill
grestore
stroke
grestore
} bind def
210.651 38.016 o
grestore
gsave
204.292054 23.422250 translate
0.000000 rotate
0.000000 0.000000 m /one glyphshow
6.362305 0.000000 m /zero glyphshow
grestore
gsave
/o {
gsave
newpath
translate
0.8 setlinewidth
1 setlinejoin
0 setlinecap
0 0 m
0 -3.5 l

gsave
0.000 setgray
fill
grestore
stroke
grestore
} bind def
274.423 38.016 o
grestore
gsave
268.063482 23.422250 translate
0.000000 rotate
0.000000 0.000000 m /one glyphshow
6.362305 0.000000 m /five glyphshow
grestore
gsave
/o {
gsave
newpath
translate
0.8 setlinewidth
1 setlinejoin
0 setlinecap
0 0 m
0 -3.5 l

gsave
0.000 setgray
fill
grestore
stroke
grestore
} bind def
338.194 38.016 o
grestore
gsave
331.834911 23.422250 translate
0.000000 rotate
0.000000 0.000000 m /two glyphshow
6.362305 0.000000 m /zero glyphshow
grestore
gsave
/o {
gsave
newpath
translate
0.8 setlinewidth
1 setlinejoin
0 setlinecap
0 0 m
0 -3.5 l

gsave
0.000 setgray
fill
grestore
stroke
grestore
} bind def
401.966 38.016 o
grestore
gsave
395.606339 23.422250 translate
0.000000 rotate
0.000000 0.000000 m /two glyphshow
6.362305 0.000000 m /five glyphshow
grestore
gsave
/o {
gsave
newpath
translate
0.8 setlinewidth
1 setlinejoin
0 setlinecap
0 0 m
-3.5 0 l

gsave
0.000 setgray
fill
grestore
stroke
grestore
} bind def
57.6 38.016 o
grestore
gsave
28.334375 34.219125 translate
0.000000 rotate
0.000000 0.000000 m /zero glyphshow
6.362305 0.000000 m /period glyphshow
9.541016 0.000000 m /zero glyphshow
15.903320 0.000000 m /zero glyphshow
grestore
gsave
/o {
gsave
newpath
translate
0.8 setlinewidth
1 setlinejoin
0 setlinecap
0 0 m
-3.5 0 l

gsave
0.000 setgray
fill
grestore
stroke
grestore
} bind def
57.6 69.0701 o
grestore
gsave
28.334375 65.273182 translate
0.000000 rotate
0.000000 0.000000 m /zero glyphshow
6.362305 0.000000 m /period glyphshow
9.541016 0.000000 m /two glyphshow
15.903320 0.000000 m /five glyphshow
grestore
gsave
/o {
gsave
newpath
translate
0.8 setlinewidth
1 setlinejoin
0 setlinecap
0 0 m
-3.5 0 l

gsave
0.000 setgray
fill
grestore
stroke
grestore
} bind def
57.6 100.124 o
grestore
gsave
28.334375 96.327239 translate
0.000000 rotate
0.000000 0.000000 m /zero glyphshow
6.362305 0.000000 m /period glyphshow
9.541016 0.000000 m /five glyphshow
15.903320 0.000000 m /zero glyphshow
grestore
gsave
/o {
gsave
newpath
translate
0.8 setlinewidth
1 setlinejoin
0 setlinecap
0 0 m
-3.5 0 l

gsave
0.000 setgray
fill
grestore
stroke
grestore
} bind def
57.6 131.178 o
grestore
gsave
28.334375 127.381296 translate
0.000000 rotate
0.000000 0.000000 m /zero glyphshow
6.362305 0.000000 m /period glyphshow
9.541016 0.000000 m /seven glyphshow
15.903320 0.000000 m /five glyphshow
grestore
gsave
/o {
gsave
newpath
translate
0.8 setlinewidth
1 setlinejoin
0 setlinecap
0 0 m
-3.5 0 l

gsave
0.000 setgray
fill
grestore
stroke
grestore
} bind def
57.6 162.232 o
grestore
gsave
28.334375 158.435353 translate
0.000000 rotate
0.000000 0.000000 m /one glyphshow
6.362305 0.000000 m /period glyphshow
9.541016 0.000000 m /zero glyphshow
15.903320 0.000000 m /zero glyphshow
grestore
gsave
/o {
gsave
newpath
translate
0.8 setlinewidth
1 setlinejoin
0 setlinecap
0 0 m
-3.5 0 l

gsave
0.000 setgray
fill
grestore
stroke
grestore
} bind def
57.6 193.286 o
grestore
gsave
28.334375 189.489410 translate
0.000000 rotate
0.000000 0.000000 m /one glyphshow
6.362305 0.000000 m /period glyphshow
9.541016 0.000000 m /two glyphshow
15.903320 0.000000 m /five glyphshow
grestore
gsave
/o {
gsave
newpath
translate
0.8 setlinewidth
1 setlinejoin
0 setlinecap
0 0 m
-3.5 0 l

gsave
0.000 setgray
fill
grestore
stroke
grestore
} bind def
57.6 224.34 o
grestore
gsave
28.334375 220.543467 translate
0.000000 rotate
0.000000 0.000000 m /one glyphshow
6.362305 0.000000 m /period glyphshow
9.541016 0.000000 m /five glyphshow
15.903320 0.000000 m /zero glyphshow
grestore
gsave
/o {
gsave
newpath
translate
0.8 setlinewidth
1 setlinejoin
0 setlinecap
0 0 m
-3.5 0 l

gsave
0.000 setgray
fill
grestore
stroke
grestore
} bind def
57.6 255.394 o
grestore
gsave
28.334375 251.597524 translate
0.000000 rotate
0.000000 0.000000 m /one glyphshow
6.362305 0.000000 m /period glyphshow
9.541016 0.000000 m /seven glyphshow
15.903320 0.000000 m /five glyphshow
grestore
gsave
/o {
gsave
newpath
translate
0.8 setlinewidth
1 setlinejoin
0 setlinecap
0 0 m
-3.5 0 l

gsave
0.000 setgray
fill
grestore
stroke
grestore
} bind def
57.6 286.448 o
grestore
gsave
28.334375 282.651581 translate
0.000000 rotate
0.000000 0.000000 m /two glyphshow
6.362305 0.000000 m /period glyphshow
9.541016 0.000000 m /zero glyphshow
15.903320 0.000000 m /zero glyphshow
grestore
0 setlinejoin
2 setlinecap
[] 0 setdash
gsave
57.6 38.016 m
57.6 304.128 l
stroke
grestore
gsave
414.72 38.016 m
414.72 304.128 l
stroke
grestore
gsave
57.6 38.016 m
414.72 38.016 l
stroke
grestore
gsave
57.6 304.128 m
414.72 304.128 l
stroke
grestore
1.000 setlinewidth
0 setlinecap
0.800 setgray
gsave
326.1075 230.778 m
448.32 230.778 l
449.92 230.778 450.72 231.578 450.72 233.178 c
450.72 337.728 l
450.72 339.328 449.92 340.128 448.32 340.128 c
326.1075 340.128 l
324.5075 340.128 323.7075 339.328 323.7075 337.728 c
323.7075 233.178 l
323.7075 231.578 324.5075 230.778 326.1075 230.778 c
cl
gsave
1.000 setgray
fill
grestore
stroke
grestore
gsave
328.5075 326.203 m
352.5075 326.203 l
352.5075 334.603 l
328.5075 334.603 l
cl
1.000 0.000 0.000 setrgbcolor
fill
grestore
0.000 setgray
/DejaVuSans findfont
12.000 scalefont
setfont
gsave
362.107500 326.203000 translate
0.000000 rotate
0.000000 0.000000 m /s glyphshow
6.251953 0.000000 m /i glyphshow
9.585938 0.000000 m /t glyphshow
14.291016 0.000000 m /e glyphshow
21.673828 0.000000 m /seven glyphshow
29.308594 0.000000 m /period glyphshow
33.123047 0.000000 m /u glyphshow
40.728516 0.000000 m /n glyphshow
48.333984 0.000000 m /s glyphshow
54.585938 0.000000 m /c glyphshow
61.183594 0.000000 m /h glyphshow
68.789062 0.000000 m /e glyphshow
76.171875 0.000000 m /d glyphshow
grestore
gsave
328.5075 308.578 m
352.5075 308.578 l
352.5075 316.978 l
328.5075 316.978 l
cl
1.000 0.647 0.000 setrgbcolor
fill
grestore
gsave
362.107500 308.578000 translate
0.000000 rotate
0.000000 0.000000 m /s glyphshow
6.251953 0.000000 m /i glyphshow
9.585938 0.000000 m /t glyphshow
14.291016 0.000000 m /e glyphshow
21.673828 0.000000 m /seven glyphshow
29.308594 0.000000 m /period glyphshow
33.123047 0.000000 m /f glyphshow
37.347656 0.000000 m /r glyphshow
42.281250 0.000000 m /i glyphshow
45.615234 0.000000 m /d glyphshow
53.232422 0.000000 m /g glyphshow
60.849609 0.000000 m /e glyphshow
grestore
gsave
328.5075 290.953 m
352.5075 290.953 l
352.5075 299.353 l
328.5075 299.353 l
cl
1.000 1.000 0.000 setrgbcolor
fill
grestore
gsave
362.107500 290.953000 translate
0.000000 rotate
0.000000 0.000000 m /s glyphshow
6.251953 0.000000 m /i glyphshow
9.585938 0.000000 m /t glyphshow
14.291016 0.000000 m /e glyphshow
21.673828 0.000000 m /seven glyphshow
29.308594 0.000000 m /period glyphshow
33.123047 0.000000 m /l glyphshow
36.457031 0.000000 m /i glyphshow
39.791016 0.000000 m /g glyphshow
47.408203 0.000000 m /h glyphshow
55.013672 0.000000 m /t glyphshow
grestore
gsave
328.5075 273.328 m
352.5075 273.328 l
352.5075 281.728 l
328.5075 281.728 l
cl
0.502 0.000 0.502 setrgbcolor
fill
grestore
gsave
362.107500 273.328000 translate
0.000000 rotate
0.000000 0.000000 m /s glyphshow
6.251953 0.000000 m /i glyphshow
9.585938 0.000000 m /t glyphshow
14.291016 0.000000 m /e glyphshow
21.673828 0.000000 m /seven glyphshow
29.308594 0.000000 m /period glyphshow
33.123047 0.000000 m /e glyphshow
40.505859 0.000000 m /v glyphshow
grestore
gsave
328.5075 255.703 m
352.5075 255.703 l
352.5075 264.103 l
328.5075 264.103 l
cl
1.000 0.000 1.000 setrgbcolor
fill
grestore
gsave
362.107500 255.703000 translate
0.000000 rotate
0.000000 0.000000 m /s glyphshow
6.251953 0.000000 m /i glyphshow
9.585938 0.000000 m /t glyphshow
14.291016 0.000000 m /e glyphshow
21.673828 0.000000 m /seven glyphshow
29.308594 0.000000 m /period glyphshow
33.123047 0.000000 m /w glyphshow
42.937500 0.000000 m /p glyphshow
50.554688 0.000000 m /u glyphshow
58.160156 0.000000 m /m glyphshow
69.849609 0.000000 m /p glyphshow
grestore
gsave
328.5075 238.078 m
352.5075 238.078 l
352.5075 246.478 l
328.5075 246.478 l
cl
0.000 1.000 0.000 setrgbcolor
fill
grestore
gsave
362.107500 238.078000 translate
0.000000 rotate
0.000000 0.000000 m /s glyphshow
6.251953 0.000000 m /i glyphshow
9.585938 0.000000 m /t glyphshow
14.291016 0.000000 m /e glyphshow
21.673828 0.000000 m /seven glyphshow
29.308594 0.000000 m /period glyphshow
33.123047 0.000000 m /f glyphshow
37.347656 0.000000 m /r glyphshow
42.281250 0.000000 m /e glyphshow
49.664062 0.000000 m /e glyphshow
57.046875 0.000000 m /z glyphshow
63.345703 0.000000 m /e glyphshow
70.728516 0.000000 m /r glyphshow
grestore

end
showpage
