{
  "p": [0.0,0.0,0.0,0.0,0.0,0.0,0.0,0.0,0.0,0.0,0.0,0.0,0.0,0.0,0.0,0.0,0.0,0.0,0.0,0.0,0.0,0.0,0.0,0.0],
  "_r_last": [0.0,0.0,0.0,0.0,0.0,0.0,0.0,0.0,0.0,0.0,0.0,0.0,0.0,0.0,0.0,0.0,0.0,0.0,0.0,0.0,0.0,0.0,0.0,0.0],
  "sbounds": null,
  "_type": "powermarket.network.network.Network",
  "stepsize": 0.001,
  "_steps": 1,
  "agents": [{
    "s": [[-4.660515653222788,-4.646148674643338,-4.6515772251482,-4.644438621982796,-4.648544657658793,-4.563260464859268,-4.504306711301028,-4.278649620828303,-4.336592283254478,-4.077520322410202,-4.00742529267861,-4.026236385514257,-4.296688771415445,-4.322544869595273,-4.349101566300334,-4.372108013399112,-4.3935140019253005,-4.440117634974223,-4.592551534940995,-4.693329337451549,-4.753381067728954,-4.686972223136895,-4.716566470340268,-4.669691750491035]],
    "p": [0.0,0.0,0.0,0.0,0.0,0.0,0.0,0.0,0.0,0.0,0.0,0.0,0.0,0.0,0.0,0.0,0.0,0.0,0.0,0.0,0.0,0.0,0.0,0.0],
    "strategy": {
      "_type": "powermarket.agent.deviceagent.PointDemandBidStrategy",
      "solver_options": {}
    },
    "device": {
      "_type": "powermarket.device_kit.gdevice.GDevice",
      "length": 24,
      "cost": [0.028,0.3,0.0],
      "bounds": [[-11.25,-2.0],[-11.25,-2.0],[-11.25,-2.0],[-11.25,-2.0],[-11.25,-2.0],[-11.25,-2.0],[-11.25,-2.0],[-11.25,-2.0],[-11.25,-2.0],[-11.25,-2.0],[-11.25,-2.0],[-11.25,-2.0],[-11.25,-2.0],[-11.25,-2.0],[-11.25,-2.0],[-11.25,-2.0],[-11.25,-2.0],[-11.25,-2.0],[-11.25,-2.0],[-11.25,-2.0],[-11.25,-2.0],[-11.25,-2.0],[-11.25,-2.0],[-11.25,-2.0]],
      "cbounds": null,
      "id": "supply",
      "run_time": [4,null]
    },
    "_type": "powermarket.agent.deviceagent.DeviceAgent"
  },{
    "s": [[-0.04999996185064228,-0.04999996185061863,-0.049999961850577715,-0.05499999999957156,-0.18499999999947872,-1.0099999999990141,-2.28922856657108,-3.6423453135943173,-4.855517842480601,-5.605447316384395,-5.934397577688772,-5.881582697824467,-5.653836926608828,-5.3979517161823845,-4.548736691356503,-4.0090258938717795,-3.104329904586178,-2.304999999999243,-1.3799999999997625,-0.6099999999999344,-0.559999687811041,-0.4599996490285832,-0.0799999389615112,-0.04492891340502986]],
    "p": [0.0,0.0,0.0,0.0,0.0,0.0,0.0,0.0,0.0,0.0,0.0,0.0,0.0,0.0,0.0,0.0,0.0,0.0,0.0,0.0,0.0,0.0,0.0,0.0],
    "strategy": {
      "_type": "powermarket.agent.deviceagent.PointDemandBidStrategy",
      "solver_options": {}
    },
    "device": {
      "bounds": [[-0.05,0.0],[-0.05,0.0],[-0.05,0.0],[-0.055,0.0],[-0.185,0.0],[-1.01,0.0],[-2.29,0.0],[-3.645,0.0],[-4.86,0.0],[-5.62,0.0],[-5.95,0.0],[-5.895,0.0],[-5.665,0.0],[-5.405,0.0],[-4.55,0.0],[-4.01,0.0],[-3.105,0.0],[-2.305,0.0],[-1.38,0.0],[-0.61,0.0],[-0.56,0.0],[-0.46,0.0],[-0.08,0.0],[-0.045,0.0]],
      "cbounds": null,
      "id": "pv",
      "length": 24,
      "_type": "powermarket.device_kit.pvdevice.PVDevice"
    },
    "_type": "powermarket.agent.deviceagent.DeviceAgent"
  },{
    "s": [[-0.0014942234258993577,-0.33360459300564727,-0.0010297180768947347,-0.33178954174163466,-0.3410835842489434,-0.03889354300139022,0.006089478379079064,-0.003818594783315806,-0.0012567168014329796,0.40805841894592226,0.5881395103797352,0.5460994234842677,-0.006385180440294051,-0.0035446807710055525,-0.0034215506881468453,0.14303243474181998,0.06236538420066624,0.020239667950258854,0.0013682762584328514,-0.07873920555693417,-0.06707525818807461,-0.4328041095156698,-0.022275542173765796,-0.0061605871226927955]],
    "p": [0.0,0.0,0.0,0.0,0.0,0.0,0.0,0.0,0.0,0.0,0.0,0.0,0.0,0.0,0.0,0.0,0.0,0.0,0.0,0.0,0.0,0.0,0.0,0.0],
    "strategy": {
      "_type": "powermarket.agent.deviceagent.PointDemandBidStrategy",
      "solver_options": {}
    },
    "device": {
      "reserve": 0.5,
      "c1": 0.0,
      "c2": 0.0,
      "length": 24,
      "_type": "powermarket.device_kit.sdevice.SDevice",
      "bounds": [[-9.5,9.5],[-9.5,9.5],[-9.5,9.5],[-9.5,9.5],[-9.5,9.5],[-9.5,9.5],[-9.5,9.5],[-9.5,9.5],[-9.5,9.5],[-9.5,9.5],[-9.5,9.5],[-9.5,9.5],[-9.5,9.5],[-9.5,9.5],[-9.5,9.5],[-9.5,9.5],[-9.5,9.5],[-9.5,9.5],[-9.5,9.5],[-9.5,9.5],[-9.5,9.5],[-9.5,9.5],[-9.5,9.5],[-9.5,9.5]],
      "cbounds": null,
      "id": "battery",
      "capacity": 32,
      "c3": 0.0,
      "efficiency": 0.97
    },
    "_type": "powermarket.agent.deviceagent.DeviceAgent"
  },{
    "s": [[0.0,0.0,0.0,0.0,0.0,0.0,0.0,0.25,0.25,0.35,0.0,0.0,0.0,0.0,0.0,0.0,0.0,0.0,0.0,0.0,0.3,0.3,0.4,0.1],[0.12013120976060139,0.1198018999748617,0.11946736604840583,0.12050727844413645,0.11915981085535692,0.12158104396606874,0.11458816426264229,0.11909006150440027,0.11948798587833906,0.12549079084538228,0.11780605040336493,0.12031481992902235,0.11967444140498254,0.12021586307790955,0.11842921264489459,0.1211490692965106,0.11819883130698772,0.11896781873868387,0.12469114995429442,0.11947887454270892,0.12063807908209027,0.11734276567109936,0.11626820885605457,0.09994754822154013],[0.0,0.0,0.0,0.0,0.0,0.0,0.0,0.0,0.0,0.0,0.0,0.0,0.0,0.0,0.0,0.0,0.0,0.11717735579478968,0.1201834003556499,0.11511334629485719,0.11597087248641293,0.11626502097094284,0.11216015188553899,0.0],[0.5101733537360758,0.5865675868726992,0.546527756168713,0.5887486363357148,0.579454593885207,0.0,0.0,0.0,0.0,0.0,0.0,0.0,0.0,0.0,0.0,0.0,0.0,0.0,0.43575632242388423,0.33734591364279054,0.2742240822836453,0.4877340685783417,0.33224260810745204,0.48972716874575245],[0.0,0.0,0.0,0.0,0.0,0.0,0.0,0.0,0.0,0.0,0.0,0.0,1.0760652515622018,1.0754821691932845,1.011429347077653,0.9576113456223927,0.9440666661871244,0.8142661007151714,0.38807650584759446,0.13300261378498895,0.0,0.0,0.0,0.0],[0.0,0.0,0.0,0.0,0.0,0.0,0.0,0.0,0.6842913983065916,1.3929742442420465,1.5730553357274841,1.5310152487811663,0.6874586730142636,0.6034743699418476,0.5231602471155323,0.42015775700309343,0.3393962855061037,0.1575302159045634,0.07458638940531274,0.01289983504861413,0.0,0.0,0.0,0.0]],
    "p": [0.0,0.0,0.0,0.0,0.0,0.0,0.0,0.0,0.0,0.0,0.0,0.0,0.0,0.0,0.0,0.0,0.0,0.0,0.0,0.0,0.0,0.0,0.0,0.0],
    "strategy": {
      "_type": "powermarket.agent.deviceagent.PointDemandBidStrategy",
      "solver_options": {}
    },
    "device": {
      "_type": "powermarket.device_kit.deviceset.DeviceSet",
      "id": "site4",
      "devices": [{
        "_type": "powermarket.device_kit.device.Device",
        "on": [0,23],
        "length": 24,
        "bounds": [[0.0,0.0],[0.0,0.0],[0.0,0.0],[0.0,0.0],[0.0,0.0],[0.0,0.0],[0.0,0.0],[0.25,0.25],[0.25,0.25],[0.35,0.35],[0.0,0.0],[0.0,0.0],[0.0,0.0],[0.0,0.0],[0.0,0.0],[0.0,0.0],[0.0,0.0],[0.0,0.0],[0.0,0.0],[0.0,0.0],[0.3,0.3],[0.3,0.3],[0.4,0.4],[0.1,0.1]],
        "cbounds": null,
        "id": "unsched"
      },{
        "sustainment": 0.92571,
        "_type": "powermarket.device_kit.tdevice.TDevice",
        "t_range": 4,
        "step": 0.12,
        "t_optimal": 3,
        "length": 24,
        "cbounds": [1.44,4.32],
        "on": [0,23],
        "bounds": [[0.0,0.24],[0.0,0.24],[0.0,0.24],[0.0,0.24],[0.0,0.24],[0.0,0.24],[0.0,0.24],[0.0,0.24],[0.0,0.24],[0.0,0.24],[0.0,0.24],[0.0,0.24],[0.0,0.24],[0.0,0.24],[0.0,0.24],[0.0,0.24],[0.0,0.24],[0.0,0.24],[0.0,0.24],[0.0,0.24],[0.0,0.24],[0.0,0.24],[0.0,0.24],[0.0,0.24]],
        "id": "fridge",
        "efficiency": -13,
        "levels": [0,2],
        "t_init": 3,
        "t_external": [24.0,24.0,24.0,24.0,24.0,24.0,24.0,24.0,24.0,24.0,24.0,24.0,24.0,24.0,24.0,24.0,24.0,24.0,24.0,24.0,24.0,24.0,24.0,24.0]
      },{
        "_type": "powermarket.device_kit.idevice2.IDevice2",
        "d_0": 0.04,
        "on": [17,22],
        "length": 24,
        "bounds": [[0.0,0.0],[0.0,0.0],[0.0,0.0],[0.0,0.0],[0.0,0.0],[0.0,0.0],[0.0,0.0],[0.0,0.0],[0.0,0.0],[0.0,0.0],[0.0,0.0],[0.0,0.0],[0.0,0.0],[0.0,0.0],[0.0,0.0],[0.0,0.0],[0.0,0.0],[0.05,0.2],[0.05,0.2],[0.05,0.2],[0.05,0.2],[0.05,0.2],[0.05,0.2],[0.0,0.0]],
        "cbounds": null,
        "id": "light"
      },{
        "_type": "powermarket.device_kit.cdevice2.CDevice2",
        "d_0": 0.04,
        "on": [0,4,18,23],
        "length": 24,
        "bounds": [[0.0,2.0],[0.0,2.0],[0.0,2.0],[0.0,2.0],[0.0,2.0],[0.0,0.0],[0.0,0.0],[0.0,0.0],[0.0,0.0],[0.0,0.0],[0.0,0.0],[0.0,0.0],[0.0,0.0],[0.0,0.0],[0.0,0.0],[0.0,0.0],[0.0,0.0],[0.0,0.0],[0.0,2.0],[0.0,2.0],[0.0,2.0],[0.0,2.0],[0.0,2.0],[0.0,2.0]],
        "cbounds": [4.5,6],
        "id": "ev"
      },{
        "_type": "powermarket.device_kit.device.Device",
        "step": 0.4,
        "on": [12,19],
        "length": 24,
        "bounds": [[0.0,0.0],[0.0,0.0],[0.0,0.0],[0.0,0.0],[0.0,0.0],[0.0,0.0],[0.0,0.0],[0.0,0.0],[0.0,0.0],[0.0,0.0],[0.0,0.0],[0.0,0.0],[0.0,1.2000000000000002],[0.0,1.2000000000000002],[0.0,1.2000000000000002],[0.0,1.2000000000000002],[0.0,1.2000000000000002],[0.0,1.2000000000000002],[0.0,1.2000000000000002],[0.0,1.2000000000000002],[0.0,0.0],[0.0,0.0],[0.0,0.0],[0.0,0.0]],
        "cbounds": [6.4,6.4],
        "id": "wpump",
        "levels": [0,3]
      },{
        "_type": "powermarket.device_kit.device.Device",
        "step": 1,
        "on": [8,19],
        "length": 24,
        "bounds": [[0.0,0.0],[0.0,0.0],[0.0,0.0],[0.0,0.0],[0.0,0.0],[0.0,0.0],[0.0,0.0],[0.0,0.0],[0.0,2.0],[0.0,2.0],[0.0,2.0],[0.0,2.0],[0.0,2.0],[0.0,2.0],[0.0,2.0],[0.0,2.0],[0.0,2.0],[0.0,2.0],[0.0,2.0],[0.0,2.0],[0.0,0.0],[0.0,0.0],[0.0,0.0],[0.0,0.0]],
        "cbounds": [8,8],
        "id": "machine",
        "levels": [0,2],
        "run_time": [4,5]
      }],
      "sbounds": null
    },
    "_type": "powermarket.agent.deviceagent.DeviceAgent"
  },{
    "s": [[0.0,0.0,0.0,0.0,0.0,0.25,0.25,0.35,0.0,0.0,0.0,0.0,0.0,0.0,0.0,0.0,0.0,0.0,0.3,0.3,0.4,0.1,0.0,0.0],[0.1198249515966108,0.11948118376823798,0.11683030225582124,0.12048302646558937,0.1190687197654324,0.12351400785097852,0.1179690562657557,0.12028712617777676,0.121886817147707,0.12282675619613813,0.11252251250905683,0.12153623291482799,0.11931079370681935,0.12277720163752069,0.11846030204046695,0.1209407766335738,0.11950923711063635,0.11716245873627769,0.12243901128659836,0.11889848911863583,0.12360596938110263,0.12067436794687643,0.11577512533638246,0.09378438989338624],[0.0,0.0,0.0,0.0,0.0,0.0,0.0,0.0,0.0,0.0,0.0,0.0,0.0,0.0,0.0,0.0,0.0,0.0,0.12018340035559087,0.115325096421977,0.11597087248649943,0.1162650209710705,0.11216015188546231,0.11457056872858618],[0.3980292685982,0.4743205647381491,0.4343871803337577,0.4766080605005439,0.46720757174909017,0.7935917406769719,0.9740427573773447,0.0,0.0,0.0,0.0,0.0,0.0,0.0,0.0,0.0,0.0,0.0,0.0,0.0,0.16893645680185176,0.375593492744099,0.22010203227328543,0.37758659291221797],[0.0,0.0,0.0,0.0,0.0,0.0,0.0,0.0,0.6144326277319727,1.1278786501349125,1.1701568208230573,1.1237769367055688,0.6175999024397972,0.5336155993657903,0.4533014765396965,0.3502989864274882,0.2696179023193567,0.1039008010185026,0.03014754097655105,0.0052727555171943235,0.0,0.0,0.0,0.0]],
    "p": [0.0,0.0,0.0,0.0,0.0,0.0,0.0,0.0,0.0,0.0,0.0,0.0,0.0,0.0,0.0,0.0,0.0,0.0,0.0,0.0,0.0,0.0,0.0,0.0],
    "strategy": {
      "_type": "powermarket.agent.deviceagent.PointDemandBidStrategy",
      "solver_options": {}
    },
    "device": {
      "_type": "powermarket.device_kit.deviceset.DeviceSet",
      "id": "site1",
      "devices": [{
        "_type": "powermarket.device_kit.device.Device",
        "on": [0,23],
        "length": 24,
        "bounds": [[0.0,0.0],[0.0,0.0],[0.0,0.0],[0.0,0.0],[0.0,0.0],[0.25,0.25],[0.25,0.25],[0.35,0.35],[0.0,0.0],[0.0,0.0],[0.0,0.0],[0.0,0.0],[0.0,0.0],[0.0,0.0],[0.0,0.0],[0.0,0.0],[0.0,0.0],[0.0,0.0],[0.3,0.3],[0.3,0.3],[0.4,0.4],[0.1,0.1],[0.0,0.0],[0.0,0.0]],
        "cbounds": null,
        "id": "unsched"
      },{
        "sustainment": 0.92571,
        "_type": "powermarket.device_kit.tdevice.TDevice",
        "t_range": 4,
        "step": 0.12,
        "t_optimal": 3,
        "length": 24,
        "cbounds": [1.44,4.32],
        "on": [0,23],
        "bounds": [[0.0,0.24],[0.0,0.24],[0.0,0.24],[0.0,0.24],[0.0,0.24],[0.0,0.24],[0.0,0.24],[0.0,0.24],[0.0,0.24],[0.0,0.24],[0.0,0.24],[0.0,0.24],[0.0,0.24],[0.0,0.24],[0.0,0.24],[0.0,0.24],[0.0,0.24],[0.0,0.24],[0.0,0.24],[0.0,0.24],[0.0,0.24],[0.0,0.24],[0.0,0.24],[0.0,0.24]],
        "id": "fridge",
        "efficiency": -13,
        "levels": [0,2],
        "t_init": 3,
        "t_external": [24.0,24.0,24.0,24.0,24.0,24.0,24.0,24.0,24.0,24.0,24.0,24.0,24.0,24.0,24.0,24.0,24.0,24.0,24.0,24.0,24.0,24.0,24.0,24.0]
      },{
        "_type": "powermarket.device_kit.idevice2.IDevice2",
        "d_0": 0.04,
        "on": [18,23],
        "length": 24,
        "bounds": [[0.0,0.0],[0.0,0.0],[0.0,0.0],[0.0,0.0],[0.0,0.0],[0.0,0.0],[0.0,0.0],[0.0,0.0],[0.0,0.0],[0.0,0.0],[0.0,0.0],[0.0,0.0],[0.0,0.0],[0.0,0.0],[0.0,0.0],[0.0,0.0],[0.0,0.0],[0.0,0.0],[0.05,0.2],[0.05,0.2],[0.05,0.2],[0.05,0.2],[0.05,0.2],[0.05,0.2]],
        "cbounds": null,
        "id": "light"
      },{
        "_type": "powermarket.device_kit.cdevice2.CDevice2",
        "d_0": 0.04,
        "on": [0,6,20,23],
        "length": 24,
        "bounds": [[0.0,2.0],[0.0,2.0],[0.0,2.0],[0.0,2.0],[0.0,2.0],[0.0,2.0],[0.0,2.0],[0.0,0.0],[0.0,0.0],[0.0,0.0],[0.0,0.0],[0.0,0.0],[0.0,0.0],[0.0,0.0],[0.0,0.0],[0.0,0.0],[0.0,0.0],[0.0,0.0],[0.0,0.0],[0.0,0.0],[0.0,2.0],[0.0,2.0],[0.0,2.0],[0.0,2.0]],
        "cbounds": [4.5,6],
        "id": "ev"
      },{
        "_type": "powermarket.device_kit.device.Device",
        "step": 0.4,
        "on": [8,19],
        "length": 24,
        "bounds": [[0.0,0.0],[0.0,0.0],[0.0,0.0],[0.0,0.0],[0.0,0.0],[0.0,0.0],[0.0,0.0],[0.0,0.0],[0.0,1.2000000000000002],[0.0,1.2000000000000002],[0.0,1.2000000000000002],[0.0,1.2000000000000002],[0.0,1.2000000000000002],[0.0,1.2000000000000002],[0.0,1.2000000000000002],[0.0,1.2000000000000002],[0.0,1.2000000000000002],[0.0,1.2000000000000002],[0.0,1.2000000000000002],[0.0,1.2000000000000002],[0.0,0.0],[0.0,0.0],[0.0,0.0],[0.0,0.0]],
        "cbounds": [6.4,6.4],
        "id": "wpump",
        "levels": [0,3]
      }],
      "sbounds": null
    },
    "_type": "powermarket.agent.deviceagent.DeviceAgent"
  },{
    "s": [[0.0,0.0,0.0,0.0,0.0,0.0,0.55,0.3,0.0,0.0,0.0,0.0,0.0,0.0,0.0,0.0,0.0,0.0,0.25,0.3,0.3,0.01,0.1,0.0],[0.1177227157060931,0.12121352300586873,0.1234746232263531,0.12023608419070231,0.1151285344471363,0.12171153117200527,0.11446517146398143,0.11937937183870051,0.12179394023203285,0.12552157681141263,0.11497108546549119,0.12290475424878061,0.12026318317445989,0.1229011121253967,0.11619282321042154,0.12002962738458096,0.11851734286030804,0.1165135215585537,0.12212010128065336,0.12071595970513181,0.1236857613354807,0.12126255566433197,0.11702292819308906,0.09360616140254484],[0.0,0.0,0.0,0.0,0.0,0.0,0.0,0.0,0.0,0.0,0.0,0.0,0.0,0.0,0.0,0.0,0.0,0.11717735579452251,0.12018340035573939,0.11532228467794514,0.11597087248648744,0.11626502097110486,0.11216015190655422,0.0],[0.509265681203019,0.5856484768956784,0.5456259431421594,0.5878468233088866,0.5785354839079174,0.0,0.0,0.0,0.0,0.0,0.0,0.0,0.0,0.0,0.0,0.0,0.0,0.0,0.43484678699600715,0.33746665036817014,0.27332226925822045,0.4868322555503508,0.3313407950830433,0.4888253557198509],[0.0,0.0,0.0,0.0,0.0,0.0,0.0,0.0,0.0,0.0,0.0,0.0,1.0613409461787622,1.1399619821221805,1.1051557921622697,1.00778771284602,0.9270073000018304,0.7432244709092343,0.3169672634458289,0.0985545323321914,0.0,0.0,0.0,0.0]],
    "p": [0.0,0.0,0.0,0.0,0.0,0.0,0.0,0.0,0.0,0.0,0.0,0.0,0.0,0.0,0.0,0.0,0.0,0.0,0.0,0.0,0.0,0.0,0.0,0.0],
    "strategy": {
      "_type": "powermarket.agent.deviceagent.PointDemandBidStrategy",
      "solver_options": {}
    },
    "device": {
      "_type": "powermarket.device_kit.deviceset.DeviceSet",
      "id": "site0",
      "devices": [{
        "_type": "powermarket.device_kit.device.Device",
        "on": [0,23],
        "length": 24,
        "bounds": [[0.0,0.0],[0.0,0.0],[0.0,0.0],[0.0,0.0],[0.0,0.0],[0.0,0.0],[0.55,0.55],[0.3,0.3],[0.0,0.0],[0.0,0.0],[0.0,0.0],[0.0,0.0],[0.0,0.0],[0.0,0.0],[0.0,0.0],[0.0,0.0],[0.0,0.0],[0.0,0.0],[0.25,0.25],[0.3,0.3],[0.3,0.3],[0.01,0.01],[0.1,0.1],[0.0,0.0]],
        "cbounds": null,
        "id": "unsched"
      },{
        "sustainment": 0.92571,
        "_type": "powermarket.device_kit.tdevice.TDevice",
        "t_range": 4,
        "step": 0.12,
        "t_optimal": 3,
        "length": 24,
        "cbounds": [1.44,4.32],
        "on": [0,23],
        "bounds": [[0.0,0.24],[0.0,0.24],[0.0,0.24],[0.0,0.24],[0.0,0.24],[0.0,0.24],[0.0,0.24],[0.0,0.24],[0.0,0.24],[0.0,0.24],[0.0,0.24],[0.0,0.24],[0.0,0.24],[0.0,0.24],[0.0,0.24],[0.0,0.24],[0.0,0.24],[0.0,0.24],[0.0,0.24],[0.0,0.24],[0.0,0.24],[0.0,0.24],[0.0,0.24],[0.0,0.24]],
        "id": "fridge",
        "efficiency": -13,
        "levels": [0,2],
        "t_init": 3,
        "t_external": [24.0,24.0,24.0,24.0,24.0,24.0,24.0,24.0,24.0,24.0,24.0,24.0,24.0,24.0,24.0,24.0,24.0,24.0,24.0,24.0,24.0,24.0,24.0,24.0]
      },{
        "_type": "powermarket.device_kit.idevice2.IDevice2",
        "d_0": 0.04,
        "on": [17,22],
        "length": 24,
        "bounds": [[0.0,0.0],[0.0,0.0],[0.0,0.0],[0.0,0.0],[0.0,0.0],[0.0,0.0],[0.0,0.0],[0.0,0.0],[0.0,0.0],[0.0,0.0],[0.0,0.0],[0.0,0.0],[0.0,0.0],[0.0,0.0],[0.0,0.0],[0.0,0.0],[0.0,0.0],[0.05,0.2],[0.05,0.2],[0.05,0.2],[0.05,0.2],[0.05,0.2],[0.05,0.2],[0.0,0.0]],
        "cbounds": null,
        "id": "light"
      },{
        "_type": "powermarket.device_kit.cdevice2.CDevice2",
        "d_0": 0.04,
        "on": [0,4,18,23],
        "length": 24,
        "bounds": [[0.0,2.0],[0.0,2.0],[0.0,2.0],[0.0,2.0],[0.0,2.0],[0.0,0.0],[0.0,0.0],[0.0,0.0],[0.0,0.0],[0.0,0.0],[0.0,0.0],[0.0,0.0],[0.0,0.0],[0.0,0.0],[0.0,0.0],[0.0,0.0],[0.0,0.0],[0.0,0.0],[0.0,2.0],[0.0,2.0],[0.0,2.0],[0.0,2.0],[0.0,2.0],[0.0,2.0]],
        "cbounds": [4.5,6],
        "id": "ev"
      },{
        "_type": "powermarket.device_kit.device.Device",
        "step": 0.4,
        "on": [12,19],
        "length": 24,
        "bounds": [[0.0,0.0],[0.0,0.0],[0.0,0.0],[0.0,0.0],[0.0,0.0],[0.0,0.0],[0.0,0.0],[0.0,0.0],[0.0,0.0],[0.0,0.0],[0.0,0.0],[0.0,0.0],[0.0,1.2000000000000002],[0.0,1.2000000000000002],[0.0,1.2000000000000002],[0.0,1.2000000000000002],[0.0,1.2000000000000002],[0.0,1.2000000000000002],[0.0,1.2000000000000002],[0.0,1.2000000000000002],[0.0,0.0],[0.0,0.0],[0.0,0.0],[0.0,0.0]],
        "cbounds": [6.4,6.4],
        "id": "wpump",
        "levels": [0,3]
      }],
      "sbounds": null
    },
    "_type": "powermarket.agent.deviceagent.DeviceAgent"
  },{
    "s": [[0.02,0.02,0.02,0.02,0.25,0.35,0.02,0.02,0.02,0.02,0.02,0.02,0.2,0.02,0.02,0.55,0.3,0.2,0.02,0.02,0.02,0.02,0.02,0.02],[0.11556868471332596,0.11825111232350309,0.12051072609946495,0.12253844708962876,0.11983321495367107,0.12199889131047922,0.117007868320235,0.11995058006288889,0.12302958953627761,0.12286859939689901,0.1133817551543709,0.11907447348183596,0.11949103444240904,0.12128027507627001,0.11878406850823775,0.12063090333484225,0.12101330145671882,0.12075763448756528,0.1231682133012039,0.11852265724218444,0.1201623360411289,0.11845251505272525,0.11656342200814139,0.0926440810383092],[0.0,0.0,0.0,0.0,0.0,0.0,0.0,0.0,0.0,0.0,0.0,0.0,0.0,0.0,0.0,0.0,0.0,0.11717735579474457,0.12018340035558014,0.11527724596938652,0.11597087248647908,0.11626502097111178,0.11216015188547239,0.0],[0.509286045741774,0.5855773418786421,0.5456503909236764,0.5878712710896835,0.5788303471063421,0.0,0.0,0.0,0.0,0.0,0.0,0.0,0.0,0.0,0.0,0.0,0.0,0.0,0.4348843943735842,0.33723696071790166,0.27334671703788715,0.4868567033344027,0.3313652428638169,0.48884980350241264],[0.0,0.0,0.0,0.0,0.0,0.0,0.0,0.0,0.6144684094426269,1.1278912071998055,1.1701599130318023,1.123782555838416,0.6176356841485363,0.5336513810769432,0.4533372582506151,0.3503347681383346,0.2694044568146928,0.10389942221712471,0.03016033617647515,0.005274607664066606,0.0,0.0,0.0,0.0],[0.0,0.0,0.0,0.0,0.0,0.0,0.0,0.0,0.6843042610939091,1.3929871070303494,1.5730681985158597,1.5310281115690176,0.6874715358018846,0.6034872327306127,0.5231731099049985,0.42017061979164005,0.33928269335823535,0.15753895188165218,0.07459419558566766,0.012893982735828159,0.0,0.0,0.0,0.0]],
    "p": [0.0,0.0,0.0,0.0,0.0,0.0,0.0,0.0,0.0,0.0,0.0,0.0,0.0,0.0,0.0,0.0,0.0,0.0,0.0,0.0,0.0,0.0,0.0,0.0],
    "strategy": {
      "_type": "powermarket.agent.deviceagent.PointDemandBidStrategy",
      "solver_options": {}
    },
    "device": {
      "_type": "powermarket.device_kit.deviceset.DeviceSet",
      "id": "site5",
      "devices": [{
        "_type": "powermarket.device_kit.device.Device",
        "on": [0,23],
        "length": 24,
        "bounds": [[0.02,0.02],[0.02,0.02],[0.02,0.02],[0.02,0.02],[0.25,0.25],[0.35,0.35],[0.02,0.02],[0.02,0.02],[0.02,0.02],[0.02,0.02],[0.02,0.02],[0.02,0.02],[0.2,0.2],[0.02,0.02],[0.02,0.02],[0.55,0.55],[0.3,0.3],[0.2,0.2],[0.02,0.02],[0.02,0.02],[0.02,0.02],[0.02,0.02],[0.02,0.02],[0.02,0.02]],
        "cbounds": null,
        "id": "unsched"
      },{
        "sustainment": 0.92571,
        "_type": "powermarket.device_kit.tdevice.TDevice",
        "t_range": 4,
        "step": 0.12,
        "t_optimal": 3,
        "length": 24,
        "cbounds": [1.44,4.32],
        "on": [0,23],
        "bounds": [[0.0,0.24],[0.0,0.24],[0.0,0.24],[0.0,0.24],[0.0,0.24],[0.0,0.24],[0.0,0.24],[0.0,0.24],[0.0,0.24],[0.0,0.24],[0.0,0.24],[0.0,0.24],[0.0,0.24],[0.0,0.24],[0.0,0.24],[0.0,0.24],[0.0,0.24],[0.0,0.24],[0.0,0.24],[0.0,0.24],[0.0,0.24],[0.0,0.24],[0.0,0.24],[0.0,0.24]],
        "id": "fridge",
        "efficiency": -13,
        "levels": [0,2],
        "t_init": 3,
        "t_external": [24.0,24.0,24.0,24.0,24.0,24.0,24.0,24.0,24.0,24.0,24.0,24.0,24.0,24.0,24.0,24.0,24.0,24.0,24.0,24.0,24.0,24.0,24.0,24.0]
      },{
        "_type": "powermarket.device_kit.idevice2.IDevice2",
        "d_0": 0.04,
        "on": [17,22],
        "length": 24,
        "bounds": [[0.0,0.0],[0.0,0.0],[0.0,0.0],[0.0,0.0],[0.0,0.0],[0.0,0.0],[0.0,0.0],[0.0,0.0],[0.0,0.0],[0.0,0.0],[0.0,0.0],[0.0,0.0],[0.0,0.0],[0.0,0.0],[0.0,0.0],[0.0,0.0],[0.0,0.0],[0.05,0.2],[0.05,0.2],[0.05,0.2],[0.05,0.2],[0.05,0.2],[0.05,0.2],[0.0,0.0]],
        "cbounds": null,
        "id": "light"
      },{
        "_type": "powermarket.device_kit.cdevice2.CDevice2",
        "d_0": 0.04,
        "on": [0,4,18,23],
        "length": 24,
        "bounds": [[0.0,2.0],[0.0,2.0],[0.0,2.0],[0.0,2.0],[0.0,2.0],[0.0,0.0],[0.0,0.0],[0.0,0.0],[0.0,0.0],[0.0,0.0],[0.0,0.0],[0.0,0.0],[0.0,0.0],[0.0,0.0],[0.0,0.0],[0.0,0.0],[0.0,0.0],[0.0,0.0],[0.0,2.0],[0.0,2.0],[0.0,2.0],[0.0,2.0],[0.0,2.0],[0.0,2.0]],
        "cbounds": [4.5,6],
        "id": "ev"
      },{
        "_type": "powermarket.device_kit.device.Device",
        "step": 0.4,
        "on": [8,19],
        "length": 24,
        "bounds": [[0.0,0.0],[0.0,0.0],[0.0,0.0],[0.0,0.0],[0.0,0.0],[0.0,0.0],[0.0,0.0],[0.0,0.0],[0.0,1.2000000000000002],[0.0,1.2000000000000002],[0.0,1.2000000000000002],[0.0,1.2000000000000002],[0.0,1.2000000000000002],[0.0,1.2000000000000002],[0.0,1.2000000000000002],[0.0,1.2000000000000002],[0.0,1.2000000000000002],[0.0,1.2000000000000002],[0.0,1.2000000000000002],[0.0,1.2000000000000002],[0.0,0.0],[0.0,0.0],[0.0,0.0],[0.0,0.0]],
        "cbounds": [6.4,6.4],
        "id": "wpump",
        "levels": [0,3]
      },{
        "_type": "powermarket.device_kit.device.Device",
        "step": 1,
        "on": [8,19],
        "length": 24,
        "bounds": [[0.0,0.0],[0.0,0.0],[0.0,0.0],[0.0,0.0],[0.0,0.0],[0.0,0.0],[0.0,0.0],[0.0,0.0],[0.0,2.0],[0.0,2.0],[0.0,2.0],[0.0,2.0],[0.0,2.0],[0.0,2.0],[0.0,2.0],[0.0,2.0],[0.0,2.0],[0.0,2.0],[0.0,2.0],[0.0,2.0],[0.0,0.0],[0.0,0.0],[0.0,0.0],[0.0,0.0]],
        "cbounds": [8,8],
        "id": "machine",
        "levels": [0,2],
        "run_time": [4,5]
      }],
      "sbounds": null
    },
    "_type": "powermarket.agent.deviceagent.DeviceAgent"
  },{
    "s": [[0.0,0.0,0.0,0.0,0.0,0.0,0.25,0.55,0.15,0.1,0.1,0.2,0.0,0.0,0.0,0.0,0.1,0.15,0.1,0.2,0.3,0.1,0.0,0.0],[0.11565726115149795,0.12272492496151044,0.11932703846603626,0.11984547525088929,0.11690600912424409,0.12090682382369652,0.12036869501514276,0.12160161489374828,0.11966198616748285,0.12473340622311561,0.11272304977823738,0.12048224709527419,0.11949986905635648,0.12088374404965462,0.11816814793534909,0.12334656232806585,0.12205702601863888,0.11581448791930746,0.1199521387162269,0.12337712053756704,0.11982912045409978,0.11807888606141487,0.1178898457623764,0.09369071235211936],[0.10864196928357395,0.0,0.0,0.0,0.0,0.0,0.0,0.0,0.0,0.0,0.0,0.0,0.0,0.0,0.0,0.0,0.0,0.0,0.0,0.11535555775490906,0.11597087248656408,0.1162650209710459,0.11216015190646467,0.1145705687286111],[0.18474026612658354,0.26111162437481517,0.22110448077743383,0.2633253609440667,0.25436462959843315,0.5803090411202841,0.7607600578212023,1.317087969169097,1.0635656452255546,0.0,0.0,0.0,0.0,0.0,0.0,0.0,0.0,0.0,0.0,0.0,0.0,0.0,0.09175877859147172,0.16430389335639767],[0.0,0.0,0.0,0.0,0.0,0.0,0.0,0.0,0.0,0.0,0.0,0.0,1.0613346193563504,1.1399606184021287,1.1051200126449297,1.0077344416749023,0.9271261531912214,0.7431711997360702,0.31699461708227944,0.09855833791023741,0.0,0.0,0.0,0.0]],
    "p": [0.0,0.0,0.0,0.0,0.0,0.0,0.0,0.0,0.0,0.0,0.0,0.0,0.0,0.0,0.0,0.0,0.0,0.0,0.0,0.0,0.0,0.0,0.0,0.0],
    "strategy": {
      "_type": "powermarket.agent.deviceagent.PointDemandBidStrategy",
      "solver_options": {}
    },
    "device": {
      "_type": "powermarket.device_kit.deviceset.DeviceSet",
      "id": "site2",
      "devices": [{
        "_type": "powermarket.device_kit.device.Device",
        "on": [0,23],
        "length": 24,
        "bounds": [[0.0,0.0],[0.0,0.0],[0.0,0.0],[0.0,0.0],[0.0,0.0],[0.0,0.0],[0.25,0.25],[0.55,0.55],[0.15,0.15],[0.1,0.1],[0.1,0.1],[0.2,0.2],[0.0,0.0],[0.0,0.0],[0.0,0.0],[0.0,0.0],[0.1,0.1],[0.15,0.15],[0.1,0.1],[0.2,0.2],[0.3,0.3],[0.1,0.1],[0.0,0.0],[0.0,0.0]],
        "cbounds": null,
        "id": "unsched"
      },{
        "sustainment": 0.92571,
        "_type": "powermarket.device_kit.tdevice.TDevice",
        "t_range": 4,
        "step": 0.12,
        "t_optimal": 3,
        "length": 24,
        "cbounds": [1.44,4.32],
        "on": [0,23],
        "bounds": [[0.0,0.24],[0.0,0.24],[0.0,0.24],[0.0,0.24],[0.0,0.24],[0.0,0.24],[0.0,0.24],[0.0,0.24],[0.0,0.24],[0.0,0.24],[0.0,0.24],[0.0,0.24],[0.0,0.24],[0.0,0.24],[0.0,0.24],[0.0,0.24],[0.0,0.24],[0.0,0.24],[0.0,0.24],[0.0,0.24],[0.0,0.24],[0.0,0.24],[0.0,0.24],[0.0,0.24]],
        "id": "fridge",
        "efficiency": -13,
        "levels": [0,2],
        "t_init": 3,
        "t_external": [24.0,24.0,24.0,24.0,24.0,24.0,24.0,24.0,24.0,24.0,24.0,24.0,24.0,24.0,24.0,24.0,24.0,24.0,24.0,24.0,24.0,24.0,24.0,24.0]
      },{
        "_type": "powermarket.device_kit.idevice2.IDevice2",
        "d_0": 0.04,
        "on": [0,0,19,23],
        "length": 24,
        "bounds": [[0.05,0.2],[0.0,0.0],[0.0,0.0],[0.0,0.0],[0.0,0.0],[0.0,0.0],[0.0,0.0],[0.0,0.0],[0.0,0.0],[0.0,0.0],[0.0,0.0],[0.0,0.0],[0.0,0.0],[0.0,0.0],[0.0,0.0],[0.0,0.0],[0.0,0.0],[0.0,0.0],[0.0,0.0],[0.05,0.2],[0.05,0.2],[0.05,0.2],[0.05,0.2],[0.05,0.2]],
        "cbounds": null,
        "id": "light"
      },{
        "_type": "powermarket.device_kit.cdevice2.CDevice2",
        "d_0": 0.04,
        "on": [0,8,22,23],
        "length": 24,
        "bounds": [[0.0,2.0],[0.0,2.0],[0.0,2.0],[0.0,2.0],[0.0,2.0],[0.0,2.0],[0.0,2.0],[0.0,2.0],[0.0,2.0],[0.0,0.0],[0.0,0.0],[0.0,0.0],[0.0,0.0],[0.0,0.0],[0.0,0.0],[0.0,0.0],[0.0,0.0],[0.0,0.0],[0.0,0.0],[0.0,0.0],[0.0,0.0],[0.0,0.0],[0.0,2.0],[0.0,2.0]],
        "cbounds": [4.5,6],
        "id": "ev"
      },{
        "_type": "powermarket.device_kit.device.Device",
        "step": 0.4,
        "on": [12,19],
        "length": 24,
        "bounds": [[0.0,0.0],[0.0,0.0],[0.0,0.0],[0.0,0.0],[0.0,0.0],[0.0,0.0],[0.0,0.0],[0.0,0.0],[0.0,0.0],[0.0,0.0],[0.0,0.0],[0.0,0.0],[0.0,1.2000000000000002],[0.0,1.2000000000000002],[0.0,1.2000000000000002],[0.0,1.2000000000000002],[0.0,1.2000000000000002],[0.0,1.2000000000000002],[0.0,1.2000000000000002],[0.0,1.2000000000000002],[0.0,0.0],[0.0,0.0],[0.0,0.0],[0.0,0.0]],
        "cbounds": [6.4,6.4],
        "id": "wpump",
        "levels": [0,3]
      }],
      "sbounds": null
    },
    "_type": "powermarket.agent.deviceagent.DeviceAgent"
  },{
    "s": [[0.0,0.0,0.0,0.0,0.0,0.0,0.0,0.3,0.0,0.0,0.0,0.0,0.1,0.4,0.25,0.0,0.0,0.25,0.3,0.35,0.1,0.0,0.0,0.0],[0.11696548283321702,0.12097292457671083,0.1224356030425622,0.12034853294997784,0.11806333751367139,0.12136704251484964,0.11756827700876944,0.1188141135142553,0.11810237437732614,0.12212303341249099,0.11628182942649548,0.12431350074853953,0.12218628964973285,0.11737318208371335,0.11823679121432056,0.12227931099159074,0.11721210063898616,0.11904625672984677,0.12267715117027705,0.11921400268834506,0.12231049511165505,0.11969838385738513,0.1165629348412314,0.09591472267747544],[0.10864201231825454,0.0,0.0,0.0,0.0,0.0,0.0,0.0,0.0,0.0,0.0,0.0,0.0,0.0,0.0,0.0,0.0,0.0,0.0,0.11531070785358855,0.11597071430808321,0.11626495826129625,0.11216057148597869,0.11457075910413475],[0.18471994662808708,0.26134292864936803,0.22108453660089003,0.26330541676759567,0.2542299356591627,0.5802890969425377,0.7607401136434105,1.3170680249901456,1.063545701048974,0.0,0.0,0.0,0.0,0.0,0.0,0.0,0.0,0.0,0.0,0.0,0.0,0.0,0.09174990736430677,0.16428394917895783],[0.0,0.0,0.0,0.0,0.0,0.0,0.0,0.0,0.0,0.0,0.0,0.0,1.061336950677054,1.1399599613140194,1.1051492055732044,1.0077774894677325,0.9269792959923981,0.7432142475304624,0.31703075899008115,0.09855209045319348,0.0,0.0,0.0,0.0],[0.24790724734270467,0.2538407646149063,0.24931423214375847,0.2443785686164013,0.24867427986059,0.25308721057728323,0.24880349446089156,0.25151793785502125,0.24924970904021265,0.2532226948121439,0.2429348649489305,0.25451369661900125,0.2519869688661414,0.2501647990732887,0.24654739539761825,0.24692018012867215,0.25091686782633627,0.2502846602455047,0.2533246607957125,0.2464256701206304,0.25238464466398786,0.251108629776076,0.24701197209796139,0.2239536791134651]],
    "p": [0.0,0.0,0.0,0.0,0.0,0.0,0.0,0.0,0.0,0.0,0.0,0.0,0.0,0.0,0.0,0.0,0.0,0.0,0.0,0.0,0.0,0.0,0.0,0.0],
    "strategy": {
      "_type": "powermarket.agent.deviceagent.PointDemandBidStrategy",
      "solver_options": {}
    },
    "device": {
      "_type": "powermarket.device_kit.deviceset.DeviceSet",
      "id": "site6",
      "devices": [{
        "_type": "powermarket.device_kit.device.Device",
        "on": [0,23],
        "length": 24,
        "bounds": [[0.0,0.0],[0.0,0.0],[0.0,0.0],[0.0,0.0],[0.0,0.0],[0.0,0.0],[0.0,0.0],[0.3,0.3],[0.0,0.0],[0.0,0.0],[0.0,0.0],[0.0,0.0],[0.1,0.1],[0.4,0.4],[0.25,0.25],[0.0,0.0],[0.0,0.0],[0.25,0.25],[0.3,0.3],[0.35,0.35],[0.1,0.1],[0.0,0.0],[0.0,0.0],[0.0,0.0]],
        "cbounds": null,
        "id": "unsched"
      },{
        "sustainment": 0.92571,
        "_type": "powermarket.device_kit.tdevice.TDevice",
        "t_range": 4,
        "step": 0.12,
        "t_optimal": 3,
        "length": 24,
        "cbounds": [1.44,4.32],
        "on": [0,23],
        "bounds": [[0.0,0.24],[0.0,0.24],[0.0,0.24],[0.0,0.24],[0.0,0.24],[0.0,0.24],[0.0,0.24],[0.0,0.24],[0.0,0.24],[0.0,0.24],[0.0,0.24],[0.0,0.24],[0.0,0.24],[0.0,0.24],[0.0,0.24],[0.0,0.24],[0.0,0.24],[0.0,0.24],[0.0,0.24],[0.0,0.24],[0.0,0.24],[0.0,0.24],[0.0,0.24],[0.0,0.24]],
        "id": "fridge",
        "efficiency": -13,
        "levels": [0,2],
        "t_init": 3,
        "t_external": [24.0,24.0,24.0,24.0,24.0,24.0,24.0,24.0,24.0,24.0,24.0,24.0,24.0,24.0,24.0,24.0,24.0,24.0,24.0,24.0,24.0,24.0,24.0,24.0]
      },{
        "_type": "powermarket.device_kit.idevice2.IDevice2",
        "d_0": 0.04,
        "on": [0,0,19,23],
        "length": 24,
        "bounds": [[0.05,0.2],[0.0,0.0],[0.0,0.0],[0.0,0.0],[0.0,0.0],[0.0,0.0],[0.0,0.0],[0.0,0.0],[0.0,0.0],[0.0,0.0],[0.0,0.0],[0.0,0.0],[0.0,0.0],[0.0,0.0],[0.0,0.0],[0.0,0.0],[0.0,0.0],[0.0,0.0],[0.0,0.0],[0.05,0.2],[0.05,0.2],[0.05,0.2],[0.05,0.2],[0.05,0.2]],
        "cbounds": null,
        "id": "light"
      },{
        "_type": "powermarket.device_kit.cdevice2.CDevice2",
        "d_0": 0.04,
        "on": [0,8,22,23],
        "length": 24,
        "bounds": [[0.0,2.0],[0.0,2.0],[0.0,2.0],[0.0,2.0],[0.0,2.0],[0.0,2.0],[0.0,2.0],[0.0,2.0],[0.0,2.0],[0.0,0.0],[0.0,0.0],[0.0,0.0],[0.0,0.0],[0.0,0.0],[0.0,0.0],[0.0,0.0],[0.0,0.0],[0.0,0.0],[0.0,0.0],[0.0,0.0],[0.0,0.0],[0.0,0.0],[0.0,2.0],[0.0,2.0]],
        "cbounds": [4.5,6],
        "id": "ev"
      },{
        "_type": "powermarket.device_kit.device.Device",
        "step": 0.4,
        "on": [12,19],
        "length": 24,
        "bounds": [[0.0,0.0],[0.0,0.0],[0.0,0.0],[0.0,0.0],[0.0,0.0],[0.0,0.0],[0.0,0.0],[0.0,0.0],[0.0,0.0],[0.0,0.0],[0.0,0.0],[0.0,0.0],[0.0,1.2000000000000002],[0.0,1.2000000000000002],[0.0,1.2000000000000002],[0.0,1.2000000000000002],[0.0,1.2000000000000002],[0.0,1.2000000000000002],[0.0,1.2000000000000002],[0.0,1.2000000000000002],[0.0,0.0],[0.0,0.0],[0.0,0.0],[0.0,0.0]],
        "cbounds": [6.4,6.4],
        "id": "wpump",
        "levels": [0,3]
      },{
        "sustainment": 0.92857,
        "_type": "powermarket.device_kit.tdevice.TDevice",
        "t_range": 4,
        "step": 0.25,
        "t_optimal": -18,
        "length": 24,
        "cbounds": [3.0,9.0],
        "on": [0,23],
        "bounds": [[0.0,0.5],[0.0,0.5],[0.0,0.5],[0.0,0.5],[0.0,0.5],[0.0,0.5],[0.0,0.5],[0.0,0.5],[0.0,0.5],[0.0,0.5],[0.0,0.5],[0.0,0.5],[0.0,0.5],[0.0,0.5],[0.0,0.5],[0.0,0.5],[0.0,0.5],[0.0,0.5],[0.0,0.5],[0.0,0.5],[0.0,0.5],[0.0,0.5],[0.0,0.5],[0.0,0.5]],
        "id": "freezer",
        "efficiency": -12,
        "levels": [0,2],
        "t_init": -18,
        "t_external": [24.0,24.0,24.0,24.0,24.0,24.0,24.0,24.0,24.0,24.0,24.0,24.0,24.0,24.0,24.0,24.0,24.0,24.0,24.0,24.0,24.0,24.0,24.0,24.0]
      }],
      "sbounds": null
    },
    "_type": "powermarket.agent.deviceagent.DeviceAgent"
  },{
    "s": [[0.0,0.0,0.0,0.0,0.0,0.0,0.0,0.55,0.3,0.0,0.0,0.0,0.0,0.0,0.0,0.0,0.0,0.0,0.0,0.25,0.3,0.3,0.01,0.1],[0.116104135567689,0.12086635725299065,0.12109922528860742,0.11804845576725342,0.12088084160307089,0.12181153812607166,0.11702792987513648,0.11951987742874975,0.12077284576900617,0.12409073362566152,0.1155710468871742,0.1221395521611938,0.11737798267621742,0.12003322505882834,0.11965342546009329,0.12064912682556701,0.11948854418245582,0.12077268836782262,0.12116042257272415,0.12019348109804097,0.1191869527608635,0.11727796760612168,0.12110758482937563,0.09748854014769523],[0.0,0.0,0.0,0.0,0.0,0.0,0.0,0.0,0.0,0.0,0.0,0.0,0.0,0.0,0.0,0.0,0.0,0.0,0.120183400355738,0.11532599234329907,0.11597087248670723,0.11626502097093629,0.11216015188528249,0.11457056872854181],[0.39789146688590304,0.47460594845996984,0.434249164460536,0.47647004462564135,0.4671269572591041,0.7934537248029363,0.9739047415022024,0.0,0.0,0.0,0.0,0.0,0.0,0.0,0.0,0.0,0.0,0.0,0.0,0.0,0.1688031801100683,0.37545547686736713,0.2199640163987771,0.37744857703998236],[0.0,0.0,0.0,0.0,0.0,0.0,0.0,0.0,0.6144604330018917,1.1278921284858456,1.1701594893182183,1.1237846919518297,0.6176277077087505,0.5336434046355847,0.45332928180963616,0.35032679169532704,0.2694507238194953,0.10390431513092388,0.030150520667920934,0.005270511773895366,0.0,0.0,0.0,0.0]],
    "p": [0.0,0.0,0.0,0.0,0.0,0.0,0.0,0.0,0.0,0.0,0.0,0.0,0.0,0.0,0.0,0.0,0.0,0.0,0.0,0.0,0.0,0.0,0.0,0.0],
    "strategy": {
      "_type": "powermarket.agent.deviceagent.PointDemandBidStrategy",
      "solver_options": {}
    },
    "device": {
      "_type": "powermarket.device_kit.deviceset.DeviceSet",
      "id": "site3",
      "devices": [{
        "_type": "powermarket.device_kit.device.Device",
        "on": [0,23],
        "length": 24,
        "bounds": [[0.0,0.0],[0.0,0.0],[0.0,0.0],[0.0,0.0],[0.0,0.0],[0.0,0.0],[0.0,0.0],[0.55,0.55],[0.3,0.3],[0.0,0.0],[0.0,0.0],[0.0,0.0],[0.0,0.0],[0.0,0.0],[0.0,0.0],[0.0,0.0],[0.0,0.0],[0.0,0.0],[0.0,0.0],[0.25,0.25],[0.3,0.3],[0.3,0.3],[0.01,0.01],[0.1,0.1]],
        "cbounds": null,
        "id": "unsched"
      },{
        "sustainment": 0.92571,
        "_type": "powermarket.device_kit.tdevice.TDevice",
        "t_range": 4,
        "step": 0.12,
        "t_optimal": 3,
        "length": 24,
        "cbounds": [1.44,4.32],
        "on": [0,23],
        "bounds": [[0.0,0.24],[0.0,0.24],[0.0,0.24],[0.0,0.24],[0.0,0.24],[0.0,0.24],[0.0,0.24],[0.0,0.24],[0.0,0.24],[0.0,0.24],[0.0,0.24],[0.0,0.24],[0.0,0.24],[0.0,0.24],[0.0,0.24],[0.0,0.24],[0.0,0.24],[0.0,0.24],[0.0,0.24],[0.0,0.24],[0.0,0.24],[0.0,0.24],[0.0,0.24],[0.0,0.24]],
        "id": "fridge",
        "efficiency": -13,
        "levels": [0,2],
        "t_init": 3,
        "t_external": [24.0,24.0,24.0,24.0,24.0,24.0,24.0,24.0,24.0,24.0,24.0,24.0,24.0,24.0,24.0,24.0,24.0,24.0,24.0,24.0,24.0,24.0,24.0,24.0]
      },{
        "_type": "powermarket.device_kit.idevice2.IDevice2",
        "d_0": 0.04,
        "on": [18,23],
        "length": 24,
        "bounds": [[0.0,0.0],[0.0,0.0],[0.0,0.0],[0.0,0.0],[0.0,0.0],[0.0,0.0],[0.0,0.0],[0.0,0.0],[0.0,0.0],[0.0,0.0],[0.0,0.0],[0.0,0.0],[0.0,0.0],[0.0,0.0],[0.0,0.0],[0.0,0.0],[0.0,0.0],[0.0,0.0],[0.05,0.2],[0.05,0.2],[0.05,0.2],[0.05,0.2],[0.05,0.2],[0.05,0.2]],
        "cbounds": null,
        "id": "light"
      },{
        "_type": "powermarket.device_kit.cdevice2.CDevice2",
        "d_0": 0.04,
        "on": [0,6,20,23],
        "length": 24,
        "bounds": [[0.0,2.0],[0.0,2.0],[0.0,2.0],[0.0,2.0],[0.0,2.0],[0.0,2.0],[0.0,2.0],[0.0,0.0],[0.0,0.0],[0.0,0.0],[0.0,0.0],[0.0,0.0],[0.0,0.0],[0.0,0.0],[0.0,0.0],[0.0,0.0],[0.0,0.0],[0.0,0.0],[0.0,0.0],[0.0,0.0],[0.0,2.0],[0.0,2.0],[0.0,2.0],[0.0,2.0]],
        "cbounds": [4.5,6],
        "id": "ev"
      },{
        "_type": "powermarket.device_kit.device.Device",
        "step": 0.4,
        "on": [8,19],
        "length": 24,
        "bounds": [[0.0,0.0],[0.0,0.0],[0.0,0.0],[0.0,0.0],[0.0,0.0],[0.0,0.0],[0.0,0.0],[0.0,0.0],[0.0,1.2000000000000002],[0.0,1.2000000000000002],[0.0,1.2000000000000002],[0.0,1.2000000000000002],[0.0,1.2000000000000002],[0.0,1.2000000000000002],[0.0,1.2000000000000002],[0.0,1.2000000000000002],[0.0,1.2000000000000002],[0.0,1.2000000000000002],[0.0,1.2000000000000002],[0.0,1.2000000000000002],[0.0,0.0],[0.0,0.0],[0.0,0.0],[0.0,0.0]],
        "cbounds": [6.4,6.4],
        "id": "wpump",
        "levels": [0,3]
      }],
      "sbounds": null
    },
    "_type": "powermarket.agent.deviceagent.DeviceAgent"
  },{
    "s": [[0.05,0.05,0.05,0.05,0.05,0.2,0.05,0.2,0.0,0.0,0.0,0.1,0.1,0.0,0.0,0.0,0.1,0.55,0.0,0.1,0.1,0.15,0.25,0.0],[0.116673332601191,0.12401729528959998,0.11969260296044858,0.11974145046325703,0.11590666410121155,0.11966362506905727,0.12029817656787936,0.12152319007079311,0.118568073884416,0.12377830267098812,0.11653704926746712,0.1227481238939757,0.11692337594561684,0.1207651295909023,0.11711089889888222,0.12214495633194387,0.12060472129249782,0.11820678741370787,0.12246552780465514,0.11991967999108562,0.11852106818647444,0.12006446415525264,0.11991370604788307,0.09685900727541734],[0.10864201231818345,0.0,0.0,0.0,0.0,0.0,0.0,0.0,0.0,0.0,0.0,0.0,0.0,0.0,0.0,0.0,0.0,0.0,0.0,0.11532683444157805,0.11597071430812533,0.11626495826121297,0.11216057148600028,0.11457075910400104],[0.18473324014330653,0.2614820340479706,0.22109596774241522,0.2633168479079175,0.254003042847243,0.5803005280850273,0.7607515447833421,1.3170794561308825,1.0635571321906212,0.0,0.0,0.0,0.0,0.0,0.0,0.0,0.0,0.0,0.0,0.0,0.0,0.0,0.09175248920399576,0.1642953803198299],[0.0,0.0,0.0,0.0,0.0,0.0,0.0,0.0,0.6144533148444133,1.127889267643154,1.1701588692423948,1.123783258878996,0.6176205895523135,0.5336362864777232,0.45332216365190636,0.35031967353865273,0.2694924461352141,0.10390397285579128,0.030149711787776857,0.005270445391938728,0.0,0.0,0.0,0.0],[0.25068955423593475,0.2479267378054792,0.2507297653854069,0.24760838299388707,0.24725426765797104,0.2585681618054928,0.24914975110865947,0.24189420556760458,0.24373459762675745,0.2627407211097368,0.2441954894742342,0.2565214549911901,0.2447050790822623,0.2507737295418797,0.25319884831926137,0.24749137308401917,0.24613662630625513,0.2512658875657714,0.25392253628816863,0.24536630489646397,0.25373221771791976,0.2532234065009879,0.24316829931568418,0.22471846375793258]],
    "p": [0.0,0.0,0.0,0.0,0.0,0.0,0.0,0.0,0.0,0.0,0.0,0.0,0.0,0.0,0.0,0.0,0.0,0.0,0.0,0.0,0.0,0.0,0.0,0.0],
    "strategy": {
      "_type": "powermarket.agent.deviceagent.PointDemandBidStrategy",
      "solver_options": {}
    },
    "device": {
      "_type": "powermarket.device_kit.deviceset.DeviceSet",
      "id": "site7",
      "devices": [{
        "_type": "powermarket.device_kit.device.Device",
        "on": [0,23],
        "length": 24,
        "bounds": [[0.05,0.05],[0.05,0.05],[0.05,0.05],[0.05,0.05],[0.05,0.05],[0.2,0.2],[0.05,0.05],[0.2,0.2],[0.0,0.0],[0.0,0.0],[0.0,0.0],[0.1,0.1],[0.1,0.1],[0.0,0.0],[0.0,0.0],[0.0,0.0],[0.1,0.1],[0.55,0.55],[0.0,0.0],[0.1,0.1],[0.1,0.1],[0.15,0.15],[0.25,0.25],[0.0,0.0]],
        "cbounds": null,
        "id": "unsched"
      },{
        "sustainment": 0.92571,
        "_type": "powermarket.device_kit.tdevice.TDevice",
        "t_range": 4,
        "step": 0.12,
        "t_optimal": 3,
        "length": 24,
        "cbounds": [1.44,4.32],
        "on": [0,23],
        "bounds": [[0.0,0.24],[0.0,0.24],[0.0,0.24],[0.0,0.24],[0.0,0.24],[0.0,0.24],[0.0,0.24],[0.0,0.24],[0.0,0.24],[0.0,0.24],[0.0,0.24],[0.0,0.24],[0.0,0.24],[0.0,0.24],[0.0,0.24],[0.0,0.24],[0.0,0.24],[0.0,0.24],[0.0,0.24],[0.0,0.24],[0.0,0.24],[0.0,0.24],[0.0,0.24],[0.0,0.24]],
        "id": "fridge",
        "efficiency": -13,
        "levels": [0,2],
        "t_init": 3,
        "t_external": [24.0,24.0,24.0,24.0,24.0,24.0,24.0,24.0,24.0,24.0,24.0,24.0,24.0,24.0,24.0,24.0,24.0,24.0,24.0,24.0,24.0,24.0,24.0,24.0]
      },{
        "_type": "powermarket.device_kit.idevice2.IDevice2",
        "d_0": 0.04,
        "on": [0,0,19,23],
        "length": 24,
        "bounds": [[0.05,0.2],[0.0,0.0],[0.0,0.0],[0.0,0.0],[0.0,0.0],[0.0,0.0],[0.0,0.0],[0.0,0.0],[0.0,0.0],[0.0,0.0],[0.0,0.0],[0.0,0.0],[0.0,0.0],[0.0,0.0],[0.0,0.0],[0.0,0.0],[0.0,0.0],[0.0,0.0],[0.0,0.0],[0.05,0.2],[0.05,0.2],[0.05,0.2],[0.05,0.2],[0.05,0.2]],
        "cbounds": null,
        "id": "light"
      },{
        "_type": "powermarket.device_kit.cdevice2.CDevice2",
        "d_0": 0.04,
        "on": [0,8,22,23],
        "length": 24,
        "bounds": [[0.0,2.0],[0.0,2.0],[0.0,2.0],[0.0,2.0],[0.0,2.0],[0.0,2.0],[0.0,2.0],[0.0,2.0],[0.0,2.0],[0.0,0.0],[0.0,0.0],[0.0,0.0],[0.0,0.0],[0.0,0.0],[0.0,0.0],[0.0,0.0],[0.0,0.0],[0.0,0.0],[0.0,0.0],[0.0,0.0],[0.0,0.0],[0.0,0.0],[0.0,2.0],[0.0,2.0]],
        "cbounds": [4.5,6],
        "id": "ev"
      },{
        "_type": "powermarket.device_kit.device.Device",
        "step": 0.4,
        "on": [8,19],
        "length": 24,
        "bounds": [[0.0,0.0],[0.0,0.0],[0.0,0.0],[0.0,0.0],[0.0,0.0],[0.0,0.0],[0.0,0.0],[0.0,0.0],[0.0,1.2000000000000002],[0.0,1.2000000000000002],[0.0,1.2000000000000002],[0.0,1.2000000000000002],[0.0,1.2000000000000002],[0.0,1.2000000000000002],[0.0,1.2000000000000002],[0.0,1.2000000000000002],[0.0,1.2000000000000002],[0.0,1.2000000000000002],[0.0,1.2000000000000002],[0.0,1.2000000000000002],[0.0,0.0],[0.0,0.0],[0.0,0.0],[0.0,0.0]],
        "cbounds": [6.4,6.4],
        "id": "wpump",
        "levels": [0,3]
      },{
        "sustainment": 0.92857,
        "_type": "powermarket.device_kit.tdevice.TDevice",
        "t_range": 4,
        "step": 0.25,
        "t_optimal": -18,
        "length": 24,
        "cbounds": [3.0,9.0],
        "on": [0,23],
        "bounds": [[0.0,0.5],[0.0,0.5],[0.0,0.5],[0.0,0.5],[0.0,0.5],[0.0,0.5],[0.0,0.5],[0.0,0.5],[0.0,0.5],[0.0,0.5],[0.0,0.5],[0.0,0.5],[0.0,0.5],[0.0,0.5],[0.0,0.5],[0.0,0.5],[0.0,0.5],[0.0,0.5],[0.0,0.5],[0.0,0.5],[0.0,0.5],[0.0,0.5],[0.0,0.5],[0.0,0.5]],
        "id": "freezer",
        "efficiency": -12,
        "levels": [0,2],
        "t_init": -18,
        "t_external": [24.0,24.0,24.0,24.0,24.0,24.0,24.0,24.0,24.0,24.0,24.0,24.0,24.0,24.0,24.0,24.0,24.0,24.0,24.0,24.0,24.0,24.0,24.0,24.0]
      }],
      "sbounds": null
    },
    "_type": "powermarket.agent.deviceagent.DeviceAgent"
  }],
  "_p_last": [0.0,0.0,0.0,0.0,0.0,0.0,0.0,0.0,0.0,0.0,0.0,0.0,0.0,0.0,0.0,0.0,0.0,0.0,0.0,0.0,0.0,0.0,0.0,0.0],
  "maxiter": 100,
  "tol": 0.001,
  "s": [[-4.660515653222788,-4.646148674643338,-4.6515772251482,-4.644438621982796,-4.648544657658793,-4.563260464859268,-4.504306711301028,-4.278649620828303,-4.336592283254478,-4.077520322410202,-4.00742529267861,-4.026236385514257,-4.296688771415445,-4.322544869595273,-4.349101566300334,-4.372108013399112,-4.3935140019253005,-4.440117634974223,-4.592551534940995,-4.693329337451549,-4.753381067728954,-4.686972223136895,-4.716566470340268,-4.669691750491035],[-0.04999996185064228,-0.04999996185061863,-0.049999961850577715,-0.05499999999957156,-0.18499999999947872,-1.0099999999990141,-2.28922856657108,-3.6423453135943173,-4.855517842480601,-5.605447316384395,-5.934397577688772,-5.881582697824467,-5.653836926608828,-5.3979517161823845,-4.548736691356503,-4.0090258938717795,-3.104329904586178,-2.304999999999243,-1.3799999999997625,-0.6099999999999344,-0.559999687811041,-0.4599996490285832,-0.0799999389615112,-0.04492891340502986],[-0.0014942234258993577,-0.33360459300564727,-0.0010297180768947347,-0.33178954174163466,-0.3410835842489434,-0.03889354300139022,0.006089478379079064,-0.003818594783315806,-0.0012567168014329796,0.40805841894592226,0.5881395103797352,0.5460994234842677,-0.006385180440294051,-0.0035446807710055525,-0.0034215506881468453,0.14303243474181998,0.06236538420066624,0.020239667950258854,0.0013682762584328514,-0.07873920555693417,-0.06707525818807461,-0.4328041095156698,-0.022275542173765796,-0.0061605871226927955],[0.0,0.0,0.0,0.0,0.0,0.0,0.0,0.25,0.25,0.35,0.0,0.0,0.0,0.0,0.0,0.0,0.0,0.0,0.0,0.0,0.3,0.3,0.4,0.1],[0.12013120976060139,0.1198018999748617,0.11946736604840583,0.12050727844413645,0.11915981085535692,0.12158104396606874,0.11458816426264229,0.11909006150440027,0.11948798587833906,0.12549079084538228,0.11780605040336493,0.12031481992902235,0.11967444140498254,0.12021586307790955,0.11842921264489459,0.1211490692965106,0.11819883130698772,0.11896781873868387,0.12469114995429442,0.11947887454270892,0.12063807908209027,0.11734276567109936,0.11626820885605457,0.09994754822154013],[0.0,0.0,0.0,0.0,0.0,0.0,0.0,0.0,0.0,0.0,0.0,0.0,0.0,0.0,0.0,0.0,0.0,0.11717735579478968,0.1201834003556499,0.11511334629485719,0.11597087248641293,0.11626502097094284,0.11216015188553899,0.0],[0.5101733537360758,0.5865675868726992,0.546527756168713,0.5887486363357148,0.579454593885207,0.0,0.0,0.0,0.0,0.0,0.0,0.0,0.0,0.0,0.0,0.0,0.0,0.0,0.43575632242388423,0.33734591364279054,0.2742240822836453,0.4877340685783417,0.33224260810745204,0.48972716874575245],[0.0,0.0,0.0,0.0,0.0,0.0,0.0,0.0,0.0,0.0,0.0,0.0,1.0760652515622018,1.0754821691932845,1.011429347077653,0.9576113456223927,0.9440666661871244,0.8142661007151714,0.38807650584759446,0.13300261378498895,0.0,0.0,0.0,0.0],[0.0,0.0,0.0,0.0,0.0,0.0,0.0,0.0,0.6842913983065916,1.3929742442420465,1.5730553357274841,1.5310152487811663,0.6874586730142636,0.6034743699418476,0.5231602471155323,0.42015775700309343,0.3393962855061037,0.1575302159045634,0.07458638940531274,0.01289983504861413,0.0,0.0,0.0,0.0],[0.0,0.0,0.0,0.0,0.0,0.25,0.25,0.35,0.0,0.0,0.0,0.0,0.0,0.0,0.0,0.0,0.0,0.0,0.3,0.3,0.4,0.1,0.0,0.0],[0.1198249515966108,0.11948118376823798,0.11683030225582124,0.12048302646558937,0.1190687197654324,0.12351400785097852,0.1179690562657557,0.12028712617777676,0.121886817147707,0.12282675619613813,0.11252251250905683,0.12153623291482799,0.11931079370681935,0.12277720163752069,0.11846030204046695,0.1209407766335738,0.11950923711063635,0.11716245873627769,0.12243901128659836,0.11889848911863583,0.12360596938110263,0.12067436794687643,0.11577512533638246,0.09378438989338624],[0.0,0.0,0.0,0.0,0.0,0.0,0.0,0.0,0.0,0.0,0.0,0.0,0.0,0.0,0.0,0.0,0.0,0.0,0.12018340035559087,0.115325096421977,0.11597087248649943,0.1162650209710705,0.11216015188546231,0.11457056872858618],[0.3980292685982,0.4743205647381491,0.4343871803337577,0.4766080605005439,0.46720757174909017,0.7935917406769719,0.9740427573773447,0.0,0.0,0.0,0.0,0.0,0.0,0.0,0.0,0.0,0.0,0.0,0.0,0.0,0.16893645680185176,0.375593492744099,0.22010203227328543,0.37758659291221797],[0.0,0.0,0.0,0.0,0.0,0.0,0.0,0.0,0.6144326277319727,1.1278786501349125,1.1701568208230573,1.1237769367055688,0.6175999024397972,0.5336155993657903,0.4533014765396965,0.3502989864274882,0.2696179023193567,0.1039008010185026,0.03014754097655105,0.0052727555171943235,0.0,0.0,0.0,0.0],[0.0,0.0,0.0,0.0,0.0,0.0,0.55,0.3,0.0,0.0,0.0,0.0,0.0,0.0,0.0,0.0,0.0,0.0,0.25,0.3,0.3,0.01,0.1,0.0],[0.1177227157060931,0.12121352300586873,0.1234746232263531,0.12023608419070231,0.1151285344471363,0.12171153117200527,0.11446517146398143,0.11937937183870051,0.12179394023203285,0.12552157681141263,0.11497108546549119,0.12290475424878061,0.12026318317445989,0.1229011121253967,0.11619282321042154,0.12002962738458096,0.11851734286030804,0.1165135215585537,0.12212010128065336,0.12071595970513181,0.1236857613354807,0.12126255566433197,0.11702292819308906,0.09360616140254484],[0.0,0.0,0.0,0.0,0.0,0.0,0.0,0.0,0.0,0.0,0.0,0.0,0.0,0.0,0.0,0.0,0.0,0.11717735579452251,0.12018340035573939,0.11532228467794514,0.11597087248648744,0.11626502097110486,0.11216015190655422,0.0],[0.509265681203019,0.5856484768956784,0.5456259431421594,0.5878468233088866,0.5785354839079174,0.0,0.0,0.0,0.0,0.0,0.0,0.0,0.0,0.0,0.0,0.0,0.0,0.0,0.43484678699600715,0.33746665036817014,0.27332226925822045,0.4868322555503508,0.3313407950830433,0.4888253557198509],[0.0,0.0,0.0,0.0,0.0,0.0,0.0,0.0,0.0,0.0,0.0,0.0,1.0613409461787622,1.1399619821221805,1.1051557921622697,1.00778771284602,0.9270073000018304,0.7432244709092343,0.3169672634458289,0.0985545323321914,0.0,0.0,0.0,0.0],[0.02,0.02,0.02,0.02,0.25,0.35,0.02,0.02,0.02,0.02,0.02,0.02,0.2,0.02,0.02,0.55,0.3,0.2,0.02,0.02,0.02,0.02,0.02,0.02],[0.11556868471332596,0.11825111232350309,0.12051072609946495,0.12253844708962876,0.11983321495367107,0.12199889131047922,0.117007868320235,0.11995058006288889,0.12302958953627761,0.12286859939689901,0.1133817551543709,0.11907447348183596,0.11949103444240904,0.12128027507627001,0.11878406850823775,0.12063090333484225,0.12101330145671882,0.12075763448756528,0.1231682133012039,0.11852265724218444,0.1201623360411289,0.11845251505272525,0.11656342200814139,0.0926440810383092],[0.0,0.0,0.0,0.0,0.0,0.0,0.0,0.0,0.0,0.0,0.0,0.0,0.0,0.0,0.0,0.0,0.0,0.11717735579474457,0.12018340035558014,0.11527724596938652,0.11597087248647908,0.11626502097111178,0.11216015188547239,0.0],[0.509286045741774,0.5855773418786421,0.5456503909236764,0.5878712710896835,0.5788303471063421,0.0,0.0,0.0,0.0,0.0,0.0,0.0,0.0,0.0,0.0,0.0,0.0,0.0,0.4348843943735842,0.33723696071790166,0.27334671703788715,0.4868567033344027,0.3313652428638169,0.48884980350241264],[0.0,0.0,0.0,0.0,0.0,0.0,0.0,0.0,0.6144684094426269,1.1278912071998055,1.1701599130318023,1.123782555838416,0.6176356841485363,0.5336513810769432,0.4533372582506151,0.3503347681383346,0.2694044568146928,0.10389942221712471,0.03016033617647515,0.005274607664066606,0.0,0.0,0.0,0.0],[0.0,0.0,0.0,0.0,0.0,0.0,0.0,0.0,0.6843042610939091,1.3929871070303494,1.5730681985158597,1.5310281115690176,0.6874715358018846,0.6034872327306127,0.5231731099049985,0.42017061979164005,0.33928269335823535,0.15753895188165218,0.07459419558566766,0.012893982735828159,0.0,0.0,0.0,0.0],[0.0,0.0,0.0,0.0,0.0,0.0,0.25,0.55,0.15,0.1,0.1,0.2,0.0,0.0,0.0,0.0,0.1,0.15,0.1,0.2,0.3,0.1,0.0,0.0],[0.11565726115149795,0.12272492496151044,0.11932703846603626,0.11984547525088929,0.11690600912424409,0.12090682382369652,0.12036869501514276,0.12160161489374828,0.11966198616748285,0.12473340622311561,0.11272304977823738,0.12048224709527419,0.11949986905635648,0.12088374404965462,0.11816814793534909,0.12334656232806585,0.12205702601863888,0.11581448791930746,0.1199521387162269,0.12337712053756704,0.11982912045409978,0.11807888606141487,0.1178898457623764,0.09369071235211936],[0.10864196928357395,0.0,0.0,0.0,0.0,0.0,0.0,0.0,0.0,0.0,0.0,0.0,0.0,0.0,0.0,0.0,0.0,0.0,0.0,0.11535555775490906,0.11597087248656408,0.1162650209710459,0.11216015190646467,0.1145705687286111],[0.18474026612658354,0.26111162437481517,0.22110448077743383,0.2633253609440667,0.25436462959843315,0.5803090411202841,0.7607600578212023,1.317087969169097,1.0635656452255546,0.0,0.0,0.0,0.0,0.0,0.0,0.0,0.0,0.0,0.0,0.0,0.0,0.0,0.09175877859147172,0.16430389335639767],[0.0,0.0,0.0,0.0,0.0,0.0,0.0,0.0,0.0,0.0,0.0,0.0,1.0613346193563504,1.1399606184021287,1.1051200126449297,1.0077344416749023,0.9271261531912214,0.7431711997360702,0.31699461708227944,0.09855833791023741,0.0,0.0,0.0,0.0],[0.0,0.0,0.0,0.0,0.0,0.0,0.0,0.3,0.0,0.0,0.0,0.0,0.1,0.4,0.25,0.0,0.0,0.25,0.3,0.35,0.1,0.0,0.0,0.0],[0.11696548283321702,0.12097292457671083,0.1224356030425622,0.12034853294997784,0.11806333751367139,0.12136704251484964,0.11756827700876944,0.1188141135142553,0.11810237437732614,0.12212303341249099,0.11628182942649548,0.12431350074853953,0.12218628964973285,0.11737318208371335,0.11823679121432056,0.12227931099159074,0.11721210063898616,0.11904625672984677,0.12267715117027705,0.11921400268834506,0.12231049511165505,0.11969838385738513,0.1165629348412314,0.09591472267747544],[0.10864201231825454,0.0,0.0,0.0,0.0,0.0,0.0,0.0,0.0,0.0,0.0,0.0,0.0,0.0,0.0,0.0,0.0,0.0,0.0,0.11531070785358855,0.11597071430808321,0.11626495826129625,0.11216057148597869,0.11457075910413475],[0.18471994662808708,0.26134292864936803,0.22108453660089003,0.26330541676759567,0.2542299356591627,0.5802890969425377,0.7607401136434105,1.3170680249901456,1.063545701048974,0.0,0.0,0.0,0.0,0.0,0.0,0.0,0.0,0.0,0.0,0.0,0.0,0.0,0.09174990736430677,0.16428394917895783],[0.0,0.0,0.0,0.0,0.0,0.0,0.0,0.0,0.0,0.0,0.0,0.0,1.061336950677054,1.1399599613140194,1.1051492055732044,1.0077774894677325,0.9269792959923981,0.7432142475304624,0.31703075899008115,0.09855209045319348,0.0,0.0,0.0,0.0],[0.24790724734270467,0.2538407646149063,0.24931423214375847,0.2443785686164013,0.24867427986059,0.25308721057728323,0.24880349446089156,0.25151793785502125,0.24924970904021265,0.2532226948121439,0.2429348649489305,0.25451369661900125,0.2519869688661414,0.2501647990732887,0.24654739539761825,0.24692018012867215,0.25091686782633627,0.2502846602455047,0.2533246607957125,0.2464256701206304,0.25238464466398786,0.251108629776076,0.24701197209796139,0.2239536791134651],[0.0,0.0,0.0,0.0,0.0,0.0,0.0,0.55,0.3,0.0,0.0,0.0,0.0,0.0,0.0,0.0,0.0,0.0,0.0,0.25,0.3,0.3,0.01,0.1],[0.116104135567689,0.12086635725299065,0.12109922528860742,0.11804845576725342,0.12088084160307089,0.12181153812607166,0.11702792987513648,0.11951987742874975,0.12077284576900617,0.12409073362566152,0.1155710468871742,0.1221395521611938,0.11737798267621742,0.12003322505882834,0.11965342546009329,0.12064912682556701,0.11948854418245582,0.12077268836782262,0.12116042257272415,0.12019348109804097,0.1191869527608635,0.11727796760612168,0.12110758482937563,0.09748854014769523],[0.0,0.0,0.0,0.0,0.0,0.0,0.0,0.0,0.0,0.0,0.0,0.0,0.0,0.0,0.0,0.0,0.0,0.0,0.120183400355738,0.11532599234329907,0.11597087248670723,0.11626502097093629,0.11216015188528249,0.11457056872854181],[0.39789146688590304,0.47460594845996984,0.434249164460536,0.47647004462564135,0.4671269572591041,0.7934537248029363,0.9739047415022024,0.0,0.0,0.0,0.0,0.0,0.0,0.0,0.0,0.0,0.0,0.0,0.0,0.0,0.1688031801100683,0.37545547686736713,0.2199640163987771,0.37744857703998236],[0.0,0.0,0.0,0.0,0.0,0.0,0.0,0.0,0.6144604330018917,1.1278921284858456,1.1701594893182183,1.1237846919518297,0.6176277077087505,0.5336434046355847,0.45332928180963616,0.35032679169532704,0.2694507238194953,0.10390431513092388,0.030150520667920934,0.005270511773895366,0.0,0.0,0.0,0.0],[0.05,0.05,0.05,0.05,0.05,0.2,0.05,0.2,0.0,0.0,0.0,0.1,0.1,0.0,0.0,0.0,0.1,0.55,0.0,0.1,0.1,0.15,0.25,0.0],[0.116673332601191,0.12401729528959998,0.11969260296044858,0.11974145046325703,0.11590666410121155,0.11966362506905727,0.12029817656787936,0.12152319007079311,0.118568073884416,0.12377830267098812,0.11653704926746712,0.1227481238939757,0.11692337594561684,0.1207651295909023,0.11711089889888222,0.12214495633194387,0.12060472129249782,0.11820678741370787,0.12246552780465514,0.11991967999108562,0.11852106818647444,0.12006446415525264,0.11991370604788307,0.09685900727541734],[0.10864201231818345,0.0,0.0,0.0,0.0,0.0,0.0,0.0,0.0,0.0,0.0,0.0,0.0,0.0,0.0,0.0,0.0,0.0,0.0,0.11532683444157805,0.11597071430812533,0.11626495826121297,0.11216057148600028,0.11457075910400104],[0.18473324014330653,0.2614820340479706,0.22109596774241522,0.2633168479079175,0.254003042847243,0.5803005280850273,0.7607515447833421,1.3170794561308825,1.0635571321906212,0.0,0.0,0.0,0.0,0.0,0.0,0.0,0.0,0.0,0.0,0.0,0.0,0.0,0.09175248920399576,0.1642953803198299],[0.0,0.0,0.0,0.0,0.0,0.0,0.0,0.0,0.6144533148444133,1.127889267643154,1.1701588692423948,1.123783258878996,0.6176205895523135,0.5336362864777232,0.45332216365190636,0.35031967353865273,0.2694924461352141,0.10390397285579128,0.030149711787776857,0.005270445391938728,0.0,0.0,0.0,0.0],[0.25068955423593475,0.2479267378054792,0.2507297653854069,0.24760838299388707,0.24725426765797104,0.2585681618054928,0.24914975110865947,0.24189420556760458,0.24373459762675745,0.2627407211097368,0.2441954894742342,0.2565214549911901,0.2447050790822623,0.2507737295418797,0.25319884831926137,0.24749137308401917,0.24613662630625513,0.2512658875657714,0.25392253628816863,0.24536630489646397,0.25373221771791976,0.2532234065009879,0.24316829931568418,0.22471846375793258]],
  "id": "mg"
}