|Statistic|Home1|Home2|Home3|Home4|Home5|Home6|Home7|Home8|Total|
|-|-|-|-|-|-|-|-|-|-|
|Total Payment|13.27|12.736|12.583|12.68|10.093|8.865|9.481|8.97|88.678|
|Total Consumption|35.223|33.554|33.392|33.504|19.112|16.797|17.352|17.102|206.036|
|Total Utility|15.158|21.723|69.148|60.751|7.997|5.445|10.649|12.638|203.509|
|Total Satisfaction|1.888|8.987|56.565|48.071|-2.096|-3.42|1.168|3.668|114.831|
|Avg Price|0.377|0.380|0.377|0.378|0.528|0.528|0.546|0.525||
