Hour,InteriorLights:Electricity,InteriorEquipment:Electricity,Fans:Electricity,ExteriorLights:Electricity,Cooling:Electricity,Heating,WaterSystems
0,1.9101197470499998,1.7951729350499999,0.0,8.266,0.0,0.0,0.0
1,1.9101197470499998,1.7951729350499999,0.0,8.266,0.0,0.0,0.0
2,1.9101197470499998,1.7951729350499999,0.0,8.266,0.0,0.0,0.0
3,1.9101197470499998,1.7951729350499999,0.0,8.266,0.0,0.0,0.0
4,1.9101197470499998,1.7951729350499999,0.0,8.266,0.0,0.0,0.0
5,1.9101197470499998,1.7951729350499999,12.171607738685747,6.888333333333334,0.0,45.41800831456541,0.0
6,3.8202394940999995,3.5903458701,12.171607738685747,0.0,0.0,34.092415421831575,0.0
7,11.460718482299997,5.983909783500001,12.171607738685747,0.0,0.0,19.441034860707436,0.0
8,22.921436964599994,9.5742556536,12.169815088547253,0.0,0.0,3.0659980186950024,0.0
9,34.38215544689999,10.771037610299999,12.16085183785478,0.0,0.0,0.0,0.0
10,34.38215544689999,10.771037610299999,12.16085183785478,0.0,0.2195275884165588,3.5778466106651777e-06,0.0
11,34.38215544689999,10.771037610299999,12.16085183785478,0.0,0.5942074465689644,0.0,0.0
12,34.38215544689999,10.771037610299999,12.16085183785478,0.0,0.9632880574206468,0.0,0.0
13,34.38215544689999,10.771037610299999,12.16085183785478,0.0,1.1832395953497519,0.0,0.0
14,34.38215544689999,10.771037610299999,12.16085183785478,0.0,1.1010313854755935,0.0,0.0
15,34.38215544689999,10.771037610299999,12.16085183785478,0.0,0.7080215327045658,0.0,0.0
16,34.38215544689999,10.771037610299999,12.16085183785478,0.0,0.3547941573852136,0.0,0.0
17,19.1011974705,8.377473696899997,12.16085183785478,4.133,0.019728828793844886,0.00087501914403582,0.0
18,11.460718482299997,5.983909783500001,12.16085183785478,8.266,0.0,0.15807032860015782,0.0
19,11.460718482299997,5.983909783500001,12.16443713813177,8.266,0.0,8.856543003323887,0.0
20,3.8202394940999995,3.5903458701,12.171607738685747,8.266,0.0,27.41298638366573,0.0
21,1.9101197470499998,1.7951729350499999,0.0,8.266,0.0,0.0,0.0
22,1.9101197470499998,1.7951729350499999,0.0,8.266,0.0,0.0,0.0
23,1.9101197470499998,1.7951729350499999,0.0,8.266,0.0,0.0,0.0
