Hour,InteriorLights:Electricity,InteriorEquipment:Electricity,Fans:Electricity,ExteriorLights:Electricity,Cooling:Electricity,Heating,WaterSystems
0,5.481224596365801,1.0115996780985501,0.0,8.923,0.0,0.0,0.0
1,5.481224596365801,1.0115996780985501,0.0,8.923,0.0,0.0,0.0
2,5.481224596365801,1.0115996780985501,0.0,8.923,0.0,0.0,0.0
3,5.481224596365801,1.0115996780985501,0.0,8.923,0.0,0.0,0.0
4,5.481224596365801,1.0115996780985501,0.0,8.923,0.0,0.0,0.0
5,5.481224596365801,1.0115996780985501,0.0,8.923,0.0,0.0,0.0
6,5.481224596365801,1.0115996780985501,8.1849694880165,0.0,0.0,4.713221127765742,0.0
7,5.481224596365801,2.0231993561971002,8.1849694880165,0.0,0.0,3.08931883896135,0.0
8,13.154939031277916,4.0463987123942,8.1849694880165,0.0,0.0,1.982651430366206,0.0
9,13.154939031277916,4.0463987123942,8.1849694880165,0.0,0.0,1.1118507440140895,0.0
10,13.154939031277916,4.0463987123942,8.1849694880165,0.0,0.0,0.11586763318861387,0.0
11,5.481224596365801,1.0115996780985501,8.1849694880165,0.0,0.0,0.0,0.0
12,5.481224596365801,1.0115996780985501,8.1849694880165,0.0,0.0,0.0,0.0
13,5.481224596365801,1.0115996780985501,8.1849694880165,0.0,0.0,0.0,0.0
14,5.481224596365801,1.0115996780985501,8.1849694880165,0.0,0.0,0.0,0.0
15,5.481224596365801,1.0115996780985501,0.0,0.0,0.0,0.0,0.0
16,5.481224596365801,1.0115996780985501,0.0,0.0,0.0,0.0,0.0
17,5.481224596365801,1.0115996780985501,0.0,0.0,0.0,0.0,0.0
18,5.481224596365801,1.0115996780985501,0.0,7.435833333333333,0.0,0.0,0.0
19,5.481224596365801,1.0115996780985501,0.0,8.923,0.0,0.0,0.0
20,5.481224596365801,1.0115996780985501,0.0,8.923,0.0,0.0,0.0
21,5.481224596365801,1.0115996780985501,0.0,8.923,0.0,0.0,0.0
22,5.481224596365801,1.0115996780985501,0.0,8.923,0.0,0.0,0.0
23,5.481224596365801,1.0115996780985501,0.0,8.923,0.0,0.0,0.0
