../Core/Src/stm32g4xx_hal_msp.c:63:6:HAL_MspInit	16	static
../Core/Src/stm32g4xx_hal_msp.c:85:6:HAL_I2C_MspInit	120	static
../Core/Src/stm32g4xx_hal_msp.c:139:6:HAL_I2C_MspDeInit	16	static
../Core/Src/stm32g4xx_hal_msp.c:170:6:HAL_UART_MspInit	112	static
../Core/Src/stm32g4xx_hal_msp.c:220:6:HAL_UART_MspDeInit	16	static
