{
	"version": 5,
	"lastUserContextId": 7,
	"identities": [
		{
			"userContextId": 128,
			"public": true,
			"icon": "circle",
			"color": "blue",
			"name": "Programming"
		},
		{
			"userContextId": 129,
			"public": true,
			"icon": "circle",
			"color": "blue",
			"name": "Gaming"
		},
		{
			"userContextId": 130,
			"public": true,
			"icon": "circle",
			"color": "blue",
			"name": "My stuff"
		},
		{
			"userContextId": 131,
			"public": true,
			"icon": "circle",
			"color": "blue",
			"name": "Mail"
		},
		{
			"userContextId": 256,
			"public": true,
			"icon": "circle",
			"color": "purple",
			"name": "Alphabet"
		},
		{
			"userContextId": 257,
			"public": true,
			"icon": "circle",
			"color": "purple",
			"name": "Meta"
		},
		{
			"userContextId": 258,
			"public": true,
			"icon": "circle",
			"color": "purple",
			"name": "Microsoft"
		},
		{
			"userContextId": 259,
			"public": true,
			"icon": "circle",
			"color": "purple",
			"name": "Amazon"
		},
		{
			"userContextId": 1024,
			"public": true,
			"icon": "circle",
			"color": "orange",
			"name": "Temp"
		},
		{
			"userContextId": 2048,
			"public": true,
			"icon": "circle",
			"color": "pink",
			"name": "JoT"
		},
		{
			"userContextId": 2049,
			"public": true,
			"icon": "circle",
			"color": "pink",
			"name": "AnT"
		},
		{
			"userContextId": 2050,
			"public": true,
			"icon": "circle",
			"color": "pink",
			"name": "SyP"
		},
		{
			"userContextId": 2051,
			"public": true,
			"icon": "circle",
			"color": "pink",
			"name": "SaP"
		},
		{
			"userContextId": 2052,
			"public": true,
			"icon": "circle",
			"color": "pink",
			"name": "WaS"
		},
		{
			"userContextId": 8192,
			"public": true,
			"icon": "fingerprint",
			"color": "purple",
			"name": "Private"
		},
		{
			"userContextId": 16384,
			"public": true,
			"icon": "circle",
			"color": "blue",
			"name": "NTS"
		}
	]
}
