(kicad_pcb (version 20211014) (generator pcbnew)

  (general
    (thickness 1.6)
  )

  (paper "A4")
  (layers
    (0 "F.Cu" signal)
    (31 "B.Cu" signal)
    (32 "B.Adhes" user "B.Adhesive")
    (33 "F.Adhes" user "F.Adhesive")
    (34 "B.Paste" user)
    (35 "F.Paste" user)
    (36 "B.SilkS" user "B.Silkscreen")
    (37 "F.SilkS" user "F.Silkscreen")
    (38 "B.Mask" user)
    (39 "F.Mask" user)
    (40 "Dwgs.User" user "User.Drawings")
    (41 "Cmts.User" user "User.Comments")
    (42 "Eco1.User" user "User.Eco1")
    (43 "Eco2.User" user "User.Eco2")
    (44 "Edge.Cuts" user)
    (45 "Margin" user)
    (46 "B.CrtYd" user "B.Courtyard")
    (47 "F.CrtYd" user "F.Courtyard")
    (48 "B.Fab" user)
    (49 "F.Fab" user)
    (50 "User.1" user)
    (51 "User.2" user)
    (52 "User.3" user)
    (53 "User.4" user)
    (54 "User.5" user)
    (55 "User.6" user)
    (56 "User.7" user)
    (57 "User.8" user)
    (58 "User.9" user)
  )

  (setup
    (stackup
      (layer "F.SilkS" (type "Top Silk Screen"))
      (layer "F.Paste" (type "Top Solder Paste"))
      (layer "F.Mask" (type "Top Solder Mask") (thickness 0.01))
      (layer "F.Cu" (type "copper") (thickness 0.035))
      (layer "dielectric 1" (type "core") (thickness 1.51) (material "FR4") (epsilon_r 4.5) (loss_tangent 0.02))
      (layer "B.Cu" (type "copper") (thickness 0.035))
      (layer "B.Mask" (type "Bottom Solder Mask") (thickness 0.01))
      (layer "B.Paste" (type "Bottom Solder Paste"))
      (layer "B.SilkS" (type "Bottom Silk Screen"))
      (copper_finish "None")
      (dielectric_constraints no)
    )
    (pad_to_mask_clearance 0)
    (pcbplotparams
      (layerselection 0x00010fc_ffffffff)
      (disableapertmacros false)
      (usegerberextensions false)
      (usegerberattributes true)
      (usegerberadvancedattributes true)
      (creategerberjobfile true)
      (svguseinch false)
      (svgprecision 6)
      (excludeedgelayer true)
      (plotframeref false)
      (viasonmask false)
      (mode 1)
      (useauxorigin false)
      (hpglpennumber 1)
      (hpglpenspeed 20)
      (hpglpendiameter 15.000000)
      (dxfpolygonmode true)
      (dxfimperialunits true)
      (dxfusepcbnewfont true)
      (psnegative false)
      (psa4output false)
      (plotreference true)
      (plotvalue true)
      (plotinvisibletext false)
      (sketchpadsonfab false)
      (subtractmaskfromsilk false)
      (outputformat 1)
      (mirror false)
      (drillshape 1)
      (scaleselection 1)
      (outputdirectory "")
    )
  )

  (net 0 "")
  (net 1 "unconnected-(J1-Pad1)")
  (net 2 "unconnected-(J1-Pad2)")
  (net 3 "unconnected-(J1-Pad3)")
  (net 4 "unconnected-(J1-Pad4)")
  (net 5 "unconnected-(J1-Pad5)")
  (net 6 "unconnected-(J1-Pad6)")
  (net 7 "unconnected-(J1-Pad8)")
  (net 8 "unconnected-(J2-Pad2)")
  (net 9 "/IN")
  (net 10 "/OUT")
  (net 11 "/VR")
  (net 12 "Net-(R1-Pad1)")
  (net 13 "unconnected-(J3-Pad7)")
  (net 14 "unconnected-(J3-Pad8)")
  (net 15 "GND")
  (net 16 "Net-(D1-Pad2)")
  (net 17 "Net-(D2-Pad2)")
  (net 18 "/DIAG")
  (net 19 "/VM")

  (footprint "Resistor_SMD:R_0603_1608Metric" (layer "F.Cu")
    (tedit 5F68FEEE) (tstamp 4767998c-fceb-404a-83ca-6f29f00e6a4f)
    (at 123.444 67.31 180)
    (descr "Resistor SMD 0603 (1608 Metric), square (rectangular) end terminal, IPC_7351 nominal, (Body size source: IPC-SM-782 page 72, https://www.pcb-3d.com/wordpress/wp-content/uploads/ipc-sm-782a_amendment_1_and_2.pdf), generated with kicad-footprint-generator")
    (tags "resistor")
    (property "Sheetfile" "stepper-adapter.kicad_sch")
    (property "Sheetname" "")
    (path "/1a2ec6c6-55c9-4af2-9dd7-899f83614a7d")
    (attr smd)
    (fp_text reference "R3" (at 0 -1.43) (layer "F.SilkS") hide
      (effects (font (size 1 1) (thickness 0.15)))
      (tstamp f57200e1-4e86-4b08-a229-c824cfc1cb8d)
    )
    (fp_text value "12K" (at 0 1.43) (layer "F.Fab")
      (effects (font (size 1 1) (thickness 0.15)))
      (tstamp 5c06cc63-16ed-426d-9226-92d0ecfbcb1d)
    )
    (fp_text user "${REFERENCE}" (at 0 0) (layer "F.Fab")
      (effects (font (size 0.4 0.4) (thickness 0.06)))
      (tstamp ae8ef095-663c-40bb-a68e-43b032dae963)
    )
    (fp_line (start -0.237258 0.5225) (end 0.237258 0.5225) (layer "F.SilkS") (width 0.12) (tstamp 6f968801-2783-4765-83ed-6301a323939b))
    (fp_line (start -0.237258 -0.5225) (end 0.237258 -0.5225) (layer "F.SilkS") (width 0.12) (tstamp 852f1cec-b7f0-41ff-ac66-3cc98c8dbd94))
    (fp_line (start 1.48 0.73) (end -1.48 0.73) (layer "F.CrtYd") (width 0.05) (tstamp 33c37781-779a-4737-9f00-1bfbe2347724))
    (fp_line (start -1.48 -0.73) (end 1.48 -0.73) (layer "F.CrtYd") (width 0.05) (tstamp 63f0b239-8835-4f11-9aeb-70ff19e7280b))
    (fp_line (start -1.48 0.73) (end -1.48 -0.73) (layer "F.CrtYd") (width 0.05) (tstamp c7d5824e-3f10-4444-b9a0-ae581b1f5efe))
    (fp_line (start 1.48 -0.73) (end 1.48 0.73) (layer "F.CrtYd") (width 0.05) (tstamp e8811951-8b59-41a0-8eef-56ed4dab9a4b))
    (fp_line (start -0.8 0.4125) (end -0.8 -0.4125) (layer "F.Fab") (width 0.1) (tstamp 12cd3e94-10fa-4d3c-b5ec-3573fabd3fd4))
    (fp_line (start 0.8 0.4125) (end -0.8 0.4125) (layer "F.Fab") (width 0.1) (tstamp 3a745b40-9e68-4328-9e4a-42680d311201))
    (fp_line (start -0.8 -0.4125) (end 0.8 -0.4125) (layer "F.Fab") (width 0.1) (tstamp cdb1eaba-d082-4a12-ad19-ab2443780318))
    (fp_line (start 0.8 -0.4125) (end 0.8 0.4125) (layer "F.Fab") (width 0.1) (tstamp ee25bde1-e7b9-497a-bc7f-40162082b7cf))
    (pad "1" smd roundrect (at -0.825 0 180) (size 0.8 0.95) (layers "F.Cu" "F.Paste" "F.Mask") (roundrect_rratio 0.25)
      (net 11 "/VR") (pintype "passive") (tstamp da93aece-fb68-4060-9683-6ed553231079))
    (pad "2" smd roundrect (at 0.825 0 180) (size 0.8 0.95) (layers "F.Cu" "F.Paste" "F.Mask") (roundrect_rratio 0.25)
      (net 16 "Net-(D1-Pad2)") (pintype "passive") (tstamp 767a8864-135f-4229-a96e-5d85786b17e9))
    (model "${KICAD6_3DMODEL_DIR}/Resistor_SMD.3dshapes/R_0603_1608Metric.wrl"
      (offset (xyz 0 0 0))
      (scale (xyz 1 1 1))
      (rotate (xyz 0 0 0))
    )
  )

  (footprint "LED_SMD:LED_0603_1608Metric" (layer "F.Cu")
    (tedit 5F68FEF1) (tstamp 4bc43cb3-b80d-4c92-ad8f-e4be7645cc13)
    (at 120.142 67.31)
    (descr "LED SMD 0603 (1608 Metric), square (rectangular) end terminal, IPC_7351 nominal, (Body size source: http://www.tortai-tech.com/upload/download/2011102023233369053.pdf), generated with kicad-footprint-generator")
    (tags "LED")
    (property "Sheetfile" "stepper-adapter.kicad_sch")
    (property "Sheetname" "")
    (path "/ae6320cf-b672-4f19-827f-08a304a08556")
    (attr smd)
    (fp_text reference "D1" (at 0 -1.43) (layer "F.SilkS") hide
      (effects (font (size 1 1) (thickness 0.15)))
      (tstamp 6659701b-ceaa-4495-a8ed-bf6b69c6293f)
    )
    (fp_text value "GREEN" (at 0 1.43) (layer "F.Fab")
      (effects (font (size 1 1) (thickness 0.15)))
      (tstamp c6383be7-c2c9-41ca-9d09-aa8eb9e8bc28)
    )
    (fp_text user "${REFERENCE}" (at 0 0) (layer "F.Fab")
      (effects (font (size 0.4 0.4) (thickness 0.06)))
      (tstamp d083be6d-f114-45b9-8a72-bc99b3346bcf)
    )
    (fp_line (start -1.485 -0.735) (end -1.485 0.735) (layer "F.SilkS") (width 0.12) (tstamp a8914293-7b03-4607-84e3-318554edd8ba))
    (fp_line (start 0.8 -0.735) (end -1.485 -0.735) (layer "F.SilkS") (width 0.12) (tstamp c7c09017-ea95-4262-8e14-b50afbb5de9d))
    (fp_line (start -1.485 0.735) (end 0.8 0.735) (layer "F.SilkS") (width 0.12) (tstamp f66063ad-6ba1-452b-97c3-def4db34905c))
    (fp_line (start 1.48 -0.73) (end 1.48 0.73) (layer "F.CrtYd") (width 0.05) (tstamp 1edc8739-8912-4212-8479-8ec064b95894))
    (fp_line (start -1.48 0.73) (end -1.48 -0.73) (layer "F.CrtYd") (width 0.05) (tstamp 7c481c55-d3bc-4acb-8f72-e77a300b00e6))
    (fp_line (start -1.48 -0.73) (end 1.48 -0.73) (layer "F.CrtYd") (width 0.05) (tstamp b530089b-ed31-4e99-851c-bd2b1be9e2d0))
    (fp_line (start 1.48 0.73) (end -1.48 0.73) (layer "F.CrtYd") (width 0.05) (tstamp e15dccf8-9c13-437e-9843-ea2e65c9b55d))
    (fp_line (start -0.5 -0.4) (end -0.8 -0.1) (layer "F.Fab") (width 0.1) (tstamp 10052a5f-c3cc-43ea-ae91-0fbe53c6ac40))
    (fp_line (start 0.8 0.4) (end 0.8 -0.4) (layer "F.Fab") (width 0.1) (tstamp 4e5f51f5-7466-44d2-a505-768408f4c933))
    (fp_line (start -0.8 0.4) (end 0.8 0.4) (layer "F.Fab") (width 0.1) (tstamp c20c1640-5f99-4e72-95d6-566076e536e9))
    (fp_line (start 0.8 -0.4) (end -0.5 -0.4) (layer "F.Fab") (width 0.1) (tstamp c42d66f5-f071-476a-9d4c-4886a7bbe619))
    (fp_line (start -0.8 -0.1) (end -0.8 0.4) (layer "F.Fab") (width 0.1) (tstamp f8f0b308-8fd2-4b5f-a9ba-d68d00f83b23))
    (pad "1" smd roundrect (at -0.7875 0) (size 0.875 0.95) (layers "F.Cu" "F.Paste" "F.Mask") (roundrect_rratio 0.25)
      (net 15 "GND") (pinfunction "K") (pintype "passive") (tstamp bd0fd1a4-ac36-4922-a223-1cb6c89b69f4))
    (pad "2" smd roundrect (at 0.7875 0) (size 0.875 0.95) (layers "F.Cu" "F.Paste" "F.Mask") (roundrect_rratio 0.25)
      (net 16 "Net-(D1-Pad2)") (pinfunction "A") (pintype "passive") (tstamp 529a8773-7553-4168-a3ff-cc91cbbd193e))
    (model "${KICAD6_3DMODEL_DIR}/LED_SMD.3dshapes/LED_0603_1608Metric.wrl"
      (offset (xyz 0 0 0))
      (scale (xyz 1 1 1))
      (rotate (xyz 0 0 0))
    )
  )

  (footprint "Resistor_SMD:R_0805_2012Metric" (layer "F.Cu")
    (tedit 5F68FEEE) (tstamp 91a20f66-6307-4c5c-bd04-672f06e3f924)
    (at 125.222 64.77 180)
    (descr "Resistor SMD 0805 (2012 Metric), square (rectangular) end terminal, IPC_7351 nominal, (Body size source: IPC-SM-782 page 72, https://www.pcb-3d.com/wordpress/wp-content/uploads/ipc-sm-782a_amendment_1_and_2.pdf), generated with kicad-footprint-generator")
    (tags "resistor")
    (property "Sheetfile" "stepper-adapter.kicad_sch")
    (property "Sheetname" "")
    (path "/5e916b13-d184-4551-bb52-51f8e37c8372")
    (attr smd)
    (fp_text reference "R5" (at 0 -1.65) (layer "F.SilkS") hide
      (effects (font (size 1 1) (thickness 0.15)))
      (tstamp 09b8650d-4e41-41ac-9a7a-7045134dc1cb)
    )
    (fp_text value "0R" (at 0 1.65) (layer "F.Fab")
      (effects (font (size 1 1) (thickness 0.15)))
      (tstamp 7b3ea9ff-8f18-4727-9c16-9f2d773e7040)
    )
    (fp_text user "${REFERENCE}" (at 0 0) (layer "F.Fab")
      (effects (font (size 0.5 0.5) (thickness 0.08)))
      (tstamp d02e2e3e-c7c5-4777-a6b7-fd44e48df7ac)
    )
    (fp_line (start -0.227064 -0.735) (end 0.227064 -0.735) (layer "F.SilkS") (width 0.12) (tstamp 11ea2a6a-3bda-4192-b348-99ca5f4ef610))
    (fp_line (start -0.227064 0.735) (end 0.227064 0.735) (layer "F.SilkS") (width 0.12) (tstamp ba2ce421-09ee-47b2-b0f8-0a430c8b06db))
    (fp_line (start -1.68 0.95) (end -1.68 -0.95) (layer "F.CrtYd") (width 0.05) (tstamp 09f411c1-c6ac-4127-97c2-dc37653f33e9))
    (fp_line (start 1.68 0.95) (end -1.68 0.95) (layer "F.CrtYd") (width 0.05) (tstamp 35050cab-5e81-497c-bca5-e932bf4232b4))
    (fp_line (start -1.68 -0.95) (end 1.68 -0.95) (layer "F.CrtYd") (width 0.05) (tstamp 75115f50-6cc6-495c-a15b-0c1e9b373458))
    (fp_line (start 1.68 -0.95) (end 1.68 0.95) (layer "F.CrtYd") (width 0.05) (tstamp d734c1ab-f333-4046-9352-652939d9e041))
    (fp_line (start 1 -0.625) (end 1 0.625) (layer "F.Fab") (width 0.1) (tstamp 04bb5191-0a6c-4771-895b-ff57c86c6603))
    (fp_line (start -1 -0.625) (end 1 -0.625) (layer "F.Fab") (width 0.1) (tstamp 4872b8d3-f2dc-4780-a816-efe9d9381a4c))
    (fp_line (start -1 0.625) (end -1 -0.625) (layer "F.Fab") (width 0.1) (tstamp d1b5439b-16dc-448e-992a-11cea14d919a))
    (fp_line (start 1 0.625) (end -1 0.625) (layer "F.Fab") (width 0.1) (tstamp fbb42b11-93fe-4f45-a9ce-fc7b9531207e))
    (pad "1" smd roundrect (at -0.9125 0 180) (size 1.025 1.4) (layers "F.Cu" "F.Paste" "F.Mask") (roundrect_rratio 0.243902439)
      (net 19 "/VM") (pintype "passive") (tstamp 109e4f1c-ffe9-454a-9d12-a24a8d9ab635))
    (pad "2" smd roundrect (at 0.9125 0 180) (size 1.025 1.4) (layers "F.Cu" "F.Paste" "F.Mask") (roundrect_rratio 0.243902439)
      (net 11 "/VR") (pintype "passive") (tstamp 732da5e0-19c8-47ed-9082-3300bcc0f294))
    (model "${KICAD6_3DMODEL_DIR}/Resistor_SMD.3dshapes/R_0805_2012Metric.wrl"
      (offset (xyz 0 0 0))
      (scale (xyz 1 1 1))
      (rotate (xyz 0 0 0))
    )
  )

  (footprint "LED_SMD:LED_0603_1608Metric" (layer "F.Cu")
    (tedit 5F68FEF1) (tstamp b42864f0-2a6a-43fd-894b-62626e199304)
    (at 118.364 77.978 -90)
    (descr "LED SMD 0603 (1608 Metric), square (rectangular) end terminal, IPC_7351 nominal, (Body size source: http://www.tortai-tech.com/upload/download/2011102023233369053.pdf), generated with kicad-footprint-generator")
    (tags "LED")
    (property "Sheetfile" "stepper-adapter.kicad_sch")
    (property "Sheetname" "")
    (path "/ec70f8aa-6dc9-4d49-9887-c904ccdf5212")
    (attr smd)
    (fp_text reference "D3" (at 0 -1.43 90) (layer "F.SilkS") hide
      (effects (font (size 1 1) (thickness 0.15)))
      (tstamp 41b42dbc-70d1-4335-a2fb-1d4b18fa582f)
    )
    (fp_text value "YELLOW" (at 0 1.43 90) (layer "F.Fab")
      (effects (font (size 1 1) (thickness 0.15)))
      (tstamp 291721ed-796d-44ad-94cf-c5d3178685a2)
    )
    (fp_text user "${REFERENCE}" (at 0 0 90) (layer "F.Fab")
      (effects (font (size 0.4 0.4) (thickness 0.06)))
      (tstamp 9af97456-ba16-41e2-a991-34ff8b086dd4)
    )
    (fp_line (start 0.8 -0.735) (end -1.485 -0.735) (layer "F.SilkS") (width 0.12) (tstamp 1f89e38c-f2f7-4c34-9e42-e432a0bed5f7))
    (fp_line (start -1.485 0.735) (end 0.8 0.735) (layer "F.SilkS") (width 0.12) (tstamp 6b1ced7d-5147-4044-be6e-71fc72d747ae))
    (fp_line (start -1.485 -0.735) (end -1.485 0.735) (layer "F.SilkS") (width 0.12) (tstamp f7fcb208-8bbe-45a9-9007-bb8fafafb157))
    (fp_line (start 1.48 -0.73) (end 1.48 0.73) (layer "F.CrtYd") (width 0.05) (tstamp 17334bd9-acaa-41f8-b64b-9208320e6b61))
    (fp_line (start -1.48 0.73) (end -1.48 -0.73) (layer "F.CrtYd") (width 0.05) (tstamp 2cedcc1d-c6a4-4627-8bba-b552aaab96bf))
    (fp_line (start 1.48 0.73) (end -1.48 0.73) (layer "F.CrtYd") (width 0.05) (tstamp 7def4873-9d5e-4d3b-816a-ab54ea2eaf31))
    (fp_line (start -1.48 -0.73) (end 1.48 -0.73) (layer "F.CrtYd") (width 0.05) (tstamp a67e04ed-661f-4dd2-a42e-bed97c3e9023))
    (fp_line (start -0.8 -0.1) (end -0.8 0.4) (layer "F.Fab") (width 0.1) (tstamp 8109c897-65ad-4f3c-a617-6213c669c00f))
    (fp_line (start -0.5 -0.4) (end -0.8 -0.1) (layer "F.Fab") (width 0.1) (tstamp 8af7401e-486b-4bc3-8fe5-ffd9adeda94b))
    (fp_line (start 0.8 -0.4) (end -0.5 -0.4) (layer "F.Fab") (width 0.1) (tstamp aeee6e57-4ddd-4d7b-b2b1-acea82b91794))
    (fp_line (start -0.8 0.4) (end 0.8 0.4) (layer "F.Fab") (width 0.1) (tstamp bea05343-d128-486f-994c-c25019badfc6))
    (fp_line (start 0.8 0.4) (end 0.8 -0.4) (layer "F.Fab") (width 0.1) (tstamp f2ba14b1-03f7-44c7-96a6-686aeb486c20))
    (pad "1" smd roundrect (at -0.7875 0 270) (size 0.875 0.95) (layers "F.Cu" "F.Paste" "F.Mask") (roundrect_rratio 0.25)
      (net 12 "Net-(R1-Pad1)") (pinfunction "K") (pintype "passive") (tstamp 75ebde42-d4b7-441b-9d8f-93cc83a1614c))
    (pad "2" smd roundrect (at 0.7875 0 270) (size 0.875 0.95) (layers "F.Cu" "F.Paste" "F.Mask") (roundrect_rratio 0.25)
      (net 10 "/OUT") (pinfunction "A") (pintype "passive") (tstamp 298d65e5-80bd-4c75-aa94-bc0c78770d22))
    (model "${KICAD6_3DMODEL_DIR}/LED_SMD.3dshapes/LED_0603_1608Metric.wrl"
      (offset (xyz 0 0 0))
      (scale (xyz 1 1 1))
      (rotate (xyz 0 0 0))
    )
  )

  (footprint "Resistor_SMD:R_0603_1608Metric" (layer "F.Cu")
    (tedit 5F68FEEE) (tstamp ca6b36d9-85b0-4a35-be5f-cb17e8b62226)
    (at 118.364 74.676 90)
    (descr "Resistor SMD 0603 (1608 Metric), square (rectangular) end terminal, IPC_7351 nominal, (Body size source: IPC-SM-782 page 72, https://www.pcb-3d.com/wordpress/wp-content/uploads/ipc-sm-782a_amendment_1_and_2.pdf), generated with kicad-footprint-generator")
    (tags "resistor")
    (property "Sheetfile" "stepper-adapter.kicad_sch")
    (property "Sheetname" "")
    (path "/10fd64e9-4715-4584-9281-067e796cca80")
    (attr smd)
    (fp_text reference "R1" (at 0 -1.43 90) (layer "F.SilkS") hide
      (effects (font (size 1 1) (thickness 0.15)))
      (tstamp e87d5672-c039-45d3-a0a4-430228205191)
    )
    (fp_text value "12K" (at 0 1.43 90) (layer "F.Fab")
      (effects (font (size 1 1) (thickness 0.15)))
      (tstamp 973c4399-2496-4ec5-ad4e-ba1e3e99118e)
    )
    (fp_text user "${REFERENCE}" (at 0 0 90) (layer "F.Fab")
      (effects (font (size 0.4 0.4) (thickness 0.06)))
      (tstamp 1fe1f6d0-148e-4c19-ab86-5f428041e5f4)
    )
    (fp_line (start -0.237258 -0.5225) (end 0.237258 -0.5225) (layer "F.SilkS") (width 0.12) (tstamp 4eec4de8-9c9f-4a44-b47a-383549deb9e1))
    (fp_line (start -0.237258 0.5225) (end 0.237258 0.5225) (layer "F.SilkS") (width 0.12) (tstamp bb76942f-a180-41c3-8886-b186551ab04b))
    (fp_line (start 1.48 0.73) (end -1.48 0.73) (layer "F.CrtYd") (width 0.05) (tstamp 0a39cfa3-5748-4d88-9913-314dad20f8b5))
    (fp_line (start -1.48 -0.73) (end 1.48 -0.73) (layer "F.CrtYd") (width 0.05) (tstamp 51968ad6-23b5-4654-8aa2-715ee64e8276))
    (fp_line (start 1.48 -0.73) (end 1.48 0.73) (layer "F.CrtYd") (width 0.05) (tstamp 67e68a03-0345-453d-a81f-b4c44c17aad0))
    (fp_line (start -1.48 0.73) (end -1.48 -0.73) (layer "F.CrtYd") (width 0.05) (tstamp b420862a-653c-4174-9b4f-7762c2f10bae))
    (fp_line (start -0.8 -0.4125) (end 0.8 -0.4125) (layer "F.Fab") (width 0.1) (tstamp 0c4bb019-1355-457d-8301-29a43f015d85))
    (fp_line (start 0.8 -0.4125) (end 0.8 0.4125) (layer "F.Fab") (width 0.1) (tstamp 169403ae-cae2-431d-9655-3f611d890764))
    (fp_line (start 0.8 0.4125) (end -0.8 0.4125) (layer "F.Fab") (width 0.1) (tstamp 76c1fe6d-0aca-49ea-b884-caffc8fb9501))
    (fp_line (start -0.8 0.4125) (end -0.8 -0.4125) (layer "F.Fab") (width 0.1) (tstamp 9f4fa9f1-de56-419f-b96f-eba611e63ba4))
    (pad "1" smd roundrect (at -0.825 0 90) (size 0.8 0.95) (layers "F.Cu" "F.Paste" "F.Mask") (roundrect_rratio 0.25)
      (net 12 "Net-(R1-Pad1)") (pintype "passive") (tstamp d4fbe471-78fe-4b54-9e6f-76939efbfaf3))
    (pad "2" smd roundrect (at 0.825 0 90) (size 0.8 0.95) (layers "F.Cu" "F.Paste" "F.Mask") (roundrect_rratio 0.25)
      (net 18 "/DIAG") (pintype "passive") (tstamp c87ca829-d0ed-4417-806c-d290e5d2eb84))
    (model "${KICAD6_3DMODEL_DIR}/Resistor_SMD.3dshapes/R_0603_1608Metric.wrl"
      (offset (xyz 0 0 0))
      (scale (xyz 1 1 1))
      (rotate (xyz 0 0 0))
    )
  )

  (footprint "Resistor_SMD:R_0603_1608Metric" (layer "F.Cu")
    (tedit 5F68FEEE) (tstamp dbbc0893-3fb7-4f54-8302-7bf2379aed52)
    (at 118.364 71.374 90)
    (descr "Resistor SMD 0603 (1608 Metric), square (rectangular) end terminal, IPC_7351 nominal, (Body size source: IPC-SM-782 page 72, https://www.pcb-3d.com/wordpress/wp-content/uploads/ipc-sm-782a_amendment_1_and_2.pdf), generated with kicad-footprint-generator")
    (tags "resistor")
    (property "Sheetfile" "stepper-adapter.kicad_sch")
    (property "Sheetname" "")
    (path "/b7c01d53-93ed-4e82-9167-83c830bf26ea")
    (attr smd)
    (fp_text reference "R2" (at 0 -1.43 90) (layer "F.SilkS") hide
      (effects (font (size 1 1) (thickness 0.15)))
      (tstamp f66c5eab-d022-47b1-a423-98572220c6e5)
    )
    (fp_text value "1.5K" (at 0 1.43 90) (layer "F.Fab")
      (effects (font (size 1 1) (thickness 0.15)))
      (tstamp 05a7294e-f069-4ddf-9381-dbed1d18554e)
    )
    (fp_text user "${REFERENCE}" (at 0 0 90) (layer "F.Fab")
      (effects (font (size 0.4 0.4) (thickness 0.06)))
      (tstamp 674ee583-7ca6-4eed-8515-b142150b29ce)
    )
    (fp_line (start -0.237258 -0.5225) (end 0.237258 -0.5225) (layer "F.SilkS") (width 0.12) (tstamp 16dca3af-2853-45d8-95dc-4ba4018799b9))
    (fp_line (start -0.237258 0.5225) (end 0.237258 0.5225) (layer "F.SilkS") (width 0.12) (tstamp 93c1347b-3410-41cc-b1eb-c35fc6a2cf51))
    (fp_line (start -1.48 0.73) (end -1.48 -0.73) (layer "F.CrtYd") (width 0.05) (tstamp 17127362-d772-414c-9fd0-03f5d66962f5))
    (fp_line (start 1.48 -0.73) (end 1.48 0.73) (layer "F.CrtYd") (width 0.05) (tstamp 51ca0c2c-530d-4fe1-984d-edd8026308ce))
    (fp_line (start -1.48 -0.73) (end 1.48 -0.73) (layer "F.CrtYd") (width 0.05) (tstamp 78bd7c3a-0680-4805-8027-4a8cc6296baf))
    (fp_line (start 1.48 0.73) (end -1.48 0.73) (layer "F.CrtYd") (width 0.05) (tstamp e528a7d9-cb33-4e7a-befe-14e8ba835665))
    (fp_line (start 0.8 0.4125) (end -0.8 0.4125) (layer "F.Fab") (width 0.1) (tstamp 114187a9-6293-4b00-ab8f-9a62e50be7b1))
    (fp_line (start -0.8 0.4125) (end -0.8 -0.4125) (layer "F.Fab") (width 0.1) (tstamp 312c0b0f-14db-43c3-a0d0-c20c5242999e))
    (fp_line (start -0.8 -0.4125) (end 0.8 -0.4125) (layer "F.Fab") (width 0.1) (tstamp c616acfb-d2ad-4df2-b624-3a857f290213))
    (fp_line (start 0.8 -0.4125) (end 0.8 0.4125) (layer "F.Fab") (width 0.1) (tstamp ce68440b-6bb3-4e63-a2e6-abcdde9a9869))
    (pad "1" smd roundrect (at -0.825 0 90) (size 0.8 0.95) (layers "F.Cu" "F.Paste" "F.Mask") (roundrect_rratio 0.25)
      (net 18 "/DIAG") (pintype "passive") (tstamp 19a47ee7-f99f-4349-a699-c5bb5e3f26e0))
    (pad "2" smd roundrect (at 0.825 0 90) (size 0.8 0.95) (layers "F.Cu" "F.Paste" "F.Mask") (roundrect_rratio 0.25)
      (net 15 "GND") (pintype "passive") (tstamp d40567ba-39a8-41c0-9a6e-dc4ddcb16a6c))
    (model "${KICAD6_3DMODEL_DIR}/Resistor_SMD.3dshapes/R_0603_1608Metric.wrl"
      (offset (xyz 0 0 0))
      (scale (xyz 1 1 1))
      (rotate (xyz 0 0 0))
    )
  )

  (footprint "Connector_JST:JST_XH_B4B-XH-A_1x04_P2.50mm_Vertical" (layer "F.Cu")
    (tedit 5C28146C) (tstamp dbe1632b-80f6-4dd4-87de-8b66635eb652)
    (at 123.08 71.18 -90)
    (descr "JST XH series connector, B4B-XH-A (http://www.jst-mfg.com/product/pdf/eng/eXH.pdf), generated with kicad-footprint-generator")
    (tags "connector JST XH vertical")
    (property "Sheetfile" "stepper-adapter.kicad_sch")
    (property "Sheetname" "")
    (path "/d4a18f35-27b0-4559-aba9-f212dc982d2e")
    (attr through_hole exclude_from_pos_files exclude_from_bom)
    (fp_text reference "J4" (at 3.75 -3.55 90) (layer "F.SilkS") hide
      (effects (font (size 1 1) (thickness 0.15)))
      (tstamp 227d5dc7-85a3-4e2c-b053-7f0c70513460)
    )
    (fp_text value "Radar (M8)" (at 3.75 4.6 90) (layer "F.Fab")
      (effects (font (size 1 1) (thickness 0.15)))
      (tstamp e4b2dc88-88bd-45f3-b0ee-ffe6c98a2905)
    )
    (fp_text user "${REFERENCE}" (at 3.75 2.7 90) (layer "F.Fab")
      (effects (font (size 1 1) (thickness 0.15)))
      (tstamp 95fb659c-928f-487f-bda1-442b6b272708)
    )
    (fp_line (start 10.05 -2.45) (end 8.25 -2.45) (layer "F.SilkS") (width 0.12) (tstamp 1a16373f-9a89-4ecf-8454-05b76c0bcac8))
    (fp_line (start 10.05 -0.2) (end 9.3 -0.2) (layer "F.SilkS") (width 0.12) (tstamp 1c7ffe65-3834-4896-b740-0d2274dca394))
    (fp_line (start -0.75 -1.7) (end -0.75 -2.45) (layer "F.SilkS") (width 0.12) (tstamp 1d11afdd-ba00-44a4-84ef-d3b8b99ccfad))
    (fp_line (start -2.55 -1.7) (end -0.75 -1.7) (layer "F.SilkS") (width 0.12) (tstamp 23cb42b9-f092-4818-8120-72507925acf5))
    (fp_line (start 8.25 -1.7) (end 10.05 -1.7) (layer "F.SilkS") (width 0.12) (tstamp 2f661dbe-b07b-4d02-8b8f-9bea0b820f1a))
    (fp_line (start -0.75 -2.45) (end -2.55 -2.45) (layer "F.SilkS") (width 0.12) (tstamp 36bc8a0e-8fa8-4e23-ab5e-71b1232bc82c))
    (fp_line (start 10.06 3.51) (end 10.06 -2.46) (layer "F.SilkS") (width 0.12) (tstamp 4ceef7cb-a1f0-4818-8adb-528084939780))
    (fp_line (start 0.75 -2.45) (end 0.75 -1.7) (layer "F.SilkS") (width 0.12) (tstamp 4de105d9-e58e-4941-9165-5873f92f15ae))
    (fp_line (start 9.3 -0.2) (end 9.3 2.75) (layer "F.SilkS") (width 0.12) (tstamp 5ddff7e8-8801-4eea-9ccf-0904ecd01ca5))
    (fp_line (start 0.75 -1.7) (end 6.75 -1.7) (layer "F.SilkS") (width 0.12) (tstamp 689929c5-70ad-4d5f-97e2-310cc43ca349))
    (fp_line (start -2.56 3.51) (end 10.06 3.51) (layer "F.SilkS") (width 0.12) (tstamp 73ff4c01-6022-4a06-9bd8-1554bbf378e9))
    (fp_line (start -2.55 -0.2) (end -1.8 -0.2) (layer "F.SilkS") (width 0.12) (tstamp 75ea775f-dfd9-4a3c-9278-bf8f0cc2d8e8))
    (fp_line (start 8.25 -2.45) (end 8.25 -1.7) (layer "F.SilkS") (width 0.12) (tstamp 8a6ae931-fdd7-41bd-a445-8b6528f507ae))
    (fp_line (start -1.8 2.75) (end 3.75 2.75) (layer "F.SilkS") (width 0.12) (tstamp 8d4156f2-1d59-4790-8463-71d0c10bd5ca))
    (fp_line (start -2.55 -2.45) (end -2.55 -1.7) (layer "F.SilkS") (width 0.12) (tstamp 933a58a2-ff76-40c6-a31a-5f768f42564f))
    (fp_line (start 10.05 -1.7) (end 10.05 -2.45) (layer "F.SilkS") (width 0.12) (tstamp a63b3519-323f-4aff-8b3f-b9df7a847e0b))
    (fp_line (start -2.85 -2.75) (end -2.85 -1.5) (layer "F.SilkS") (width 0.12) (tstamp a99ec2b2-a327-4860-860d-8e31c5aec097))
    (fp_line (start -2.56 -2.46) (end -2.56 3.51) (layer "F.SilkS") (width 0.12) (tstamp ac89a9ab-53f8-4ab5-9e29-7dfaeb18403f))
    (fp_line (start 9.3 2.75) (end 3.75 2.75) (layer "F.SilkS") (width 0.12) (tstamp d1794a95-97f3-454e-8e6b-0b0ed2d7f590))
    (fp_line (start -1.6 -2.75) (end -2.85 -2.75) (layer "F.SilkS") (width 0.12) (tstamp dc644efd-700d-4d32-b3f2-90ca86491765))
    (fp_line (start 10.06 -2.46) (end -2.56 -2.46) (layer "F.SilkS") (width 0.12) (tstamp e0a88fcd-d4ae-45cd-9242-a131c15b6a4f))
    (fp_line (start -1.8 -0.2) (end -1.8 2.75) (layer "F.SilkS") (width 0.12) (tstamp e53e2729-7a78-48ec-9424-618fdddc9fce))
    (fp_line (start 6.75 -2.45) (end 0.75 -2.45) (layer "F.SilkS") (width 0.12) (tstamp f6fb68f6-992a-464a-99d1-f78bde686f98))
    (fp_line (start 6.75 -1.7) (end 6.75 -2.45) (layer "F.SilkS") (width 0.12) (tstamp fee6dcc8-0b44-4bca-b65d-127c6b8f0be8))
    (fp_line (start 10.45 -2.85) (end -2.95 -2.85) (layer "F.CrtYd") (width 0.05) (tstamp 146240ba-d1ba-4a7e-980d-18f55c223513))
    (fp_line (start 10.45 3.9) (end 10.45 -2.85) (layer "F.CrtYd") (width 0.05) (tstamp 422f0a20-fdf2-4434-8b69-9758d1ead27b))
    (fp_line (start -2.95 3.9) (end 10.45 3.9) (layer "F.CrtYd") (width 0.05) (tstamp 68e0718d-6b62-4bac-93a8-a801c4eb3f2a))
    (fp_line (start -2.95 -2.85) (end -2.95 3.9) (layer "F.CrtYd") (width 0.05) (tstamp d8e7178c-dbba-4240-831f-b3c972184bb3))
    (fp_line (start 9.95 3.4) (end 9.95 -2.35) (layer "F.Fab") (width 0.1) (tstamp 194cdb6f-614f-4295-ac2a-baa80a47282e))
    (fp_line (start -0.625 -2.35) (end 0 -1.35) (layer "F.Fab") (width 0.1) (tstamp 31d48f66-419f-4d80-b898-f24b0d43e53a))
    (fp_line (start 0 -1.35) (end 0.625 -2.35) (layer "F.Fab") (width 0.1) (tstamp 4ee4bdad-b8ed-4eac-93f1-04e5d3fa6a6b))
    (fp_line (start -2.45 3.4) (end 9.95 3.4) (layer "F.Fab") (width 0.1) (tstamp 9ed52820-db7d-435a-a815-d276f9f6f228))
    (fp_line (start -2.45 -2.35) (end -2.45 3.4) (layer "F.Fab") (width 0.1) (tstamp a6c11431-3770-49b8-b271-669a47d36600))
    (fp_line (start 9.95 -2.35) (end -2.45 -2.35) (layer "F.Fab") (width 0.1) (tstamp d43d6034-257c-4fcd-82af-71387485e1bc))
    (pad "1" thru_hole roundrect (at 0 0 270) (size 1.7 1.95) (drill 0.95) (layers *.Cu *.Mask) (roundrect_rratio 0.1470588235)
      (net 11 "/VR") (pinfunction "Pin_1") (pintype "passive") (tstamp e096d262-f223-4c66-afc9-6ba3cf59f65a))
    (pad "2" thru_hole oval (at 2.5 0 270) (size 1.7 1.95) (drill 0.95) (layers *.Cu *.Mask)
      (net 9 "/IN") (pinfunction "Pin_2") (pintype "passive") (tstamp c236d6fe-c713-4c50-89c2-d7463ff80f14))
    (pad "3" thru_hole oval (at 5 0 270) (size 1.7 1.95) (drill 0.95) (layers *.Cu *.Mask)
      (net 15 "GND") (pinfunction "Pin_3") (pintype "passive") (tstamp 076aa9f1-82f2-4ee0-8734-d06db4e11017))
    (pad "4" thru_hole oval (at 7.5 0 270) (size 1.7 1.95) (drill 0.95) (layers *.Cu *.Mask)
      (net 10 "/OUT") (pinfunction "Pin_4") (pintype "passive") (tstamp 2d6c4d97-374c-481a-804d-9d52f424869b))
    (model "${KICAD6_3DMODEL_DIR}/Connector_JST.3dshapes/JST_XH_B4B-XH-A_1x04_P2.50mm_Vertical.wrl"
      (offset (xyz 0 0 0))
      (scale (xyz 1 1 1))
      (rotate (xyz 0 0 0))
    )
  )

  (footprint "Resistor_SMD:R_0603_1608Metric" (layer "F.Cu")
    (tedit 5F68FEEE) (tstamp e24dbacd-d176-48b7-9746-467189965e75)
    (at 120.142 82.55)
    (descr "Resistor SMD 0603 (1608 Metric), square (rectangular) end terminal, IPC_7351 nominal, (Body size source: IPC-SM-782 page 72, https://www.pcb-3d.com/wordpress/wp-content/uploads/ipc-sm-782a_amendment_1_and_2.pdf), generated with kicad-footprint-generator")
    (tags "resistor")
    (property "Sheetfile" "stepper-adapter.kicad_sch")
    (property "Sheetname" "")
    (path "/40ec0b60-a17c-4352-95f0-c13e758a9533")
    (attr smd)
    (fp_text reference "R4" (at 0 -1.43) (layer "F.SilkS") hide
      (effects (font (size 1 1) (thickness 0.15)))
      (tstamp b401a649-c423-4186-b7f3-3569d4a94645)
    )
    (fp_text value "1.5K" (at 0 1.43) (layer "F.Fab")
      (effects (font (size 1 1) (thickness 0.15)))
      (tstamp 6b72e2aa-7bfa-49eb-8be2-0164da1e5916)
    )
    (fp_text user "${REFERENCE}" (at 0 0) (layer "F.Fab")
      (effects (font (size 0.4 0.4) (thickness 0.06)))
      (tstamp e39b79d8-312c-462a-a476-10dd1fcd46dd)
    )
    (fp_line (start -0.237258 0.5225) (end 0.237258 0.5225) (layer "F.SilkS") (width 0.12) (tstamp 87eb5203-b5f0-49b8-b84d-3fc414263338))
    (fp_line (start -0.237258 -0.5225) (end 0.237258 -0.5225) (layer "F.SilkS") (width 0.12) (tstamp 96725f06-f9f1-49a4-be15-2c43dd225515))
    (fp_line (start 1.48 0.73) (end -1.48 0.73) (layer "F.CrtYd") (width 0.05) (tstamp 101bb3ea-4616-423f-b814-67a74d14d84b))
    (fp_line (start 1.48 -0.73) (end 1.48 0.73) (layer "F.CrtYd") (width 0.05) (tstamp 1f6e130d-b0bc-4a31-b64b-0819d7d64a71))
    (fp_line (start -1.48 0.73) (end -1.48 -0.73) (layer "F.CrtYd") (width 0.05) (tstamp 8fcb2545-f9a9-429e-b7b5-e7cffad55819))
    (fp_line (start -1.48 -0.73) (end 1.48 -0.73) (layer "F.CrtYd") (width 0.05) (tstamp e75ffd30-a281-4a8d-beed-90bc54d610c9))
    (fp_line (start 0.8 -0.4125) (end 0.8 0.4125) (layer "F.Fab") (width 0.1) (tstamp 427022ba-d749-44d1-b748-3cc22b798314))
    (fp_line (start -0.8 0.4125) (end -0.8 -0.4125) (layer "F.Fab") (width 0.1) (tstamp 4630e1a9-3a86-4b46-86ce-b4d6b61c066e))
    (fp_line (start -0.8 -0.4125) (end 0.8 -0.4125) (layer "F.Fab") (width 0.1) (tstamp 7d74360b-e0d0-4994-af57-55cd295de153))
    (fp_line (start 0.8 0.4125) (end -0.8 0.4125) (layer "F.Fab") (width 0.1) (tstamp d21f8d34-6398-4a15-8029-650cca226ae6))
    (pad "1" smd roundrect (at -0.825 0) (size 0.8 0.95) (layers "F.Cu" "F.Paste" "F.Mask") (roundrect_rratio 0.25)
      (net 9 "/IN") (pintype "passive") (tstamp dd3467ad-1105-4768-8a54-dcd2b40d6c59))
    (pad "2" smd roundrect (at 0.825 0) (size 0.8 0.95) (layers "F.Cu" "F.Paste" "F.Mask") (roundrect_rratio 0.25)
      (net 17 "Net-(D2-Pad2)") (pintype "passive") (tstamp e5e0d06b-4807-452c-bdad-6a62375d7f07))
    (model "${KICAD6_3DMODEL_DIR}/Resistor_SMD.3dshapes/R_0603_1608Metric.wrl"
      (offset (xyz 0 0 0))
      (scale (xyz 1 1 1))
      (rotate (xyz 0 0 0))
    )
  )

  (footprint "LED_SMD:LED_0603_1608Metric" (layer "F.Cu")
    (tedit 5F68FEF1) (tstamp fad31607-94f8-4a7f-b396-bd1e419b92a6)
    (at 123.444 82.55 180)
    (descr "LED SMD 0603 (1608 Metric), square (rectangular) end terminal, IPC_7351 nominal, (Body size source: http://www.tortai-tech.com/upload/download/2011102023233369053.pdf), generated with kicad-footprint-generator")
    (tags "LED")
    (property "Sheetfile" "stepper-adapter.kicad_sch")
    (property "Sheetname" "")
    (path "/e7cbfc5e-9bda-4647-b9d6-63ad02a6bee2")
    (attr smd)
    (fp_text reference "D2" (at 0 -1.43) (layer "F.SilkS") hide
      (effects (font (size 1 1) (thickness 0.15)))
      (tstamp 4146f1fb-6045-42e3-895d-993c7fa8b1e0)
    )
    (fp_text value "RED" (at 0 1.43) (layer "F.Fab")
      (effects (font (size 1 1) (thickness 0.15)))
      (tstamp d61719fd-f46a-476d-8d38-276b1bef34ef)
    )
    (fp_text user "${REFERENCE}" (at 0 0) (layer "F.Fab")
      (effects (font (size 0.4 0.4) (thickness 0.06)))
      (tstamp 19fa285a-1f2c-4a7b-8a73-14040f826425)
    )
    (fp_line (start 0.8 -0.735) (end -1.485 -0.735) (layer "F.SilkS") (width 0.12) (tstamp 6e2286f8-f82e-4c49-bf50-d3e4ff41f12a))
    (fp_line (start -1.485 0.735) (end 0.8 0.735) (layer "F.SilkS") (width 0.12) (tstamp 8b9640bd-9317-4b02-866f-ec76f230e33f))
    (fp_line (start -1.485 -0.735) (end -1.485 0.735) (layer "F.SilkS") (width 0.12) (tstamp ff9b4959-1216-45f6-8ac8-eee1feb071df))
    (fp_line (start 1.48 -0.73) (end 1.48 0.73) (layer "F.CrtYd") (width 0.05) (tstamp 181bffa1-1cf0-4c99-8976-93282855fe26))
    (fp_line (start -1.48 -0.73) (end 1.48 -0.73) (layer "F.CrtYd") (width 0.05) (tstamp 36c2ba9d-e7bf-4c38-b92a-d94ba399676b))
    (fp_line (start 1.48 0.73) (end -1.48 0.73) (layer "F.CrtYd") (width 0.05) (tstamp 49529daf-f066-4b9d-9ee6-4d2525063eb4))
    (fp_line (start -1.48 0.73) (end -1.48 -0.73) (layer "F.CrtYd") (width 0.05) (tstamp 4a19f627-dcfb-4be9-836a-1e9353a7d0aa))
    (fp_line (start -0.8 -0.1) (end -0.8 0.4) (layer "F.Fab") (width 0.1) (tstamp 04d0aa71-7c3d-4fc0-b530-a59203a53b31))
    (fp_line (start -0.5 -0.4) (end -0.8 -0.1) (layer "F.Fab") (width 0.1) (tstamp 10156453-9b98-46b2-85e7-4fd3b2ba98cc))
    (fp_line (start 0.8 0.4) (end 0.8 -0.4) (layer "F.Fab") (width 0.1) (tstamp 1b9191e1-0546-4694-998a-cfa530b7f6d1))
    (fp_line (start -0.8 0.4) (end 0.8 0.4) (layer "F.Fab") (width 0.1) (tstamp 2a665621-a903-44e1-a071-d787c8381c9c))
    (fp_line (start 0.8 -0.4) (end -0.5 -0.4) (layer "F.Fab") (width 0.1) (tstamp 53cd95e2-dbfb-48b6-abc6-91a2fc94f6e8))
    (pad "1" smd roundrect (at -0.7875 0 180) (size 0.875 0.95) (layers "F.Cu" "F.Paste" "F.Mask") (roundrect_rratio 0.25)
      (net 15 "GND") (pinfunction "K") (pintype "passive") (tstamp 4bbce12b-e16c-4b3e-92f5-312b2f724446))
    (pad "2" smd roundrect (at 0.7875 0 180) (size 0.875 0.95) (layers "F.Cu" "F.Paste" "F.Mask") (roundrect_rratio 0.25)
      (net 17 "Net-(D2-Pad2)") (pinfunction "A") (pintype "passive") (tstamp 22a48ef7-a755-4b35-9e9a-98b42518d322))
    (model "${KICAD6_3DMODEL_DIR}/LED_SMD.3dshapes/LED_0603_1608Metric.wrl"
      (offset (xyz 0 0 0))
      (scale (xyz 1 1 1))
      (rotate (xyz 0 0 0))
    )
  )

  (footprint "Connector_PinHeader_2.54mm:PinHeader_1x02_P2.54mm_Vertical" (layer "B.Cu")
    (tedit 59FED5CC) (tstamp 280e9240-7339-4e35-9e16-cf63c1533307)
    (at 118.11 64.77 -90)
    (descr "Through hole straight pin header, 1x02, 2.54mm pitch, single row")
    (tags "Through hole pin header THT 1x02 2.54mm single row")
    (property "Sheetfile" "stepper-adapter.kicad_sch")
    (property "Sheetname" "")
    (path "/69393be6-d862-4795-9c8e-33dc262e544f")
    (attr through_hole)
    (fp_text reference "J2" (at 0 2.33 90) (layer "B.SilkS")
      (effects (font (size 1 1) (thickness 0.15)) (justify mirror))
      (tstamp c680ee7c-db06-4d5e-bf68-e1b7d09a19af)
    )
    (fp_text value "Stepper-Top" (at 0 -4.87 90) (layer "B.Fab")
      (effects (font (size 1 1) (thickness 0.15)) (justify mirror))
      (tstamp cc180fc5-c6ef-4cea-b15a-5d8d10701ac0)
    )
    (fp_text user "${REFERENCE}" (at 0 -1.27) (layer "B.Fab")
      (effects (font (size 1 1) (thickness 0.15)) (justify mirror))
      (tstamp 96d46b84-a098-4f7e-9cb1-1a8e7afd831c)
    )
    (fp_line (start -1.33 0) (end -1.33 1.33) (layer "B.SilkS") (width 0.12) (tstamp 01da03a6-21f7-4ee5-85ac-4d5d1c93e3f6))
    (fp_line (start -1.33 1.33) (end 0 1.33) (layer "B.SilkS") (width 0.12) (tstamp 5047f35a-3409-43c8-9725-3c93d0ddce11))
    (fp_line (start -1.33 -1.27) (end 1.33 -1.27) (layer "B.SilkS") (width 0.12) (tstamp 7f9cbf2e-1ccb-42da-b5bf-11b68357f41d))
    (fp_line (start -1.33 -3.87) (end 1.33 -3.87) (layer "B.SilkS") (width 0.12) (tstamp d1bb09b8-5635-4018-af74-5895e6ff3051))
    (fp_line (start -1.33 -1.27) (end -1.33 -3.87) (layer "B.SilkS") (width 0.12) (tstamp ee2e57db-2b2b-403b-9c27-cdc8be3bd746))
    (fp_line (start 1.33 -1.27) (end 1.33 -3.87) (layer "B.SilkS") (width 0.12) (tstamp ff26b294-2649-451f-9769-9de6cefa6f6f))
    (fp_line (start 1.8 -4.35) (end 1.8 1.8) (layer "B.CrtYd") (width 0.05) (tstamp 1f8174e9-5e28-4137-a8f3-0a92a977da42))
    (fp_line (start -1.8 1.8) (end -1.8 -4.35) (layer "B.CrtYd") (width 0.05) (tstamp 80ad16e0-405f-4fa4-bb4d-a39135ab63ac))
    (fp_line (start 1.8 1.8) (end -1.8 1.8) (layer "B.CrtYd") (width 0.05) (tstamp bedd05f5-1831-4a9c-b12d-c8cf0abe29ef))
    (fp_line (start -1.8 -4.35) (end 1.8 -4.35) (layer "B.CrtYd") (width 0.05) (tstamp e02e7f04-a1e5-44f2-a5da-d2cdc25f1db1))
    (fp_line (start -0.635 1.27) (end 1.27 1.27) (layer "B.Fab") (width 0.1) (tstamp 32b063fa-d2f0-4a8b-b9b8-6da491e9e20d))
    (fp_line (start 1.27 1.27) (end 1.27 -3.81) (layer "B.Fab") (width 0.1) (tstamp 34f5596a-fe05-4c8c-8fa6-e4730457de7e))
    (fp_line (start 1.27 -3.81) (end -1.27 -3.81) (layer "B.Fab") (width 0.1) (tstamp 63280b20-9eb0-4a43-8bd8-45d194c6519d))
    (fp_line (start -1.27 0.635) (end -0.635 1.27) (layer "B.Fab") (width 0.1) (tstamp 6a2cd7ee-f231-42ca-ae19-f2deaa907479))
    (fp_line (start -1.27 -3.81) (end -1.27 0.635) (layer "B.Fab") (width 0.1) (tstamp cc881bd2-dfb7-41ec-a7eb-dabd35f7ea33))
    (pad "1" thru_hole rect (at 0 0 270) (size 1.7 1.7) (drill 1) (layers *.Cu *.Mask)
      (net 18 "/DIAG") (pinfunction "Pin_1") (pintype "passive") (tstamp 02fe4100-aad5-46a7-8945-527fb4620241))
    (pad "2" thru_hole oval (at 0 -2.54 270) (size 1.7 1.7) (drill 1) (layers *.Cu *.Mask)
      (net 8 "unconnected-(J2-Pad2)") (pinfunction "Pin_2") (pintype "passive") (tstamp b74b4bba-7a1f-462b-99d3-bb71e08651f2))
    (model "${KICAD6_3DMODEL_DIR}/Connector_PinHeader_2.54mm.3dshapes/PinHeader_1x02_P2.54mm_Vertical.wrl"
      (offset (xyz 0 0 0))
      (scale (xyz 1 1 1))
      (rotate (xyz 0 0 0))
    )
  )

  (footprint "Connector_PinHeader_2.54mm:PinHeader_1x08_P2.54mm_Vertical" (layer "B.Cu")
    (tedit 59FED5CC) (tstamp 4b13540d-c41d-42fb-b763-f58462cebe83)
    (at 115.57 64.785 180)
    (descr "Through hole straight pin header, 1x08, 2.54mm pitch, single row")
    (tags "Through hole pin header THT 1x08 2.54mm single row")
    (property "Sheetfile" "stepper-adapter.kicad_sch")
    (property "Sheetname" "")
    (path "/2b0f6f04-d1fd-4d35-af76-5b4608bd4299")
    (attr through_hole)
    (fp_text reference "J1" (at 0 2.33) (layer "B.SilkS") hide
      (effects (font (size 1 1) (thickness 0.15)) (justify mirror))
      (tstamp a76fbf0a-7153-4d8f-af68-c2f3055c1901)
    )
    (fp_text value "Stepper-Left" (at 0 -20.11) (layer "B.Fab")
      (effects (font (size 1 1) (thickness 0.15)) (justify mirror))
      (tstamp 46284cb3-1c1c-4146-a486-a53816f2502a)
    )
    (fp_text user "${REFERENCE}" (at 0 -8.89 90) (layer "B.Fab")
      (effects (font (size 1 1) (thickness 0.15)) (justify mirror))
      (tstamp bd31012a-82f8-4fbd-a101-afd1b2845718)
    )
    (fp_line (start -1.33 -1.27) (end -1.33 -19.11) (layer "B.SilkS") (width 0.12) (tstamp 02376742-745c-4fe5-82c0-b6b536da8163))
    (fp_line (start -1.33 0) (end -1.33 1.33) (layer "B.SilkS") (width 0.12) (tstamp 72fa1cb0-0f65-4c1b-b029-3091a9cb46d3))
    (fp_line (start -1.33 -19.11) (end 1.33 -19.11) (layer "B.SilkS") (width 0.12) (tstamp 8a41d625-fedc-43ce-b661-17c68c409997))
    (fp_line (start -1.33 1.33) (end 0 1.33) (layer "B.SilkS") (width 0.12) (tstamp bb9e0592-a48f-4e5e-a96b-a7053d90e68f))
    (fp_line (start -1.33 -1.27) (end 1.33 -1.27) (layer "B.SilkS") (width 0.12) (tstamp e624506d-9128-4fd5-bad1-1da9d3b20797))
    (fp_line (start 1.33 -1.27) (end 1.33 -19.11) (layer "B.SilkS") (width 0.12) (tstamp f9d80813-bd0b-421c-9b49-a7120402698e))
    (fp_line (start -1.8 -19.55) (end 1.8 -19.55) (layer "B.CrtYd") (width 0.05) (tstamp 105b5587-ad76-41a3-87b6-feaa1b745fc6))
    (fp_line (start -1.8 1.8) (end -1.8 -19.55) (layer "B.CrtYd") (width 0.05) (tstamp 527cdb86-8f4d-4205-8990-f61a4ea78288))
    (fp_line (start 1.8 -19.55) (end 1.8 1.8) (layer "B.CrtYd") (width 0.05) (tstamp 63e28f7c-c274-413d-9813-dee85aa0b02e))
    (fp_line (start 1.8 1.8) (end -1.8 1.8) (layer "B.CrtYd") (width 0.05) (tstamp f9f8bf3d-b8eb-46a7-8602-ae073648f866))
    (fp_line (start -0.635 1.27) (end 1.27 1.27) (layer "B.Fab") (width 0.1) (tstamp 2c4971d1-54de-4e1c-b31a-0d71fad14d97))
    (fp_line (start 1.27 1.27) (end 1.27 -19.05) (layer "B.Fab") (width 0.1) (tstamp 341c5b2e-348e-4e7a-922b-be0e0af3850c))
    (fp_line (start 1.27 -19.05) (end -1.27 -19.05) (layer "B.Fab") (width 0.1) (tstamp 5927ac31-6069-4c42-8156-239326f8383e))
    (fp_line (start -1.27 0.635) (end -0.635 1.27) (layer "B.Fab") (width 0.1) (tstamp 94209174-9f56-4c8d-aafa-22cbecdbd57e))
    (fp_line (start -1.27 -19.05) (end -1.27 0.635) (layer "B.Fab") (width 0.1) (tstamp dc9aba31-578e-4fc2-aa06-bd7b3eba4a55))
    (pad "1" thru_hole rect (at 0 0 180) (size 1.7 1.7) (drill 1) (layers *.Cu *.Mask)
      (net 1 "unconnected-(J1-Pad1)") (pinfunction "Pin_1") (pintype "passive") (tstamp 340dbe1c-dafe-4e7a-a7fb-f9310c95e5c2))
    (pad "2" thru_hole oval (at 0 -2.54 180) (size 1.7 1.7) (drill 1) (layers *.Cu *.Mask)
      (net 2 "unconnected-(J1-Pad2)") (pinfunction "Pin_2") (pintype "passive") (tstamp 47bf3ced-b3c2-48a5-b5ac-d0d1fac4d0e4))
    (pad "3" thru_hole oval (at 0 -5.08 180) (size 1.7 1.7) (drill 1) (layers *.Cu *.Mask)
      (net 3 "unconnected-(J1-Pad3)") (pinfunction "Pin_3") (pintype "passive") (tstamp a09380be-2b21-4bae-8a2a-62ee91e8cd32))
    (pad "4" thru_hole oval (at 0 -7.62 180) (size 1.7 1.7) (drill 1) (layers *.Cu *.Mask)
      (net 4 "unconnected-(J1-Pad4)") (pinfunction "Pin_4") (pintype "passive") (tstamp 670fa61c-a386-456d-ad11-b960dcbbba26))
    (pad "5" thru_hole oval (at 0 -10.16 180) (size 1.7 1.7) (drill 1) (layers *.Cu *.Mask)
      (net 5 "unconnected-(J1-Pad5)") (pinfunction "Pin_5") (pintype "passive") (tstamp fc8989dc-10fc-49d0-bfd2-25a694358261))
    (pad "6" thru_hole oval (at 0 -12.7 180) (size 1.7 1.7) (drill 1) (layers *.Cu *.Mask)
      (net 6 "unconnected-(J1-Pad6)") (pinfunction "Pin_6") (pintype "passive") (tstamp 0ea73062-d308-4b96-8df6-bef0bca66643))
    (pad "7" thru_hole oval (at 0 -15.24 180) (size 1.7 1.7) (drill 1) (layers *.Cu *.Mask)
      (net 9 "/IN") (pinfunction "Pin_7") (pintype "passive") (tstamp 34185f88-c28d-46f2-a644-25f9a6264cf0))
    (pad "8" thru_hole oval (at 0 -17.78 180) (size 1.7 1.7) (drill 1) (layers *.Cu *.Mask)
      (net 7 "unconnected-(J1-Pad8)") (pinfunction "Pin_8") (pintype "passive") (tstamp afe38fa3-a6ea-4832-8c83-7d033dd67b86))
    (model "${KICAD6_3DMODEL_DIR}/Connector_PinHeader_2.54mm.3dshapes/PinHeader_1x08_P2.54mm_Vertical.wrl"
      (offset (xyz 0 0 0))
      (scale (xyz 1 1 1))
      (rotate (xyz 0 0 0))
    )
  )

  (footprint "Connector_PinHeader_2.54mm:PinHeader_1x08_P2.54mm_Vertical" (layer "B.Cu")
    (tedit 59FED5CC) (tstamp fd1ce9cb-0c1e-49ad-8f20-b447fc884351)
    (at 128.27 64.77 180)
    (descr "Through hole straight pin header, 1x08, 2.54mm pitch, single row")
    (tags "Through hole pin header THT 1x08 2.54mm single row")
    (property "Sheetfile" "stepper-adapter.kicad_sch")
    (property "Sheetname" "")
    (path "/aafc022a-36a6-4942-996d-bec4ba2fa6cb")
    (attr through_hole)
    (fp_text reference "J3" (at 0 2.33) (layer "B.SilkS") hide
      (effects (font (size 1 1) (thickness 0.15)) (justify mirror))
      (tstamp 18ce8600-e9e5-44e7-b393-b01e6d94a972)
    )
    (fp_text value "Stepper-Right" (at 0 -20.11) (layer "B.Fab")
      (effects (font (size 1 1) (thickness 0.15)) (justify mirror))
      (tstamp 51d36bb3-d748-4b73-8a50-52c4c96309df)
    )
    (fp_text user "${REFERENCE}" (at 0 -8.89 90) (layer "B.Fab")
      (effects (font (size 1 1) (thickness 0.15)) (justify mirror))
      (tstamp a3264f60-15c2-413b-ae0a-88bcc8749708)
    )
    (fp_line (start -1.33 0) (end -1.33 1.33) (layer "B.SilkS") (width 0.12) (tstamp 0b7c0c0c-16f4-4ce2-ab87-b7881f132d36))
    (fp_line (start 1.33 -1.27) (end 1.33 -19.11) (layer "B.SilkS") (width 0.12) (tstamp 5f97ec7e-11e4-4ef0-83f1-30bbc75dcc41))
    (fp_line (start -1.33 1.33) (end 0 1.33) (layer "B.SilkS") (width 0.12) (tstamp 8caba15d-db1c-407c-838b-0558531d063e))
    (fp_line (start -1.33 -19.11) (end 1.33 -19.11) (layer "B.SilkS") (width 0.12) (tstamp b0386414-4eba-48a4-bd5e-efd3f9698c6a))
    (fp_line (start -1.33 -1.27) (end 1.33 -1.27) (layer "B.SilkS") (width 0.12) (tstamp b661656b-1c4c-4b62-a573-872417cb7123))
    (fp_line (start -1.33 -1.27) (end -1.33 -19.11) (layer "B.SilkS") (width 0.12) (tstamp b68daeba-9bc6-4f03-bcec-fe899eb07bf6))
    (fp_line (start -1.8 -19.55) (end 1.8 -19.55) (layer "B.CrtYd") (width 0.05) (tstamp 16c3f1bb-ce17-4b77-a111-a3299f43094e))
    (fp_line (start 1.8 1.8) (end -1.8 1.8) (layer "B.CrtYd") (width 0.05) (tstamp 28d8f199-c741-47a9-8e87-9fd468f3051a))
    (fp_line (start 1.8 -19.55) (end 1.8 1.8) (layer "B.CrtYd") (width 0.05) (tstamp 4a5f8f99-4a9b-445a-a860-e2ae57497a66))
    (fp_line (start -1.8 1.8) (end -1.8 -19.55) (layer "B.CrtYd") (width 0.05) (tstamp d2cc62de-13dc-4ab1-b76c-eb1007caed13))
    (fp_line (start 1.27 1.27) (end 1.27 -19.05) (layer "B.Fab") (width 0.1) (tstamp 6b5a0eff-62c0-4b43-85fb-2edd47c53651))
    (fp_line (start -0.635 1.27) (end 1.27 1.27) (layer "B.Fab") (width 0.1) (tstamp 8b63cff4-1c4d-45d2-a9ca-e54994afd16f))
    (fp_line (start -1.27 0.635) (end -0.635 1.27) (layer "B.Fab") (width 0.1) (tstamp be929556-30cc-4cc9-b2c8-ce3c2135cf88))
    (fp_line (start 1.27 -19.05) (end -1.27 -19.05) (layer "B.Fab") (width 0.1) (tstamp c517acfa-c23e-4a2c-8918-f90f520fb2cc))
    (fp_line (start -1.27 -19.05) (end -1.27 0.635) (layer "B.Fab") (width 0.1) (tstamp e943eef4-8efb-4f99-9243-ba936d9c03c6))
    (pad "1" thru_hole rect (at 0 0 180) (size 1.7 1.7) (drill 1) (layers *.Cu *.Mask)
      (net 19 "/VM") (pinfunction "Pin_1") (pintype "passive") (tstamp 170ce8fb-9bd4-4a85-ad68-b16d3b4f09ab))
    (pad "2" thru_hole oval (at 0 -2.54 180) (size 1.7 1.7) (drill 1) (layers *.Cu *.Mask)
      (net 15 "GND") (pinfunction "Pin_2") (pintype "passive") (tstamp 00678231-7bfd-42fa-9b5f-8e3c65b43d37))
    (pad "3" thru_hole oval (at 0 -5.08 180) (size 1.7 1.7) (drill 1) (layers *.Cu *.Mask)
      (net 11 "/VR") (pinfunction "Pin_3") (pintype "passive") (tstamp 13dc8acf-debb-4c0b-b757-06909930af40))
    (pad "4" thru_hole oval (at 0 -7.62 180) (size 1.7 1.7) (drill 1) (layers *.Cu *.Mask)
      (net 9 "/IN") (pinfunction "Pin_4") (pintype "passive") (tstamp 3a2f145c-8556-4aef-b8ab-ec59082e2794))
    (pad "5" thru_hole oval (at 0 -10.16 180) (size 1.7 1.7) (drill 1) (layers *.Cu *.Mask)
      (net 15 "GND") (pinfunction "Pin_5") (pintype "passive") (tstamp f79c427d-62f2-4df9-ab7a-984c954bee78))
    (pad "6" thru_hole oval (at 0 -12.7 180) (size 1.7 1.7) (drill 1) (layers *.Cu *.Mask)
      (net 10 "/OUT") (pinfunction "Pin_6") (pintype "passive") (tstamp 71b88c84-f87b-47cd-9bd8-b7ed76c30512))
    (pad "7" thru_hole oval (at 0 -15.24 180) (size 1.7 1.7) (drill 1) (layers *.Cu *.Mask)
      (net 13 "unconnected-(J3-Pad7)") (pinfunction "Pin_7") (pintype "passive") (tstamp d0eb81c2-fae2-4ca7-abd7-3b09d7ed2584))
    (pad "8" thru_hole oval (at 0 -17.78 180) (size 1.7 1.7) (drill 1) (layers *.Cu *.Mask)
      (net 14 "unconnected-(J3-Pad8)") (pinfunction "Pin_8") (pintype "passive") (tstamp 7c8df3db-74ef-48a3-9e68-559d773366ac))
    (model "${KICAD6_3DMODEL_DIR}/Connector_PinHeader_2.54mm.3dshapes/PinHeader_1x08_P2.54mm_Vertical.wrl"
      (offset (xyz 0 0 0))
      (scale (xyz 1 1 1))
      (rotate (xyz 0 0 0))
    )
  )

  (gr_line (start 129.54 63.5) (end 129.54 83.82) (layer "Edge.Cuts") (width 0.1) (tstamp 4fe46a8b-c21d-4c40-b456-12100462c908))
  (gr_line (start 114.3 63.5) (end 129.54 63.5) (layer "Edge.Cuts") (width 0.1) (tstamp 56114d2c-2cd8-4456-b4ad-26282263e451))
  (gr_line (start 114.3 83.82) (end 114.3 63.5) (layer "Edge.Cuts") (width 0.1) (tstamp 57753b7a-d614-475c-aab6-9594fcee828d))
  (gr_line (start 129.54 83.82) (end 114.3 83.82) (layer "Edge.Cuts") (width 0.1) (tstamp a2767146-bc17-4cc3-86fa-b7e91e5eceb6))
  (gr_text "Stepper-Adapter Rev.A" (at 126.492 74.93 90) (layer "F.SilkS") (tstamp d06ff240-2ea7-4ee0-9f8d-11d09fb25de2)
    (effects (font (size 1 1) (thickness 0.15)))
  )

  (segment (start 118.11 80.772) (end 117.348 80.01) (width 0.25) (layer "F.Cu") (net 9) (tstamp 35f79f9d-e148-4df2-825c-ea4a17597eff))
  (segment (start 117.333 75.199) (end 117.856 74.676) (width 0.25) (layer "F.Cu") (net 9) (tstamp 3e8e8ba0-7b9e-48b7-bc6a-65dd94bd812d))
  (segment (start 125.329 73.68) (end 126.619 72.39) (width 0.25) (layer "F.Cu") (net 9) (tstamp 40265286-bf2c-4cec-ae93-3d403f7bd2f5))
  (segment (start 118.618 82.55) (end 119.317 82.55) (width 0.25) (layer "F.Cu") (net 9) (tstamp 4a263d97-9190-441f-8ac3-2fe674e5efa6))
  (segment (start 118.11 82.042) (end 118.11 80.772) (width 0.25) (layer "F.Cu") (net 9) (tstamp 766c3b41-8ae3-491f-8f0c-031a1ca09286))
  (segment (start 120.904 74.676) (end 121.9 73.68) (width 0.25) (layer "F.Cu") (net 9) (tstamp 7a4c6a85-7ec2-48d7-86dd-738af9965732))
  (segment (start 121.9 73.68) (end 123.08 73.68) (width 0.25) (layer "F.Cu") (net 9) (tstamp 7d87ccc4-8d35-48b5-95b6-91c444cce414))
  (segment (start 117.333 80.025) (end 115.57 80.025) (width 0.25) (layer "F.Cu") (net 9) (tstamp 8262b079-6275-4d7e-929d-8a745c58e689))
  (segment (start 126.619 72.39) (end 128.27 72.39) (width 0.25) (layer "F.Cu") (net 9) (tstamp 9e988de4-07ec-4598-9174-f188c2ec99b6))
  (segment (start 117.856 74.676) (end 120.904 74.676) (width 0.25) (layer "F.Cu") (net 9) (tstamp c55382f1-bde9-4073-95ef-5077cff937e8))
  (segment (start 123.08 73.68) (end 125.329 73.68) (width 0.25) (layer "F.Cu") (net 9) (tstamp cbb3102e-77c5-43ee-9025-efe54066998a))
  (segment (start 118.618 82.55) (end 118.11 82.042) (width 0.25) (layer "F.Cu") (net 9) (tstamp e5ceb39f-355d-4759-9cfe-4915a9b25d01))
  (segment (start 117.348 80.01) (end 117.333 80.025) (width 0.25) (layer "F.Cu") (net 9) (tstamp ec0e988f-7c1f-458f-a7d8-c307d15cc70a))
  (segment (start 117.333 80.025) (end 117.333 75.199) (width 0.25) (layer "F.Cu") (net 9) (tstamp f8566f37-b483-4f0f-b182-e36db18f25bb))
  (segment (start 118.364 78.7655) (end 122.9945 78.7655) (width 0.25) (layer "F.Cu") (net 10) (tstamp 1080386d-b86f-4967-ae54-edebdd78b0ee))
  (segment (start 126.746 77.47) (end 125.536 78.68) (width 0.25) (layer "F.Cu") (net 10) (tstamp 2497bb38-a0a8-4f28-b8e2-2697af90ed7c))
  (segment (start 125.536 78.68) (end 123.08 78.68) (width 0.25) (layer "F.Cu") (net 10) (tstamp 48cf93e2-dd74-4c97-ba6e-5889e8cc0db9))
  (segment (start 122.9945 78.7655) (end 123.08 78.68) (width 0.25) (layer "F.Cu") (net 10) (tstamp 7dfd7e3d-5bef-4cea-bfc3-8b0c4351a88e))
  (segment (start 128.27 77.47) (end 126.746 77.47) (width 0.25) (layer "F.Cu") (net 10) (tstamp d28a24bb-223a-4681-9e33-3424562f4c67))
  (segment (start 124.3095 64.77) (end 124.3095 68.1755) (width 1) (layer "F.Cu") (net 11) (tstamp 19d2c53c-96e8-4712-b1d3-c50d33d3f68e))
  (segment (start 124.3095 68.1755) (end 125.984 69.85) (width 1) (layer "F.Cu") (net 11) (tstamp 25862dba-416e-4baf-9983-92737e201856))
  (segment (start 127.254 69.85) (end 125.984 69.85) (width 1.5) (layer "F.Cu") (net 11) (tstamp 4a90901a-5569-4ea4-9e16-dcf8c5c68bba))
  (segment (start 128.27 69.85) (end 127.254 69.85) (width 1.5) (layer "F.Cu") (net 11) (tstamp 51ac5c19-3a33-4b26-bd3e-f127ce2bd538))
  (segment (start 124.654 71.18) (end 123.08 71.18) (width 1.5) (layer "F.Cu") (net 11) (tstamp 8c54b726-7363-4aab-a64a-c8fcbcd0d6bd))
  (segment (start 124.3095 64.77) (end 124.3095 65.6355) (width 1) (layer "F.Cu") (net 11) (tstamp b506e2ea-723f-46d1-a78f-a8b903acdbb3))
  (segment (start 124.714 66.04) (end 124.714 67.945) (width 1) (layer "F.Cu") (net 11) (tstamp c1dd5e8e-014c-46cf-9593-f0a49b6b1848))
  (segment (start 124.714 67.945) (end 126.619 69.85) (width 1) (layer "F.Cu") (net 11) (tstamp d3fee99d-da15-4dd8-8dcf-76305ac9f92f))
  (segment (start 125.984 69.85) (end 124.654 71.18) (width 1.5) (layer "F.Cu") (net 11) (tstamp dc6c7dae-d985-4642-9e01-8a76d2ecfe24))
  (segment (start 126.619 69.85) (end 127.254 69.85) (width 1) (layer "F.Cu") (net 11) (tstamp edee59f2-1785-4d2b-b4c9-1738e980a80b))
  (segment (start 124.3095 65.6355) (end 124.714 66.04) (width 1) (layer "F.Cu") (net 11) (tstamp f737cf82-7966-48f5-bbd1-8e1f8ecff535))
  (segment (start 118.364 77.1905) (end 118.364 75.501) (width 0.25) (layer "F.Cu") (net 12) (tstamp f5930a34-9df3-4c74-975c-f9b3aae95c32))
  (segment (start 119.3545 67.31) (end 118.11 67.31) (width 0.25) (layer "F.Cu") (net 15) (tstamp 91a57a14-95a1-4a61-ab0d-6edda3d444e7))
  (segment (start 124.3585 82.55) (end 125.476 82.55) (width 0.25) (layer "F.Cu") (net 15) (tstamp cb62c87c-70bb-4a7d-8954-8c04c6916edd))
  (segment (start 118.364 70.422) (end 118.364 69.342) (width 0.25) (layer "F.Cu") (net 15) (tstamp e8f1026d-a713-4ecd-a53b-2803688073f7))
  (via (at 118.11 67.31) (size 0.8) (drill 0.4) (layers "F.Cu" "B.Cu") (net 15) (tstamp 771a5ae1-17cb-48c6-a0a8-68997290f09c))
  (via (at 118.364 69.342) (size 0.8) (drill 0.4) (layers "F.Cu" "B.Cu") (net 15) (tstamp cf91ece6-b378-4bc1-8608-bf63f2c28b62))
  (via (at 125.476 82.55) (size 0.8) (drill 0.4) (layers "F.Cu" "B.Cu") (net 15) (tstamp ec63f25d-168e-4d83-838b-317ba0e198de))
  (segment (start 122.619 67.31) (end 120.9295 67.31) (width 0.25) (layer "F.Cu") (net 16) (tstamp c7f5276a-3cbf-4f9c-b0f3-79b7a1960c52))
  (segment (start 120.84 82.55) (end 122.6565 82.55) (width 0.25) (layer "F.Cu") (net 17) (tstamp a68122f8-e63c-45e3-a27d-1d6e88587808))
  (segment (start 117.348 66.802) (end 117.348 71.882) (width 0.25) (layer "F.Cu") (net 18) (tstamp 0c119677-ced5-4629-9742-2873b8caeedc))
  (segment (start 118.364 72.199) (end 117.665 72.199) (width 0.25) (layer "F.Cu") (net 18) (tstamp 1df8c631-534d-492b-b13a-1fca8b34ea8b))
  (segment (start 117.348 66.802) (end 118.11 66.04) (width 0.25) (layer "F.Cu") (net 18) (tstamp 5dc9bfe7-3681-490a-908c-d4f8b153cc68))
  (segment (start 118.364 73.851) (end 118.364 72.199) (width 0.25) (layer "F.Cu") (net 18) (tstamp 844fe114-63a2-4d8f-9ddb-e1060d5252a3))
  (segment (start 117.348 71.882) (end 117.665 72.199) (width 0.25) (layer "F.Cu") (net 18) (tstamp 9880f024-ac53-4835-b881-90f58e9d8c0f))
  (segment (start 118.11 66.04) (end 118.11 64.77) (width 0.25) (layer "F.Cu") (net 18) (tstamp f3bd4242-e0a3-4274-b2be-b561b9c7870f))
  (segment (start 128.27 64.77) (end 126.1345 64.77) (width 1) (layer "F.Cu") (net 19) (tstamp 18a1e71f-205d-40a8-bf16-cd1aa1c0386a))

  (zone (net 15) (net_name "GND") (layer "B.Cu") (tstamp b3264bc5-fd66-4ae4-a677-b8d1db74afb8) (hatch edge 0.508)
    (connect_pads (clearance 0.508))
    (min_thickness 0.254) (filled_areas_thickness no)
    (fill yes (thermal_gap 0.508) (thermal_bridge_width 1.5))
    (polygon
      (pts
        (xy 129.54 83.82)
        (xy 114.3 83.82)
        (xy 114.3 63.5)
        (xy 129.54 63.5)
      )
    )
    (filled_polygon
      (layer "B.Cu")
      (pts
        (xy 126.853621 64.028002)
        (xy 126.900114 64.081658)
        (xy 126.9115 64.134)
        (xy 126.9115 65.668134)
        (xy 126.918255 65.730316)
        (xy 126.969385 65.866705)
        (xy 127.056739 65.983261)
        (xy 127.173295 66.070615)
        (xy 127.181704 66.073767)
        (xy 127.181705 66.073768)
        (xy 127.29096 66.114726)
        (xy 127.347725 66.157367)
        (xy 127.372425 66.223929)
        (xy 127.357218 66.293278)
        (xy 127.337825 66.319759)
        (xy 127.21459 66.448717)
        (xy 127.208104 66.456727)
        (xy 127.147865 66.545034)
        (xy 127.143653 66.558046)
        (xy 127.152076 66.56)
        (xy 128.894 66.56)
        (xy 128.962121 66.580002)
        (xy 129.008614 66.633658)
        (xy 129.02 66.686)
        (xy 129.02 67.934)
        (xy 128.999998 68.002121)
        (xy 128.946342 68.048614)
        (xy 128.894 68.06)
        (xy 127.154931 68.06)
        (xy 127.1414 68.063973)
        (xy 127.14129 68.064741)
        (xy 127.143536 68.070965)
        (xy 127.167694 68.110388)
        (xy 127.173777 68.118699)
        (xy 127.313213 68.279667)
        (xy 127.32058 68.286883)
        (xy 127.484434 68.422916)
        (xy 127.492881 68.428831)
        (xy 127.561969 68.469203)
        (xy 127.610693 68.520842)
        (xy 127.623764 68.590625)
        (xy 127.597033 68.656396)
        (xy 127.556584 68.689752)
        (xy 127.543607 68.696507)
        (xy 127.539474 68.69961)
        (xy 127.539471 68.699612)
        (xy 127.495269 68.7328)
        (xy 127.364965 68.830635)
        (xy 127.210629 68.992138)
        (xy 127.084743 69.17668)
        (xy 126.990688 69.379305)
        (xy 126.930989 69.59457)
        (xy 126.907251 69.816695)
        (xy 126.907548 69.821848)
        (xy 126.907548 69.821851)
        (xy 126.916532 69.977668)
        (xy 126.92011 70.039715)
        (xy 126.921247 70.044761)
        (xy 126.921248 70.044767)
        (xy 126.933804 70.100479)
        (xy 126.969222 70.257639)
        (xy 127.053266 70.464616)
        (xy 127.169987 70.655088)
        (xy 127.31625 70.823938)
        (xy 127.488126 70.966632)
        (xy 127.502859 70.975241)
        (xy 127.561445 71.009476)
        (xy 127.610169 71.061114)
        (xy 127.62324 71.130897)
        (xy 127.596509 71.196669)
        (xy 127.556055 71.230027)
        (xy 127.543607 71.236507)
        (xy 127.539474 71.23961)
        (xy 127.539471 71.239612)
        (xy 127.495269 71.2728)
        (xy 127.364965 71.370635)
        (xy 127.210629 71.532138)
        (xy 127.084743 71.71668)
        (xy 126.990688 71.919305)
        (xy 126.930989 72.13457)
        (xy 126.907251 72.356695)
        (xy 126.907548 72.361848)
        (xy 126.907548 72.361851)
        (xy 126.913712 72.468752)
        (xy 126.92011 72.579715)
        (xy 126.921247 72.584761)
        (xy 126.921248 72.584767)
        (xy 126.9445 72.687939)
        (xy 126.969222 72.797639)
        (xy 127.053266 73.004616)
        (xy 127.169987 73.195088)
        (xy 127.31625 73.363938)
        (xy 127.488126 73.506632)
        (xy 127.533669 73.533245)
        (xy 127.561955 73.549774)
        (xy 127.610679 73.601412)
        (xy 127.62375 73.671195)
        (xy 127.597019 73.736967)
        (xy 127.556562 73.770327)
        (xy 127.548457 73.774546)
        (xy 127.539738 73.780036)
        (xy 127.369433 73.907905)
        (xy 127.361726 73.914748)
        (xy 127.21459 74.068717)
        (xy 127.208104 74.076727)
        (xy 127.147865 74.165034)
        (xy 127.143653 74.178046)
        (xy 127.152076 74.18)
        (xy 128.894 74.18)
        (xy 128.962121 74.200002)
        (xy 129.008614 74.253658)
        (xy 129.02 74.306)
        (xy 129.02 75.554)
        (xy 128.999998 75.622121)
        (xy 128.946342 75.668614)
        (xy 128.894 75.68)
        (xy 127.154931 75.68)
        (xy 127.1414 75.683973)
        (xy 127.14129 75.684741)
        (xy 127.143536 75.690965)
        (xy 127.167694 75.730388)
        (xy 127.173777 75.738699)
        (xy 127.313213 75.899667)
        (xy 127.32058 75.906883)
        (xy 127.484434 76.042916)
        (xy 127.492881 76.048831)
        (xy 127.561969 76.089203)
        (xy 127.610693 76.140842)
        (xy 127.623764 76.210625)
        (xy 127.597033 76.276396)
        (xy 127.556584 76.309752)
        (xy 127.543607 76.316507)
        (xy 127.539474 76.31961)
        (xy 127.539471 76.319612)
        (xy 127.495269 76.3528)
        (xy 127.364965 76.450635)
        (xy 127.210629 76.612138)
        (xy 127.084743 76.79668)
        (xy 127.082564 76.801375)
        (xy 126.996375 76.987054)
        (xy 126.990688 76.999305)
        (xy 126.930989 77.21457)
        (xy 126.907251 77.436695)
        (xy 126.907548 77.441848)
        (xy 126.907548 77.441851)
        (xy 126.917885 77.621122)
        (xy 126.92011 77.659715)
        (xy 126.921247 77.664761)
        (xy 126.921248 77.664767)
        (xy 126.930673 77.706588)
        (xy 126.969222 77.877639)
        (xy 127.005222 77.966297)
        (xy 127.050882 78.078744)
        (xy 127.053266 78.084616)
        (xy 127.169987 78.275088)
        (xy 127.31625 78.443938)
        (xy 127.488126 78.586632)
        (xy 127.502859 78.595241)
        (xy 127.561445 78.629476)
        (xy 127.610169 78.681114)
        (xy 127.62324 78.750897)
        (xy 127.596509 78.816669)
        (xy 127.556055 78.850027)
        (xy 127.543607 78.856507)
        (xy 127.539474 78.85961)
        (xy 127.539471 78.859612)
        (xy 127.495269 78.8928)
        (xy 127.364965 78.990635)
        (xy 127.210629 79.152138)
        (xy 127.207715 79.15641)
        (xy 127.207714 79.156411)
        (xy 127.185172 79.189457)
        (xy 127.084743 79.33668)
        (xy 127.082564 79.341375)
        (xy 127.016677 79.483317)
        (xy 126.990688 79.539305)
        (xy 126.930989 79.75457)
        (xy 126.907251 79.976695)
        (xy 126.907548 79.981848)
        (xy 126.907548 79.981851)
        (xy 126.913876 80.09159)
        (xy 126.92011 80.199715)
        (xy 126.921247 80.204761)
        (xy 126.921248 80.204767)
        (xy 126.9445 80.307939)
        (xy 126.969222 80.417639)
        (xy 127.053266 80.624616)
        (xy 127.169987 80.815088)
        (xy 127.31625 80.983938)
        (xy 127.488126 81.126632)
        (xy 127.502859 81.135241)
        (xy 127.561445 81.169476)
        (xy 127.610169 81.221114)
        (xy 127.62324 81.290897)
        (xy 127.596509 81.356669)
        (xy 127.556055 81.390027)
        (xy 127.543607 81.396507)
        (xy 127.539474 81.39961)
        (xy 127.539471 81.399612)
        (xy 127.495269 81.4328)
        (xy 127.364965 81.530635)
        (xy 127.210629 81.692138)
        (xy 127.084743 81.87668)
        (xy 126.990688 82.079305)
        (xy 126.930989 82.29457)
        (xy 126.907251 82.516695)
        (xy 126.907548 82.521848)
        (xy 126.907548 82.521851)
        (xy 126.913876 82.63159)
        (xy 126.92011 82.739715)
        (xy 126.921247 82.744761)
        (xy 126.921248 82.744767)
        (xy 126.9445 82.847939)
        (xy 126.969222 82.957639)
        (xy 127.01154 83.061857)
        (xy 127.0427 83.138596)
        (xy 127.049796 83.209237)
        (xy 127.017574 83.272501)
        (xy 126.956264 83.308301)
        (xy 126.925957 83.312)
        (xy 116.919072 83.312)
        (xy 116.850951 83.291998)
        (xy 116.804458 83.238342)
        (xy 116.794354 83.168068)
        (xy 116.806114 83.130174)
        (xy 116.835138 83.071448)
        (xy 116.83743 83.066811)
        (xy 116.90237 82.853069)
        (xy 116.931529 82.63159)
        (xy 116.933156 82.565)
        (xy 116.914852 82.342361)
        (xy 116.860431 82.125702)
        (xy 116.771354 81.92084)
        (xy 116.650014 81.733277)
        (xy 116.49967 81.568051)
        (xy 116.495619 81.564852)
        (xy 116.495615 81.564848)
        (xy 116.328414 81.4328)
        (xy 116.32841 81.432798)
        (xy 116.324359 81.429598)
        (xy 116.283053 81.406796)
        (xy 116.233084 81.356364)
        (xy 116.218312 81.286921)
        (xy 116.243428 81.220516)
        (xy 116.27078 81.193909)
        (xy 116.327789 81.153245)
        (xy 116.44986 81.066173)
        (xy 116.608096 80.908489)
        (xy 116.738453 80.727077)
        (xy 116.786916 80.62902)
        (xy 116.835136 80.531453)
        (xy 116.835137 80.531451)
        (xy 116.83743 80.526811)
        (xy 116.90237 80.313069)
        (xy 116.931529 80.09159)
        (xy 116.933156 80.025)
        (xy 116.914852 79.802361)
        (xy 116.860431 79.585702)
        (xy 116.771354 79.38084)
        (xy 116.731906 79.319862)
        (xy 116.652822 79.197617)
        (xy 116.65282 79.197614)
        (xy 116.650014 79.193277)
        (xy 116.49967 79.028051)
        (xy 116.495619 79.024852)
        (xy 116.495615 79.024848)
        (xy 116.328414 78.8928)
        (xy 116.32841 78.892798)
        (xy 116.324359 78.889598)
        (xy 116.283053 78.866796)
        (xy 116.233084 78.816364)
        (xy 116.218312 78.746921)
        (xy 116.243428 78.680516)
        (xy 116.27078 78.653909)
        (xy 116.324244 78.615774)
        (xy 121.593102 78.615774)
        (xy 121.593302 78.621103)
        (xy 121.593302 78.621105)
        (xy 121.595555 78.681114)
        (xy 121.601751 78.846158)
        (xy 121.602846 78.851377)
        (xy 121.611537 78.8928)
        (xy 121.649093 79.071791)
        (xy 121.733776 79.286221)
        (xy 121.853377 79.483317)
        (xy 121.856874 79.487347)
        (xy 121.943438 79.587103)
        (xy 122.004477 79.657445)
        (xy 122.008608 79.660832)
        (xy 122.178627 79.80024)
        (xy 122.178633 79.800244)
        (xy 122.182755 79.803624)
        (xy 122.187391 79.806263)
        (xy 122.187394 79.806265)
        (xy 122.296422 79.868327)
        (xy 122.383114 79.917675)
        (xy 122.599825 79.996337)
        (xy 122.605074 79.997286)
        (xy 122.605077 79.997287)
        (xy 122.822608 80.036623)
        (xy 122.822615 80.036624)
        (xy 122.826692 80.037361)
        (xy 122.844414 80.038197)
        (xy 122.849356 80.03843)
        (xy 122.849363 80.03843)
        (xy 122.850844 80.0385)
        (xy 123.26289 80.0385)
        (xy 123.329809 80.032822)
        (xy 123.429409 80.024371)
        (xy 123.429413 80.02437)
        (xy 123.43472 80.02392)
        (xy 123.439875 80.022582)
        (xy 123.439881 80.022581)
        (xy 123.652703 79.967343)
        (xy 123.652707 79.967342)
        (xy 123.657872 79.966001)
        (xy 123.662738 79.963809)
        (xy 123.662741 79.963808)
        (xy 123.863202 79.873507)
        (xy 123.868075 79.871312)
        (xy 124.059319 79.742559)
        (xy 124.226135 79.583424)
        (xy 124.363754 79.398458)
        (xy 124.370297 79.38559)
        (xy 124.465822 79.197704)
        (xy 124.46824 79.192949)
        (xy 124.479586 79.156411)
        (xy 124.535024 78.977871)
        (xy 124.536607 78.972773)
        (xy 124.546485 78.898241)
        (xy 124.566198 78.749511)
        (xy 124.566198 78.749506)
        (xy 124.566898 78.744226)
        (xy 124.558249 78.513842)
        (xy 124.510907 78.288209)
        (xy 124.503988 78.270689)
        (xy 124.428185 78.078744)
        (xy 124.428184 78.078742)
        (xy 124.426224 78.073779)
        (xy 124.373451 77.986811)
        (xy 124.30939 77.881243)
        (xy 124.306623 77.876683)
        (xy 124.303126 77.872653)
        (xy 124.159023 77.706588)
        (xy 124.159021 77.706586)
        (xy 124.155523 77.702555)
        (xy 124.096973 77.654547)
        (xy 123.981373 77.55976)
        (xy 123.981367 77.559756)
        (xy 123.977245 77.556376)
        (xy 123.968837 77.55159)
        (xy 123.945265 77.538171)
        (xy 123.895959 77.487088)
        (xy 123.882098 77.417458)
        (xy 123.908082 77.351387)
        (xy 123.937232 77.324149)
        (xy 124.054578 77.245148)
        (xy 124.06287 77.238481)
        (xy 124.2219 77.086772)
        (xy 124.228941 77.078814)
        (xy 124.328848 76.944535)
        (xy 124.333338 76.932387)
        (xy 124.323928 76.93)
        (xy 121.839723 76.93)
        (xy 121.826192 76.933973)
        (xy 121.826061 76.934885)
        (xy 121.828209 76.940879)
        (xy 121.851012 76.978455)
        (xy 121.857282 76.987054)
        (xy 122.001327 77.153052)
        (xy 122.008958 77.160472)
        (xy 122.178911 77.299826)
        (xy 122.187674 77.305848)
        (xy 122.214711 77.321238)
        (xy 122.264018 77.37232)
        (xy 122.27788 77.441951)
        (xy 122.251897 77.508022)
        (xy 122.222747 77.535261)
        (xy 122.218425 77.538171)
        (xy 122.100681 77.617441)
        (xy 122.096824 77.62112)
        (xy 122.096822 77.621122)
        (xy 122.051071 77.664767)
        (xy 121.933865 77.776576)
        (xy 121.796246 77.961542)
        (xy 121.79383 77.966293)
        (xy 121.793828 77.966297)
        (xy 121.781038 77.991453)
        (xy 121.69176 78.167051)
        (xy 121.690178 78.172145)
        (xy 121.690177 78.172148)
        (xy 121.630515 78.364292)
        (xy 121.623393 78.387227)
        (xy 121.622692 78.392516)
        (xy 121.607304 78.508623)
        (xy 121.593102 78.615774)
        (xy 116.324244 78.615774)
        (xy 116.331653 78.610489)
        (xy 116.44986 78.526173)
        (xy 116.467472 78.508623)
        (xy 116.604435 78.372137)
        (xy 116.608096 78.368489)
        (xy 116.662033 78.293428)
        (xy 116.735435 78.191277)
        (xy 116.738453 78.187077)
        (xy 116.745832 78.172148)
        (xy 116.835136 77.991453)
        (xy 116.835137 77.991451)
        (xy 116.83743 77.986811)
        (xy 116.90237 77.773069)
        (xy 116.931529 77.55159)
        (xy 116.933156 77.485)
        (xy 116.914852 77.262361)
        (xy 116.860431 77.045702)
        (xy 116.771354 76.84084)
        (xy 116.650014 76.653277)
        (xy 116.49967 76.488051)
        (xy 116.495619 76.484852)
        (xy 116.495615 76.484848)
        (xy 116.328414 76.3528)
        (xy 116.32841 76.352798)
        (xy 116.324359 76.349598)
        (xy 116.283053 76.326796)
        (xy 116.233084 76.276364)
        (xy 116.218312 76.206921)
        (xy 116.243428 76.140516)
        (xy 116.27078 76.113909)
        (xy 116.362016 76.048831)
        (xy 116.44986 75.986173)
        (xy 116.608096 75.828489)
        (xy 116.738453 75.647077)
        (xy 116.83743 75.446811)
        (xy 116.90237 75.233069)
        (xy 116.931529 75.01159)
        (xy 116.933156 74.945)
        (xy 116.914852 74.722361)
        (xy 116.860431 74.505702)
        (xy 116.771354 74.30084)
        (xy 116.650014 74.113277)
        (xy 116.49967 73.948051)
        (xy 116.495619 73.944852)
        (xy 116.495615 73.944848)
        (xy 116.328414 73.8128)
        (xy 116.32841 73.812798)
        (xy 116.324359 73.809598)
        (xy 116.283053 73.786796)
        (xy 116.233084 73.736364)
        (xy 116.218312 73.666921)
        (xy 116.237657 73.615774)
        (xy 121.593102 73.615774)
        (xy 121.601751 73.846158)
        (xy 121.649093 74.071791)
        (xy 121.651051 74.07675)
        (xy 121.651052 74.076752)
        (xy 121.685917 74.165034)
        (xy 121.733776 74.286221)
        (xy 121.736543 74.29078)
        (xy 121.736544 74.290783)
        (xy 121.742647 74.30084)
        (xy 121.853377 74.483317)
        (xy 121.856874 74.487347)
        (xy 121.943438 74.587103)
        (xy 122.004477 74.657445)
        (xy 122.008608 74.660832)
        (xy 122.178627 74.80024)
        (xy 122.178633 74.800244)
        (xy 122.182755 74.803624)
        (xy 122.187398 74.806267)
        (xy 122.214735 74.821829)
        (xy 122.264041 74.872912)
        (xy 122.277902 74.942542)
        (xy 122.251918 75.008613)
        (xy 122.222768 75.035851)
        (xy 122.105422 75.114852)
        (xy 122.09713 75.121519)
        (xy 121.9381 75.273228)
        (xy 121.931059 75.281186)
        (xy 121.831152 75.415465)
        (xy 121.826662 75.427613)
        (xy 121.836072 75.43)
        (xy 124.320277 75.43)
        (xy 124.333808 75.426027)
        (xy 124.333939 75.425115)
        (xy 124.331791 75.419121)
        (xy 124.308988 75.381545)
        (xy 124.302718 75.372946)
        (xy 124.158673 75.206948)
        (xy 124.151042 75.199528)
        (xy 123.981089 75.060174)
        (xy 123.972326 75.054152)
        (xy 123.945289 75.038762)
        (xy 123.895982 74.98768)
        (xy 123.88212 74.918049)
        (xy 123.908103 74.851978)
        (xy 123.937253 74.824739)
        (xy 123.990532 74.788869)
        (xy 124.059319 74.742559)
        (xy 124.226135 74.583424)
        (xy 124.363754 74.398458)
        (xy 124.46824 74.192949)
        (xy 124.491632 74.117617)
        (xy 124.535024 73.977871)
        (xy 124.536607 73.972773)
        (xy 124.540308 73.944848)
        (xy 124.566198 73.749511)
        (xy 124.566198 73.749506)
        (xy 124.566898 73.744226)
        (xy 124.566626 73.736967)
        (xy 124.561877 73.610489)
        (xy 124.558249 73.513842)
        (xy 124.510907 73.288209)
        (xy 124.426224 73.073779)
        (xy 124.306623 72.876683)
        (xy 124.303126 72.872653)
        (xy 124.159023 72.706588)
        (xy 124.159021 72.706586)
        (xy 124.155523 72.702555)
        (xy 124.11988 72.67333)
        (xy 124.079886 72.614671)
        (xy 124.077954 72.543701)
        (xy 124.114698 72.482952)
        (xy 124.133468 72.468752)
        (xy 124.27312 72.382332)
        (xy 124.279348 72.378478)
        (xy 124.404305 72.253303)
        (xy 124.444853 72.187522)
        (xy 124.493275 72.108968)
        (xy 124.493276 72.108966)
        (xy 124.497115 72.102738)
        (xy 124.542568 71.965702)
        (xy 124.550632 71.941389)
        (xy 124.550632 71.941387)
        (xy 124.552797 71.934861)
        (xy 124.55388 71.924297)
        (xy 124.563172 71.833598)
        (xy 124.5635 71.8304)
        (xy 124.5635 70.5296)
        (xy 124.563163 70.52635)
        (xy 124.553238 70.430692)
        (xy 124.553237 70.430688)
        (xy 124.552526 70.423834)
        (xy 124.49655 70.256054)
        (xy 124.403478 70.105652)
        (xy 124.278303 69.980695)
        (xy 124.204023 69.934908)
        (xy 124.133968 69.891725)
        (xy 124.133966 69.891724)
        (xy 124.127738 69.887885)
        (xy 123.967254 69.834655)
        (xy 123.966389 69.834368)
        (xy 123.966387 69.834368)
        (xy 123.959861 69.832203)
        (xy 123.953025 69.831503)
        (xy 123.953022 69.831502)
        (xy 123.909969 69.827091)
        (xy 123.8554 69.8215)
        (xy 122.3046 69.8215)
        (xy 122.301354 69.821837)
        (xy 122.30135 69.821837)
        (xy 122.205692 69.831762)
        (xy 122.205688 69.831763)
        (xy 122.198834 69.832474)
        (xy 122.192298 69.834655)
        (xy 122.192296 69.834655)
        (xy 122.111395 69.861646)
        (xy 122.031054 69.88845)
        (xy 121.880652 69.981522)
        (xy 121.755695 70.106697)
        (xy 121.662885 70.257262)
        (xy 121.607203 70.425139)
        (xy 121.5965 70.5296)
        (xy 121.5965 71.8304)
        (xy 121.596837 71.833646)
        (xy 121.596837 71.83365)
        (xy 121.606243 71.924297)
        (xy 121.607474 71.936166)
        (xy 121.66345 72.103946)
        (xy 121.756522 72.254348)
        (xy 121.881697 72.379305)
        (xy 122.02734 72.469081)
        (xy 122.074832 72.521852)
        (xy 122.086256 72.591924)
        (xy 122.057982 72.657048)
        (xy 122.048195 72.66751)
        (xy 122.015007 72.69917)
        (xy 121.933865 72.776576)
        (xy 121.796246 72.961542)
        (xy 121.69176 73.167051)
        (xy 121.690178 73.172145)
        (xy 121.690177 73.172148)
        (xy 121.631838 73.360031)
        (xy 121.623393 73.387227)
        (xy 121.622692 73.392516)
        (xy 121.595006 73.601412)
        (xy 121.593102 73.615774)
        (xy 116.237657 73.615774)
        (xy 116.243428 73.600516)
        (xy 116.27078 73.573909)
        (xy 116.347517 73.519173)
        (xy 116.44986 73.446173)
        (xy 116.608096 73.288489)
        (xy 116.738453 73.107077)
        (xy 116.757165 73.069217)
        (xy 116.835136 72.911453)
        (xy 116.835137 72.911451)
        (xy 116.83743 72.906811)
        (xy 116.899488 72.702555)
        (xy 116.900865 72.698023)
        (xy 116.900865 72.698021)
        (xy 116.90237 72.693069)
        (xy 116.931529 72.47159)
        (xy 116.933156 72.405)
        (xy 116.914852 72.182361)
        (xy 116.860431 71.965702)
        (xy 116.771354 71.76084)
        (xy 116.650014 71.573277)
        (xy 116.49967 71.408051)
        (xy 116.495619 71.404852)
        (xy 116.495615 71.404848)
        (xy 116.328414 71.2728)
        (xy 116.32841 71.272798)
        (xy 116.324359 71.269598)
        (xy 116.283053 71.246796)
        (xy 116.233084 71.196364)
        (xy 116.218312 71.126921)
        (xy 116.243428 71.060516)
        (xy 116.27078 71.033909)
        (xy 116.327789 70.993245)
        (xy 116.44986 70.906173)
        (xy 116.608096 70.748489)
        (xy 116.738453 70.567077)
        (xy 116.755386 70.532817)
        (xy 116.835136 70.371453)
        (xy 116.835137 70.371451)
        (xy 116.83743 70.366811)
        (xy 116.872606 70.251032)
        (xy 116.900865 70.158023)
        (xy 116.900865 70.158021)
        (xy 116.90237 70.153069)
        (xy 116.931529 69.93159)
        (xy 116.933156 69.865)
        (xy 116.914852 69.642361)
        (xy 116.860431 69.425702)
        (xy 116.771354 69.22084)
        (xy 116.650014 69.033277)
        (xy 116.49967 68.868051)
        (xy 116.495619 68.864852)
        (xy 116.495615 68.864848)
        (xy 116.328414 68.7328)
        (xy 116.32841 68.732798)
        (xy 116.324359 68.729598)
        (xy 116.283053 68.706796)
        (xy 116.233084 68.656364)
        (xy 116.218312 68.586921)
        (xy 116.243428 68.520516)
        (xy 116.27078 68.493909)
        (xy 116.362016 68.428831)
        (xy 116.44986 68.366173)
        (xy 116.608096 68.208489)
        (xy 116.738453 68.027077)
        (xy 116.83743 67.826811)
        (xy 116.90237 67.613069)
        (xy 116.931529 67.39159)
        (xy 116.933156 67.325)
        (xy 116.914852 67.102361)
        (xy 116.860431 66.885702)
        (xy 116.771354 66.68084)
        (xy 116.650014 66.493277)
        (xy 116.609468 66.448717)
        (xy 116.502798 66.331488)
        (xy 116.471746 66.267642)
        (xy 116.480141 66.197143)
        (xy 116.525317 66.142375)
        (xy 116.551761 66.128706)
        (xy 116.658297 66.088767)
        (xy 116.666705 66.085615)
        (xy 116.774443 66.00487)
        (xy 116.840948 65.980022)
        (xy 116.91033 65.995075)
        (xy 116.92557 66.004869)
        (xy 117.013295 66.070615)
        (xy 117.149684 66.121745)
        (xy 117.211866 66.1285)
        (xy 119.008134 66.1285)
        (xy 119.070316 66.121745)
        (xy 119.206705 66.070615)
        (xy 119.323261 65.983261)
        (xy 119.410615 65.866705)
        (xy 119.432799 65.807529)
        (xy 119.454598 65.749382)
        (xy 119.49724 65.692618)
        (xy 119.563802 65.667918)
        (xy 119.63315 65.683126)
        (xy 119.667817 65.711114)
        (xy 119.69625 65.743938)
        (xy 119.868126 65.886632)
        (xy 120.061 65.999338)
        (xy 120.269692 66.07903)
        (xy 120.27476 66.080061)
        (xy 120.274763 66.080062)
        (xy 120.382017 66.101883)
        (xy 120.488597 66.123567)
        (xy 120.493772 66.123757)
        (xy 120.493774 66.123757)
        (xy 120.706673 66.131564)
        (xy 120.706677 66.131564)
        (xy 120.711837 66.131753)
        (xy 120.716957 66.131097)
        (xy 120.716959 66.131097)
        (xy 120.928288 66.104025)
        (xy 120.928289 66.104025)
        (xy 120.933416 66.103368)
        (xy 120.938366 66.101883)
        (xy 121.142429 66.040661)
        (xy 121.142434 66.040659)
        (xy 121.147384 66.039174)
        (xy 121.347994 65.940896)
        (xy 121.52986 65.811173)
        (xy 121.688096 65.653489)
        (xy 121.818453 65.472077)
        (xy 121.91743 65.271811)
        (xy 121.98237 65.058069)
        (xy 122.011529 64.83659)
        (xy 122.013156 64.77)
        (xy 121.994852 64.547361)
        (xy 121.940431 64.330702)
        (xy 121.876748 64.184241)
        (xy 121.867927 64.113796)
        (xy 121.898594 64.049764)
        (xy 121.95901 64.012476)
        (xy 121.992297 64.008)
        (xy 126.7855 64.008)
      )
    )
  )
)
