G04 #@! TF.GenerationSoftware,KiCad,Pcbnew,(5.1.5)-2*
G04 #@! TF.CreationDate,2021-05-18T11:29:50+02:00*
G04 #@! TF.ProjectId,Peak_Detector_ADA4807,5065616b-5f44-4657-9465-63746f725f41,rev?*
G04 #@! TF.SameCoordinates,Original*
G04 #@! TF.FileFunction,Copper,L1,Top*
G04 #@! TF.FilePolarity,Positive*
%FSLAX46Y46*%
G04 Gerber Fmt 4.6, Leading zero omitted, Abs format (unit mm)*
G04 Created by KiCad (PCBNEW (5.1.5)-2) date 2021-05-18 11:29:50*
%MOMM*%
%LPD*%
G04 APERTURE LIST*
%ADD10R,1.700000X1.700000*%
%ADD11O,1.700000X1.700000*%
%ADD12R,1.200000X0.900000*%
%ADD13C,0.100000*%
%ADD14R,1.450000X0.450000*%
%ADD15C,0.250000*%
%ADD16C,0.254000*%
G04 APERTURE END LIST*
D10*
X122540000Y-126452000D03*
D11*
X125080000Y-126452000D03*
X127620000Y-126452000D03*
D12*
X138034000Y-115150000D03*
X138034000Y-118450000D03*
X133970000Y-115150000D03*
X133970000Y-118450000D03*
G04 #@! TA.AperFunction,SMDPad,CuDef*
D13*
G36*
X138819691Y-121469053D02*
G01*
X138840926Y-121472203D01*
X138861750Y-121477419D01*
X138881962Y-121484651D01*
X138901368Y-121493830D01*
X138919781Y-121504866D01*
X138937024Y-121517654D01*
X138952930Y-121532070D01*
X138967346Y-121547976D01*
X138980134Y-121565219D01*
X138991170Y-121583632D01*
X139000349Y-121603038D01*
X139007581Y-121623250D01*
X139012797Y-121644074D01*
X139015947Y-121665309D01*
X139017000Y-121686750D01*
X139017000Y-122124250D01*
X139015947Y-122145691D01*
X139012797Y-122166926D01*
X139007581Y-122187750D01*
X139000349Y-122207962D01*
X138991170Y-122227368D01*
X138980134Y-122245781D01*
X138967346Y-122263024D01*
X138952930Y-122278930D01*
X138937024Y-122293346D01*
X138919781Y-122306134D01*
X138901368Y-122317170D01*
X138881962Y-122326349D01*
X138861750Y-122333581D01*
X138840926Y-122338797D01*
X138819691Y-122341947D01*
X138798250Y-122343000D01*
X138285750Y-122343000D01*
X138264309Y-122341947D01*
X138243074Y-122338797D01*
X138222250Y-122333581D01*
X138202038Y-122326349D01*
X138182632Y-122317170D01*
X138164219Y-122306134D01*
X138146976Y-122293346D01*
X138131070Y-122278930D01*
X138116654Y-122263024D01*
X138103866Y-122245781D01*
X138092830Y-122227368D01*
X138083651Y-122207962D01*
X138076419Y-122187750D01*
X138071203Y-122166926D01*
X138068053Y-122145691D01*
X138067000Y-122124250D01*
X138067000Y-121686750D01*
X138068053Y-121665309D01*
X138071203Y-121644074D01*
X138076419Y-121623250D01*
X138083651Y-121603038D01*
X138092830Y-121583632D01*
X138103866Y-121565219D01*
X138116654Y-121547976D01*
X138131070Y-121532070D01*
X138146976Y-121517654D01*
X138164219Y-121504866D01*
X138182632Y-121493830D01*
X138202038Y-121484651D01*
X138222250Y-121477419D01*
X138243074Y-121472203D01*
X138264309Y-121469053D01*
X138285750Y-121468000D01*
X138798250Y-121468000D01*
X138819691Y-121469053D01*
G37*
G04 #@! TD.AperFunction*
G04 #@! TA.AperFunction,SMDPad,CuDef*
G36*
X138819691Y-119894053D02*
G01*
X138840926Y-119897203D01*
X138861750Y-119902419D01*
X138881962Y-119909651D01*
X138901368Y-119918830D01*
X138919781Y-119929866D01*
X138937024Y-119942654D01*
X138952930Y-119957070D01*
X138967346Y-119972976D01*
X138980134Y-119990219D01*
X138991170Y-120008632D01*
X139000349Y-120028038D01*
X139007581Y-120048250D01*
X139012797Y-120069074D01*
X139015947Y-120090309D01*
X139017000Y-120111750D01*
X139017000Y-120549250D01*
X139015947Y-120570691D01*
X139012797Y-120591926D01*
X139007581Y-120612750D01*
X139000349Y-120632962D01*
X138991170Y-120652368D01*
X138980134Y-120670781D01*
X138967346Y-120688024D01*
X138952930Y-120703930D01*
X138937024Y-120718346D01*
X138919781Y-120731134D01*
X138901368Y-120742170D01*
X138881962Y-120751349D01*
X138861750Y-120758581D01*
X138840926Y-120763797D01*
X138819691Y-120766947D01*
X138798250Y-120768000D01*
X138285750Y-120768000D01*
X138264309Y-120766947D01*
X138243074Y-120763797D01*
X138222250Y-120758581D01*
X138202038Y-120751349D01*
X138182632Y-120742170D01*
X138164219Y-120731134D01*
X138146976Y-120718346D01*
X138131070Y-120703930D01*
X138116654Y-120688024D01*
X138103866Y-120670781D01*
X138092830Y-120652368D01*
X138083651Y-120632962D01*
X138076419Y-120612750D01*
X138071203Y-120591926D01*
X138068053Y-120570691D01*
X138067000Y-120549250D01*
X138067000Y-120111750D01*
X138068053Y-120090309D01*
X138071203Y-120069074D01*
X138076419Y-120048250D01*
X138083651Y-120028038D01*
X138092830Y-120008632D01*
X138103866Y-119990219D01*
X138116654Y-119972976D01*
X138131070Y-119957070D01*
X138146976Y-119942654D01*
X138164219Y-119929866D01*
X138182632Y-119918830D01*
X138202038Y-119909651D01*
X138222250Y-119902419D01*
X138243074Y-119897203D01*
X138264309Y-119894053D01*
X138285750Y-119893000D01*
X138798250Y-119893000D01*
X138819691Y-119894053D01*
G37*
G04 #@! TD.AperFunction*
G04 #@! TA.AperFunction,SMDPad,CuDef*
G36*
X135466891Y-112579053D02*
G01*
X135488126Y-112582203D01*
X135508950Y-112587419D01*
X135529162Y-112594651D01*
X135548568Y-112603830D01*
X135566981Y-112614866D01*
X135584224Y-112627654D01*
X135600130Y-112642070D01*
X135614546Y-112657976D01*
X135627334Y-112675219D01*
X135638370Y-112693632D01*
X135647549Y-112713038D01*
X135654781Y-112733250D01*
X135659997Y-112754074D01*
X135663147Y-112775309D01*
X135664200Y-112796750D01*
X135664200Y-113234250D01*
X135663147Y-113255691D01*
X135659997Y-113276926D01*
X135654781Y-113297750D01*
X135647549Y-113317962D01*
X135638370Y-113337368D01*
X135627334Y-113355781D01*
X135614546Y-113373024D01*
X135600130Y-113388930D01*
X135584224Y-113403346D01*
X135566981Y-113416134D01*
X135548568Y-113427170D01*
X135529162Y-113436349D01*
X135508950Y-113443581D01*
X135488126Y-113448797D01*
X135466891Y-113451947D01*
X135445450Y-113453000D01*
X134932950Y-113453000D01*
X134911509Y-113451947D01*
X134890274Y-113448797D01*
X134869450Y-113443581D01*
X134849238Y-113436349D01*
X134829832Y-113427170D01*
X134811419Y-113416134D01*
X134794176Y-113403346D01*
X134778270Y-113388930D01*
X134763854Y-113373024D01*
X134751066Y-113355781D01*
X134740030Y-113337368D01*
X134730851Y-113317962D01*
X134723619Y-113297750D01*
X134718403Y-113276926D01*
X134715253Y-113255691D01*
X134714200Y-113234250D01*
X134714200Y-112796750D01*
X134715253Y-112775309D01*
X134718403Y-112754074D01*
X134723619Y-112733250D01*
X134730851Y-112713038D01*
X134740030Y-112693632D01*
X134751066Y-112675219D01*
X134763854Y-112657976D01*
X134778270Y-112642070D01*
X134794176Y-112627654D01*
X134811419Y-112614866D01*
X134829832Y-112603830D01*
X134849238Y-112594651D01*
X134869450Y-112587419D01*
X134890274Y-112582203D01*
X134911509Y-112579053D01*
X134932950Y-112578000D01*
X135445450Y-112578000D01*
X135466891Y-112579053D01*
G37*
G04 #@! TD.AperFunction*
G04 #@! TA.AperFunction,SMDPad,CuDef*
G36*
X135466891Y-111004053D02*
G01*
X135488126Y-111007203D01*
X135508950Y-111012419D01*
X135529162Y-111019651D01*
X135548568Y-111028830D01*
X135566981Y-111039866D01*
X135584224Y-111052654D01*
X135600130Y-111067070D01*
X135614546Y-111082976D01*
X135627334Y-111100219D01*
X135638370Y-111118632D01*
X135647549Y-111138038D01*
X135654781Y-111158250D01*
X135659997Y-111179074D01*
X135663147Y-111200309D01*
X135664200Y-111221750D01*
X135664200Y-111659250D01*
X135663147Y-111680691D01*
X135659997Y-111701926D01*
X135654781Y-111722750D01*
X135647549Y-111742962D01*
X135638370Y-111762368D01*
X135627334Y-111780781D01*
X135614546Y-111798024D01*
X135600130Y-111813930D01*
X135584224Y-111828346D01*
X135566981Y-111841134D01*
X135548568Y-111852170D01*
X135529162Y-111861349D01*
X135508950Y-111868581D01*
X135488126Y-111873797D01*
X135466891Y-111876947D01*
X135445450Y-111878000D01*
X134932950Y-111878000D01*
X134911509Y-111876947D01*
X134890274Y-111873797D01*
X134869450Y-111868581D01*
X134849238Y-111861349D01*
X134829832Y-111852170D01*
X134811419Y-111841134D01*
X134794176Y-111828346D01*
X134778270Y-111813930D01*
X134763854Y-111798024D01*
X134751066Y-111780781D01*
X134740030Y-111762368D01*
X134730851Y-111742962D01*
X134723619Y-111722750D01*
X134718403Y-111701926D01*
X134715253Y-111680691D01*
X134714200Y-111659250D01*
X134714200Y-111221750D01*
X134715253Y-111200309D01*
X134718403Y-111179074D01*
X134723619Y-111158250D01*
X134730851Y-111138038D01*
X134740030Y-111118632D01*
X134751066Y-111100219D01*
X134763854Y-111082976D01*
X134778270Y-111067070D01*
X134794176Y-111052654D01*
X134811419Y-111039866D01*
X134829832Y-111028830D01*
X134849238Y-111019651D01*
X134869450Y-111012419D01*
X134890274Y-111007203D01*
X134911509Y-111004053D01*
X134932950Y-111003000D01*
X135445450Y-111003000D01*
X135466891Y-111004053D01*
G37*
G04 #@! TD.AperFunction*
D11*
X137272000Y-126452000D03*
X134732000Y-126452000D03*
D10*
X132192000Y-126452000D03*
G04 #@! TA.AperFunction,SMDPad,CuDef*
D13*
G36*
X123325691Y-112579053D02*
G01*
X123346926Y-112582203D01*
X123367750Y-112587419D01*
X123387962Y-112594651D01*
X123407368Y-112603830D01*
X123425781Y-112614866D01*
X123443024Y-112627654D01*
X123458930Y-112642070D01*
X123473346Y-112657976D01*
X123486134Y-112675219D01*
X123497170Y-112693632D01*
X123506349Y-112713038D01*
X123513581Y-112733250D01*
X123518797Y-112754074D01*
X123521947Y-112775309D01*
X123523000Y-112796750D01*
X123523000Y-113234250D01*
X123521947Y-113255691D01*
X123518797Y-113276926D01*
X123513581Y-113297750D01*
X123506349Y-113317962D01*
X123497170Y-113337368D01*
X123486134Y-113355781D01*
X123473346Y-113373024D01*
X123458930Y-113388930D01*
X123443024Y-113403346D01*
X123425781Y-113416134D01*
X123407368Y-113427170D01*
X123387962Y-113436349D01*
X123367750Y-113443581D01*
X123346926Y-113448797D01*
X123325691Y-113451947D01*
X123304250Y-113453000D01*
X122791750Y-113453000D01*
X122770309Y-113451947D01*
X122749074Y-113448797D01*
X122728250Y-113443581D01*
X122708038Y-113436349D01*
X122688632Y-113427170D01*
X122670219Y-113416134D01*
X122652976Y-113403346D01*
X122637070Y-113388930D01*
X122622654Y-113373024D01*
X122609866Y-113355781D01*
X122598830Y-113337368D01*
X122589651Y-113317962D01*
X122582419Y-113297750D01*
X122577203Y-113276926D01*
X122574053Y-113255691D01*
X122573000Y-113234250D01*
X122573000Y-112796750D01*
X122574053Y-112775309D01*
X122577203Y-112754074D01*
X122582419Y-112733250D01*
X122589651Y-112713038D01*
X122598830Y-112693632D01*
X122609866Y-112675219D01*
X122622654Y-112657976D01*
X122637070Y-112642070D01*
X122652976Y-112627654D01*
X122670219Y-112614866D01*
X122688632Y-112603830D01*
X122708038Y-112594651D01*
X122728250Y-112587419D01*
X122749074Y-112582203D01*
X122770309Y-112579053D01*
X122791750Y-112578000D01*
X123304250Y-112578000D01*
X123325691Y-112579053D01*
G37*
G04 #@! TD.AperFunction*
G04 #@! TA.AperFunction,SMDPad,CuDef*
G36*
X123325691Y-111004053D02*
G01*
X123346926Y-111007203D01*
X123367750Y-111012419D01*
X123387962Y-111019651D01*
X123407368Y-111028830D01*
X123425781Y-111039866D01*
X123443024Y-111052654D01*
X123458930Y-111067070D01*
X123473346Y-111082976D01*
X123486134Y-111100219D01*
X123497170Y-111118632D01*
X123506349Y-111138038D01*
X123513581Y-111158250D01*
X123518797Y-111179074D01*
X123521947Y-111200309D01*
X123523000Y-111221750D01*
X123523000Y-111659250D01*
X123521947Y-111680691D01*
X123518797Y-111701926D01*
X123513581Y-111722750D01*
X123506349Y-111742962D01*
X123497170Y-111762368D01*
X123486134Y-111780781D01*
X123473346Y-111798024D01*
X123458930Y-111813930D01*
X123443024Y-111828346D01*
X123425781Y-111841134D01*
X123407368Y-111852170D01*
X123387962Y-111861349D01*
X123367750Y-111868581D01*
X123346926Y-111873797D01*
X123325691Y-111876947D01*
X123304250Y-111878000D01*
X122791750Y-111878000D01*
X122770309Y-111876947D01*
X122749074Y-111873797D01*
X122728250Y-111868581D01*
X122708038Y-111861349D01*
X122688632Y-111852170D01*
X122670219Y-111841134D01*
X122652976Y-111828346D01*
X122637070Y-111813930D01*
X122622654Y-111798024D01*
X122609866Y-111780781D01*
X122598830Y-111762368D01*
X122589651Y-111742962D01*
X122582419Y-111722750D01*
X122577203Y-111701926D01*
X122574053Y-111680691D01*
X122573000Y-111659250D01*
X122573000Y-111221750D01*
X122574053Y-111200309D01*
X122577203Y-111179074D01*
X122582419Y-111158250D01*
X122589651Y-111138038D01*
X122598830Y-111118632D01*
X122609866Y-111100219D01*
X122622654Y-111082976D01*
X122637070Y-111067070D01*
X122652976Y-111052654D01*
X122670219Y-111039866D01*
X122688632Y-111028830D01*
X122708038Y-111019651D01*
X122728250Y-111012419D01*
X122749074Y-111007203D01*
X122770309Y-111004053D01*
X122791750Y-111003000D01*
X123304250Y-111003000D01*
X123325691Y-111004053D01*
G37*
G04 #@! TD.AperFunction*
G04 #@! TA.AperFunction,SMDPad,CuDef*
G36*
X132469691Y-111004053D02*
G01*
X132490926Y-111007203D01*
X132511750Y-111012419D01*
X132531962Y-111019651D01*
X132551368Y-111028830D01*
X132569781Y-111039866D01*
X132587024Y-111052654D01*
X132602930Y-111067070D01*
X132617346Y-111082976D01*
X132630134Y-111100219D01*
X132641170Y-111118632D01*
X132650349Y-111138038D01*
X132657581Y-111158250D01*
X132662797Y-111179074D01*
X132665947Y-111200309D01*
X132667000Y-111221750D01*
X132667000Y-111659250D01*
X132665947Y-111680691D01*
X132662797Y-111701926D01*
X132657581Y-111722750D01*
X132650349Y-111742962D01*
X132641170Y-111762368D01*
X132630134Y-111780781D01*
X132617346Y-111798024D01*
X132602930Y-111813930D01*
X132587024Y-111828346D01*
X132569781Y-111841134D01*
X132551368Y-111852170D01*
X132531962Y-111861349D01*
X132511750Y-111868581D01*
X132490926Y-111873797D01*
X132469691Y-111876947D01*
X132448250Y-111878000D01*
X131935750Y-111878000D01*
X131914309Y-111876947D01*
X131893074Y-111873797D01*
X131872250Y-111868581D01*
X131852038Y-111861349D01*
X131832632Y-111852170D01*
X131814219Y-111841134D01*
X131796976Y-111828346D01*
X131781070Y-111813930D01*
X131766654Y-111798024D01*
X131753866Y-111780781D01*
X131742830Y-111762368D01*
X131733651Y-111742962D01*
X131726419Y-111722750D01*
X131721203Y-111701926D01*
X131718053Y-111680691D01*
X131717000Y-111659250D01*
X131717000Y-111221750D01*
X131718053Y-111200309D01*
X131721203Y-111179074D01*
X131726419Y-111158250D01*
X131733651Y-111138038D01*
X131742830Y-111118632D01*
X131753866Y-111100219D01*
X131766654Y-111082976D01*
X131781070Y-111067070D01*
X131796976Y-111052654D01*
X131814219Y-111039866D01*
X131832632Y-111028830D01*
X131852038Y-111019651D01*
X131872250Y-111012419D01*
X131893074Y-111007203D01*
X131914309Y-111004053D01*
X131935750Y-111003000D01*
X132448250Y-111003000D01*
X132469691Y-111004053D01*
G37*
G04 #@! TD.AperFunction*
G04 #@! TA.AperFunction,SMDPad,CuDef*
G36*
X132469691Y-112579053D02*
G01*
X132490926Y-112582203D01*
X132511750Y-112587419D01*
X132531962Y-112594651D01*
X132551368Y-112603830D01*
X132569781Y-112614866D01*
X132587024Y-112627654D01*
X132602930Y-112642070D01*
X132617346Y-112657976D01*
X132630134Y-112675219D01*
X132641170Y-112693632D01*
X132650349Y-112713038D01*
X132657581Y-112733250D01*
X132662797Y-112754074D01*
X132665947Y-112775309D01*
X132667000Y-112796750D01*
X132667000Y-113234250D01*
X132665947Y-113255691D01*
X132662797Y-113276926D01*
X132657581Y-113297750D01*
X132650349Y-113317962D01*
X132641170Y-113337368D01*
X132630134Y-113355781D01*
X132617346Y-113373024D01*
X132602930Y-113388930D01*
X132587024Y-113403346D01*
X132569781Y-113416134D01*
X132551368Y-113427170D01*
X132531962Y-113436349D01*
X132511750Y-113443581D01*
X132490926Y-113448797D01*
X132469691Y-113451947D01*
X132448250Y-113453000D01*
X131935750Y-113453000D01*
X131914309Y-113451947D01*
X131893074Y-113448797D01*
X131872250Y-113443581D01*
X131852038Y-113436349D01*
X131832632Y-113427170D01*
X131814219Y-113416134D01*
X131796976Y-113403346D01*
X131781070Y-113388930D01*
X131766654Y-113373024D01*
X131753866Y-113355781D01*
X131742830Y-113337368D01*
X131733651Y-113317962D01*
X131726419Y-113297750D01*
X131721203Y-113276926D01*
X131718053Y-113255691D01*
X131717000Y-113234250D01*
X131717000Y-112796750D01*
X131718053Y-112775309D01*
X131721203Y-112754074D01*
X131726419Y-112733250D01*
X131733651Y-112713038D01*
X131742830Y-112693632D01*
X131753866Y-112675219D01*
X131766654Y-112657976D01*
X131781070Y-112642070D01*
X131796976Y-112627654D01*
X131814219Y-112614866D01*
X131832632Y-112603830D01*
X131852038Y-112594651D01*
X131872250Y-112587419D01*
X131893074Y-112582203D01*
X131914309Y-112579053D01*
X131935750Y-112578000D01*
X132448250Y-112578000D01*
X132469691Y-112579053D01*
G37*
G04 #@! TD.AperFunction*
G04 #@! TA.AperFunction,SMDPad,CuDef*
G36*
X138514891Y-111004053D02*
G01*
X138536126Y-111007203D01*
X138556950Y-111012419D01*
X138577162Y-111019651D01*
X138596568Y-111028830D01*
X138614981Y-111039866D01*
X138632224Y-111052654D01*
X138648130Y-111067070D01*
X138662546Y-111082976D01*
X138675334Y-111100219D01*
X138686370Y-111118632D01*
X138695549Y-111138038D01*
X138702781Y-111158250D01*
X138707997Y-111179074D01*
X138711147Y-111200309D01*
X138712200Y-111221750D01*
X138712200Y-111659250D01*
X138711147Y-111680691D01*
X138707997Y-111701926D01*
X138702781Y-111722750D01*
X138695549Y-111742962D01*
X138686370Y-111762368D01*
X138675334Y-111780781D01*
X138662546Y-111798024D01*
X138648130Y-111813930D01*
X138632224Y-111828346D01*
X138614981Y-111841134D01*
X138596568Y-111852170D01*
X138577162Y-111861349D01*
X138556950Y-111868581D01*
X138536126Y-111873797D01*
X138514891Y-111876947D01*
X138493450Y-111878000D01*
X137980950Y-111878000D01*
X137959509Y-111876947D01*
X137938274Y-111873797D01*
X137917450Y-111868581D01*
X137897238Y-111861349D01*
X137877832Y-111852170D01*
X137859419Y-111841134D01*
X137842176Y-111828346D01*
X137826270Y-111813930D01*
X137811854Y-111798024D01*
X137799066Y-111780781D01*
X137788030Y-111762368D01*
X137778851Y-111742962D01*
X137771619Y-111722750D01*
X137766403Y-111701926D01*
X137763253Y-111680691D01*
X137762200Y-111659250D01*
X137762200Y-111221750D01*
X137763253Y-111200309D01*
X137766403Y-111179074D01*
X137771619Y-111158250D01*
X137778851Y-111138038D01*
X137788030Y-111118632D01*
X137799066Y-111100219D01*
X137811854Y-111082976D01*
X137826270Y-111067070D01*
X137842176Y-111052654D01*
X137859419Y-111039866D01*
X137877832Y-111028830D01*
X137897238Y-111019651D01*
X137917450Y-111012419D01*
X137938274Y-111007203D01*
X137959509Y-111004053D01*
X137980950Y-111003000D01*
X138493450Y-111003000D01*
X138514891Y-111004053D01*
G37*
G04 #@! TD.AperFunction*
G04 #@! TA.AperFunction,SMDPad,CuDef*
G36*
X138514891Y-112579053D02*
G01*
X138536126Y-112582203D01*
X138556950Y-112587419D01*
X138577162Y-112594651D01*
X138596568Y-112603830D01*
X138614981Y-112614866D01*
X138632224Y-112627654D01*
X138648130Y-112642070D01*
X138662546Y-112657976D01*
X138675334Y-112675219D01*
X138686370Y-112693632D01*
X138695549Y-112713038D01*
X138702781Y-112733250D01*
X138707997Y-112754074D01*
X138711147Y-112775309D01*
X138712200Y-112796750D01*
X138712200Y-113234250D01*
X138711147Y-113255691D01*
X138707997Y-113276926D01*
X138702781Y-113297750D01*
X138695549Y-113317962D01*
X138686370Y-113337368D01*
X138675334Y-113355781D01*
X138662546Y-113373024D01*
X138648130Y-113388930D01*
X138632224Y-113403346D01*
X138614981Y-113416134D01*
X138596568Y-113427170D01*
X138577162Y-113436349D01*
X138556950Y-113443581D01*
X138536126Y-113448797D01*
X138514891Y-113451947D01*
X138493450Y-113453000D01*
X137980950Y-113453000D01*
X137959509Y-113451947D01*
X137938274Y-113448797D01*
X137917450Y-113443581D01*
X137897238Y-113436349D01*
X137877832Y-113427170D01*
X137859419Y-113416134D01*
X137842176Y-113403346D01*
X137826270Y-113388930D01*
X137811854Y-113373024D01*
X137799066Y-113355781D01*
X137788030Y-113337368D01*
X137778851Y-113317962D01*
X137771619Y-113297750D01*
X137766403Y-113276926D01*
X137763253Y-113255691D01*
X137762200Y-113234250D01*
X137762200Y-112796750D01*
X137763253Y-112775309D01*
X137766403Y-112754074D01*
X137771619Y-112733250D01*
X137778851Y-112713038D01*
X137788030Y-112693632D01*
X137799066Y-112675219D01*
X137811854Y-112657976D01*
X137826270Y-112642070D01*
X137842176Y-112627654D01*
X137859419Y-112614866D01*
X137877832Y-112603830D01*
X137897238Y-112594651D01*
X137917450Y-112587419D01*
X137938274Y-112582203D01*
X137959509Y-112579053D01*
X137980950Y-112578000D01*
X138493450Y-112578000D01*
X138514891Y-112579053D01*
G37*
G04 #@! TD.AperFunction*
G04 #@! TA.AperFunction,SMDPad,CuDef*
G36*
X129421691Y-111004053D02*
G01*
X129442926Y-111007203D01*
X129463750Y-111012419D01*
X129483962Y-111019651D01*
X129503368Y-111028830D01*
X129521781Y-111039866D01*
X129539024Y-111052654D01*
X129554930Y-111067070D01*
X129569346Y-111082976D01*
X129582134Y-111100219D01*
X129593170Y-111118632D01*
X129602349Y-111138038D01*
X129609581Y-111158250D01*
X129614797Y-111179074D01*
X129617947Y-111200309D01*
X129619000Y-111221750D01*
X129619000Y-111659250D01*
X129617947Y-111680691D01*
X129614797Y-111701926D01*
X129609581Y-111722750D01*
X129602349Y-111742962D01*
X129593170Y-111762368D01*
X129582134Y-111780781D01*
X129569346Y-111798024D01*
X129554930Y-111813930D01*
X129539024Y-111828346D01*
X129521781Y-111841134D01*
X129503368Y-111852170D01*
X129483962Y-111861349D01*
X129463750Y-111868581D01*
X129442926Y-111873797D01*
X129421691Y-111876947D01*
X129400250Y-111878000D01*
X128887750Y-111878000D01*
X128866309Y-111876947D01*
X128845074Y-111873797D01*
X128824250Y-111868581D01*
X128804038Y-111861349D01*
X128784632Y-111852170D01*
X128766219Y-111841134D01*
X128748976Y-111828346D01*
X128733070Y-111813930D01*
X128718654Y-111798024D01*
X128705866Y-111780781D01*
X128694830Y-111762368D01*
X128685651Y-111742962D01*
X128678419Y-111722750D01*
X128673203Y-111701926D01*
X128670053Y-111680691D01*
X128669000Y-111659250D01*
X128669000Y-111221750D01*
X128670053Y-111200309D01*
X128673203Y-111179074D01*
X128678419Y-111158250D01*
X128685651Y-111138038D01*
X128694830Y-111118632D01*
X128705866Y-111100219D01*
X128718654Y-111082976D01*
X128733070Y-111067070D01*
X128748976Y-111052654D01*
X128766219Y-111039866D01*
X128784632Y-111028830D01*
X128804038Y-111019651D01*
X128824250Y-111012419D01*
X128845074Y-111007203D01*
X128866309Y-111004053D01*
X128887750Y-111003000D01*
X129400250Y-111003000D01*
X129421691Y-111004053D01*
G37*
G04 #@! TD.AperFunction*
G04 #@! TA.AperFunction,SMDPad,CuDef*
G36*
X129421691Y-112579053D02*
G01*
X129442926Y-112582203D01*
X129463750Y-112587419D01*
X129483962Y-112594651D01*
X129503368Y-112603830D01*
X129521781Y-112614866D01*
X129539024Y-112627654D01*
X129554930Y-112642070D01*
X129569346Y-112657976D01*
X129582134Y-112675219D01*
X129593170Y-112693632D01*
X129602349Y-112713038D01*
X129609581Y-112733250D01*
X129614797Y-112754074D01*
X129617947Y-112775309D01*
X129619000Y-112796750D01*
X129619000Y-113234250D01*
X129617947Y-113255691D01*
X129614797Y-113276926D01*
X129609581Y-113297750D01*
X129602349Y-113317962D01*
X129593170Y-113337368D01*
X129582134Y-113355781D01*
X129569346Y-113373024D01*
X129554930Y-113388930D01*
X129539024Y-113403346D01*
X129521781Y-113416134D01*
X129503368Y-113427170D01*
X129483962Y-113436349D01*
X129463750Y-113443581D01*
X129442926Y-113448797D01*
X129421691Y-113451947D01*
X129400250Y-113453000D01*
X128887750Y-113453000D01*
X128866309Y-113451947D01*
X128845074Y-113448797D01*
X128824250Y-113443581D01*
X128804038Y-113436349D01*
X128784632Y-113427170D01*
X128766219Y-113416134D01*
X128748976Y-113403346D01*
X128733070Y-113388930D01*
X128718654Y-113373024D01*
X128705866Y-113355781D01*
X128694830Y-113337368D01*
X128685651Y-113317962D01*
X128678419Y-113297750D01*
X128673203Y-113276926D01*
X128670053Y-113255691D01*
X128669000Y-113234250D01*
X128669000Y-112796750D01*
X128670053Y-112775309D01*
X128673203Y-112754074D01*
X128678419Y-112733250D01*
X128685651Y-112713038D01*
X128694830Y-112693632D01*
X128705866Y-112675219D01*
X128718654Y-112657976D01*
X128733070Y-112642070D01*
X128748976Y-112627654D01*
X128766219Y-112614866D01*
X128784632Y-112603830D01*
X128804038Y-112594651D01*
X128824250Y-112587419D01*
X128845074Y-112582203D01*
X128866309Y-112579053D01*
X128887750Y-112578000D01*
X129400250Y-112578000D01*
X129421691Y-112579053D01*
G37*
G04 #@! TD.AperFunction*
G04 #@! TA.AperFunction,SMDPad,CuDef*
G36*
X126373691Y-112579053D02*
G01*
X126394926Y-112582203D01*
X126415750Y-112587419D01*
X126435962Y-112594651D01*
X126455368Y-112603830D01*
X126473781Y-112614866D01*
X126491024Y-112627654D01*
X126506930Y-112642070D01*
X126521346Y-112657976D01*
X126534134Y-112675219D01*
X126545170Y-112693632D01*
X126554349Y-112713038D01*
X126561581Y-112733250D01*
X126566797Y-112754074D01*
X126569947Y-112775309D01*
X126571000Y-112796750D01*
X126571000Y-113234250D01*
X126569947Y-113255691D01*
X126566797Y-113276926D01*
X126561581Y-113297750D01*
X126554349Y-113317962D01*
X126545170Y-113337368D01*
X126534134Y-113355781D01*
X126521346Y-113373024D01*
X126506930Y-113388930D01*
X126491024Y-113403346D01*
X126473781Y-113416134D01*
X126455368Y-113427170D01*
X126435962Y-113436349D01*
X126415750Y-113443581D01*
X126394926Y-113448797D01*
X126373691Y-113451947D01*
X126352250Y-113453000D01*
X125839750Y-113453000D01*
X125818309Y-113451947D01*
X125797074Y-113448797D01*
X125776250Y-113443581D01*
X125756038Y-113436349D01*
X125736632Y-113427170D01*
X125718219Y-113416134D01*
X125700976Y-113403346D01*
X125685070Y-113388930D01*
X125670654Y-113373024D01*
X125657866Y-113355781D01*
X125646830Y-113337368D01*
X125637651Y-113317962D01*
X125630419Y-113297750D01*
X125625203Y-113276926D01*
X125622053Y-113255691D01*
X125621000Y-113234250D01*
X125621000Y-112796750D01*
X125622053Y-112775309D01*
X125625203Y-112754074D01*
X125630419Y-112733250D01*
X125637651Y-112713038D01*
X125646830Y-112693632D01*
X125657866Y-112675219D01*
X125670654Y-112657976D01*
X125685070Y-112642070D01*
X125700976Y-112627654D01*
X125718219Y-112614866D01*
X125736632Y-112603830D01*
X125756038Y-112594651D01*
X125776250Y-112587419D01*
X125797074Y-112582203D01*
X125818309Y-112579053D01*
X125839750Y-112578000D01*
X126352250Y-112578000D01*
X126373691Y-112579053D01*
G37*
G04 #@! TD.AperFunction*
G04 #@! TA.AperFunction,SMDPad,CuDef*
G36*
X126373691Y-111004053D02*
G01*
X126394926Y-111007203D01*
X126415750Y-111012419D01*
X126435962Y-111019651D01*
X126455368Y-111028830D01*
X126473781Y-111039866D01*
X126491024Y-111052654D01*
X126506930Y-111067070D01*
X126521346Y-111082976D01*
X126534134Y-111100219D01*
X126545170Y-111118632D01*
X126554349Y-111138038D01*
X126561581Y-111158250D01*
X126566797Y-111179074D01*
X126569947Y-111200309D01*
X126571000Y-111221750D01*
X126571000Y-111659250D01*
X126569947Y-111680691D01*
X126566797Y-111701926D01*
X126561581Y-111722750D01*
X126554349Y-111742962D01*
X126545170Y-111762368D01*
X126534134Y-111780781D01*
X126521346Y-111798024D01*
X126506930Y-111813930D01*
X126491024Y-111828346D01*
X126473781Y-111841134D01*
X126455368Y-111852170D01*
X126435962Y-111861349D01*
X126415750Y-111868581D01*
X126394926Y-111873797D01*
X126373691Y-111876947D01*
X126352250Y-111878000D01*
X125839750Y-111878000D01*
X125818309Y-111876947D01*
X125797074Y-111873797D01*
X125776250Y-111868581D01*
X125756038Y-111861349D01*
X125736632Y-111852170D01*
X125718219Y-111841134D01*
X125700976Y-111828346D01*
X125685070Y-111813930D01*
X125670654Y-111798024D01*
X125657866Y-111780781D01*
X125646830Y-111762368D01*
X125637651Y-111742962D01*
X125630419Y-111722750D01*
X125625203Y-111701926D01*
X125622053Y-111680691D01*
X125621000Y-111659250D01*
X125621000Y-111221750D01*
X125622053Y-111200309D01*
X125625203Y-111179074D01*
X125630419Y-111158250D01*
X125637651Y-111138038D01*
X125646830Y-111118632D01*
X125657866Y-111100219D01*
X125670654Y-111082976D01*
X125685070Y-111067070D01*
X125700976Y-111052654D01*
X125718219Y-111039866D01*
X125736632Y-111028830D01*
X125756038Y-111019651D01*
X125776250Y-111012419D01*
X125797074Y-111007203D01*
X125818309Y-111004053D01*
X125839750Y-111003000D01*
X126352250Y-111003000D01*
X126373691Y-111004053D01*
G37*
G04 #@! TD.AperFunction*
G04 #@! TA.AperFunction,SMDPad,CuDef*
G36*
X135771691Y-119894053D02*
G01*
X135792926Y-119897203D01*
X135813750Y-119902419D01*
X135833962Y-119909651D01*
X135853368Y-119918830D01*
X135871781Y-119929866D01*
X135889024Y-119942654D01*
X135904930Y-119957070D01*
X135919346Y-119972976D01*
X135932134Y-119990219D01*
X135943170Y-120008632D01*
X135952349Y-120028038D01*
X135959581Y-120048250D01*
X135964797Y-120069074D01*
X135967947Y-120090309D01*
X135969000Y-120111750D01*
X135969000Y-120549250D01*
X135967947Y-120570691D01*
X135964797Y-120591926D01*
X135959581Y-120612750D01*
X135952349Y-120632962D01*
X135943170Y-120652368D01*
X135932134Y-120670781D01*
X135919346Y-120688024D01*
X135904930Y-120703930D01*
X135889024Y-120718346D01*
X135871781Y-120731134D01*
X135853368Y-120742170D01*
X135833962Y-120751349D01*
X135813750Y-120758581D01*
X135792926Y-120763797D01*
X135771691Y-120766947D01*
X135750250Y-120768000D01*
X135237750Y-120768000D01*
X135216309Y-120766947D01*
X135195074Y-120763797D01*
X135174250Y-120758581D01*
X135154038Y-120751349D01*
X135134632Y-120742170D01*
X135116219Y-120731134D01*
X135098976Y-120718346D01*
X135083070Y-120703930D01*
X135068654Y-120688024D01*
X135055866Y-120670781D01*
X135044830Y-120652368D01*
X135035651Y-120632962D01*
X135028419Y-120612750D01*
X135023203Y-120591926D01*
X135020053Y-120570691D01*
X135019000Y-120549250D01*
X135019000Y-120111750D01*
X135020053Y-120090309D01*
X135023203Y-120069074D01*
X135028419Y-120048250D01*
X135035651Y-120028038D01*
X135044830Y-120008632D01*
X135055866Y-119990219D01*
X135068654Y-119972976D01*
X135083070Y-119957070D01*
X135098976Y-119942654D01*
X135116219Y-119929866D01*
X135134632Y-119918830D01*
X135154038Y-119909651D01*
X135174250Y-119902419D01*
X135195074Y-119897203D01*
X135216309Y-119894053D01*
X135237750Y-119893000D01*
X135750250Y-119893000D01*
X135771691Y-119894053D01*
G37*
G04 #@! TD.AperFunction*
G04 #@! TA.AperFunction,SMDPad,CuDef*
G36*
X135771691Y-121469053D02*
G01*
X135792926Y-121472203D01*
X135813750Y-121477419D01*
X135833962Y-121484651D01*
X135853368Y-121493830D01*
X135871781Y-121504866D01*
X135889024Y-121517654D01*
X135904930Y-121532070D01*
X135919346Y-121547976D01*
X135932134Y-121565219D01*
X135943170Y-121583632D01*
X135952349Y-121603038D01*
X135959581Y-121623250D01*
X135964797Y-121644074D01*
X135967947Y-121665309D01*
X135969000Y-121686750D01*
X135969000Y-122124250D01*
X135967947Y-122145691D01*
X135964797Y-122166926D01*
X135959581Y-122187750D01*
X135952349Y-122207962D01*
X135943170Y-122227368D01*
X135932134Y-122245781D01*
X135919346Y-122263024D01*
X135904930Y-122278930D01*
X135889024Y-122293346D01*
X135871781Y-122306134D01*
X135853368Y-122317170D01*
X135833962Y-122326349D01*
X135813750Y-122333581D01*
X135792926Y-122338797D01*
X135771691Y-122341947D01*
X135750250Y-122343000D01*
X135237750Y-122343000D01*
X135216309Y-122341947D01*
X135195074Y-122338797D01*
X135174250Y-122333581D01*
X135154038Y-122326349D01*
X135134632Y-122317170D01*
X135116219Y-122306134D01*
X135098976Y-122293346D01*
X135083070Y-122278930D01*
X135068654Y-122263024D01*
X135055866Y-122245781D01*
X135044830Y-122227368D01*
X135035651Y-122207962D01*
X135028419Y-122187750D01*
X135023203Y-122166926D01*
X135020053Y-122145691D01*
X135019000Y-122124250D01*
X135019000Y-121686750D01*
X135020053Y-121665309D01*
X135023203Y-121644074D01*
X135028419Y-121623250D01*
X135035651Y-121603038D01*
X135044830Y-121583632D01*
X135055866Y-121565219D01*
X135068654Y-121547976D01*
X135083070Y-121532070D01*
X135098976Y-121517654D01*
X135116219Y-121504866D01*
X135134632Y-121493830D01*
X135154038Y-121484651D01*
X135174250Y-121477419D01*
X135195074Y-121472203D01*
X135216309Y-121469053D01*
X135237750Y-121468000D01*
X135750250Y-121468000D01*
X135771691Y-121469053D01*
G37*
G04 #@! TD.AperFunction*
D14*
X122638000Y-115612000D03*
X122638000Y-116262000D03*
X122638000Y-116912000D03*
X122638000Y-117562000D03*
X122638000Y-118212000D03*
X122638000Y-118862000D03*
X122638000Y-119512000D03*
X128538000Y-119512000D03*
X128538000Y-118862000D03*
X128538000Y-118212000D03*
X128538000Y-117562000D03*
X128538000Y-116912000D03*
X128538000Y-116262000D03*
X128538000Y-115612000D03*
D15*
X132192000Y-111878000D02*
X132192000Y-111440500D01*
X131866990Y-112203010D02*
X132192000Y-111878000D01*
X126571000Y-111440500D02*
X127333510Y-112203010D01*
X127333510Y-112203010D02*
X131866990Y-112203010D01*
X126096000Y-111440500D02*
X126571000Y-111440500D01*
X124521000Y-113015500D02*
X126096000Y-111440500D01*
X123048000Y-113015500D02*
X124521000Y-113015500D01*
X123048000Y-115202000D02*
X122638000Y-115612000D01*
X123048000Y-113015500D02*
X123048000Y-115202000D01*
X132992010Y-111765510D02*
X132667000Y-111440500D01*
X132667000Y-111440500D02*
X132192000Y-111440500D01*
X130217990Y-116233504D02*
X132992010Y-113459484D01*
X130217990Y-117417012D02*
X130217990Y-116233504D01*
X132992010Y-113459484D02*
X132992010Y-111765510D01*
X129423002Y-118212000D02*
X130217990Y-117417012D01*
X128538000Y-118212000D02*
X129423002Y-118212000D01*
X127037989Y-118750601D02*
X127037990Y-120183402D01*
X128538000Y-118212000D02*
X127576590Y-118212000D01*
X132192000Y-125337412D02*
X132192000Y-126452000D01*
X127037990Y-120183402D02*
X132192000Y-125337412D01*
X127576590Y-118212000D02*
X127037989Y-118750601D01*
X123613000Y-116262000D02*
X122638000Y-116262000D01*
X126096000Y-113779000D02*
X123613000Y-116262000D01*
X126096000Y-113015500D02*
X126096000Y-113779000D01*
X126571000Y-113015500D02*
X129144000Y-113015500D01*
X126096000Y-113015500D02*
X126571000Y-113015500D01*
X129619000Y-113015500D02*
X132192000Y-113015500D01*
X129144000Y-113015500D02*
X129619000Y-113015500D01*
X126770001Y-125602001D02*
X127620000Y-126452000D01*
X126349392Y-117562000D02*
X126255001Y-117656391D01*
X126255001Y-125087001D02*
X126770001Y-125602001D01*
X126255001Y-117656391D02*
X126255001Y-125087001D01*
X128538000Y-117562000D02*
X126349392Y-117562000D01*
X135627700Y-115150000D02*
X134820000Y-115150000D01*
X137762200Y-113015500D02*
X135627700Y-115150000D01*
X138237200Y-113015500D02*
X137762200Y-113015500D01*
X134820000Y-115150000D02*
X133970000Y-115150000D01*
X138542000Y-119893000D02*
X138542000Y-120330500D01*
X138959001Y-119475999D02*
X138542000Y-119893000D01*
X138959001Y-114174801D02*
X138959001Y-119475999D01*
X138237200Y-113453000D02*
X138959001Y-114174801D01*
X138237200Y-113015500D02*
X138237200Y-113453000D01*
X138542000Y-120330500D02*
X135494000Y-120330500D01*
X137272000Y-121125500D02*
X137272000Y-125249919D01*
X137272000Y-125249919D02*
X137272000Y-126452000D01*
X138067000Y-120330500D02*
X137272000Y-121125500D01*
X138542000Y-120330500D02*
X138067000Y-120330500D01*
X134469498Y-113015500D02*
X130668000Y-116816998D01*
X135189200Y-113015500D02*
X134469498Y-113015500D01*
X130668000Y-116816998D02*
X130668000Y-118832000D01*
X130638000Y-118862000D02*
X128538000Y-118862000D01*
X130668000Y-118832000D02*
X130638000Y-118862000D01*
X131825001Y-117674999D02*
X130668000Y-118832000D01*
X134659001Y-117674999D02*
X131825001Y-117674999D01*
X137184000Y-115150000D02*
X134659001Y-117674999D01*
X138034000Y-115150000D02*
X137184000Y-115150000D01*
X127563000Y-118862000D02*
X128538000Y-118862000D01*
X127487999Y-118937001D02*
X127563000Y-118862000D01*
X127487999Y-119997001D02*
X127487999Y-118937001D01*
X129396498Y-121905500D02*
X127487999Y-119997001D01*
X135494000Y-121905500D02*
X129396498Y-121905500D01*
X133970000Y-119150000D02*
X133970000Y-118450000D01*
X133608000Y-119512000D02*
X133970000Y-119150000D01*
X128538000Y-119512000D02*
X133608000Y-119512000D01*
X133970000Y-118450000D02*
X138034000Y-118450000D01*
X135581999Y-125602001D02*
X134732000Y-126452000D01*
X136294010Y-124889990D02*
X135581999Y-125602001D01*
X136294010Y-121461516D02*
X136294010Y-124889990D01*
X135975484Y-121142990D02*
X136294010Y-121461516D01*
X135012516Y-121142990D02*
X135975484Y-121142990D01*
X133608000Y-119738474D02*
X135012516Y-121142990D01*
X133608000Y-119512000D02*
X133608000Y-119738474D01*
X123613000Y-117562000D02*
X122638000Y-117562000D01*
X123688001Y-117637001D02*
X123613000Y-117562000D01*
X122540000Y-125352000D02*
X123688001Y-124203999D01*
X123688001Y-124203999D02*
X123688001Y-117637001D01*
X122540000Y-126452000D02*
X122540000Y-125352000D01*
X125080000Y-118379000D02*
X125080000Y-125249919D01*
X125080000Y-125249919D02*
X125080000Y-126452000D01*
X123613000Y-116912000D02*
X125080000Y-118379000D01*
X122638000Y-116912000D02*
X123613000Y-116912000D01*
D16*
G36*
X139340001Y-110898713D02*
G01*
X139338012Y-110878518D01*
X139301702Y-110758820D01*
X139242737Y-110648506D01*
X139163385Y-110551815D01*
X139066694Y-110472463D01*
X138956380Y-110413498D01*
X138836682Y-110377188D01*
X138712200Y-110364928D01*
X138522950Y-110368000D01*
X138364200Y-110526750D01*
X138364200Y-111313500D01*
X138384200Y-111313500D01*
X138384200Y-111567500D01*
X138364200Y-111567500D01*
X138364200Y-111587500D01*
X138110200Y-111587500D01*
X138110200Y-111567500D01*
X137285950Y-111567500D01*
X137127200Y-111726250D01*
X137124128Y-111878000D01*
X137136388Y-112002482D01*
X137172698Y-112122180D01*
X137231663Y-112232494D01*
X137286300Y-112299070D01*
X137268529Y-112320725D01*
X137189350Y-112468858D01*
X137169891Y-112533008D01*
X136278979Y-113423919D01*
X136285808Y-113401408D01*
X136302272Y-113234250D01*
X136302272Y-112796750D01*
X136285808Y-112629592D01*
X136237050Y-112468858D01*
X136157871Y-112320725D01*
X136140100Y-112299070D01*
X136194737Y-112232494D01*
X136253702Y-112122180D01*
X136290012Y-112002482D01*
X136302272Y-111878000D01*
X136299200Y-111726250D01*
X136140450Y-111567500D01*
X135316200Y-111567500D01*
X135316200Y-111587500D01*
X135062200Y-111587500D01*
X135062200Y-111567500D01*
X134237950Y-111567500D01*
X134079200Y-111726250D01*
X134076128Y-111878000D01*
X134088388Y-112002482D01*
X134124698Y-112122180D01*
X134183663Y-112232494D01*
X134233284Y-112292957D01*
X134191898Y-112305511D01*
X134177251Y-112309954D01*
X134045221Y-112380526D01*
X133961581Y-112449168D01*
X133929497Y-112475499D01*
X133905699Y-112504497D01*
X133752010Y-112658186D01*
X133752010Y-111802843D01*
X133755687Y-111765510D01*
X133741013Y-111616524D01*
X133697556Y-111473263D01*
X133680044Y-111440501D01*
X133626984Y-111341234D01*
X133532011Y-111225509D01*
X133503007Y-111201706D01*
X133304301Y-111003000D01*
X134076128Y-111003000D01*
X134079200Y-111154750D01*
X134237950Y-111313500D01*
X135062200Y-111313500D01*
X135062200Y-110526750D01*
X135316200Y-110526750D01*
X135316200Y-111313500D01*
X136140450Y-111313500D01*
X136299200Y-111154750D01*
X136302272Y-111003000D01*
X137124128Y-111003000D01*
X137127200Y-111154750D01*
X137285950Y-111313500D01*
X138110200Y-111313500D01*
X138110200Y-110526750D01*
X137951450Y-110368000D01*
X137762200Y-110364928D01*
X137637718Y-110377188D01*
X137518020Y-110413498D01*
X137407706Y-110472463D01*
X137311015Y-110551815D01*
X137231663Y-110648506D01*
X137172698Y-110758820D01*
X137136388Y-110878518D01*
X137124128Y-111003000D01*
X136302272Y-111003000D01*
X136290012Y-110878518D01*
X136253702Y-110758820D01*
X136194737Y-110648506D01*
X136115385Y-110551815D01*
X136018694Y-110472463D01*
X135908380Y-110413498D01*
X135788682Y-110377188D01*
X135664200Y-110364928D01*
X135474950Y-110368000D01*
X135316200Y-110526750D01*
X135062200Y-110526750D01*
X134903450Y-110368000D01*
X134714200Y-110364928D01*
X134589718Y-110377188D01*
X134470020Y-110413498D01*
X134359706Y-110472463D01*
X134263015Y-110551815D01*
X134183663Y-110648506D01*
X134124698Y-110758820D01*
X134088388Y-110878518D01*
X134076128Y-111003000D01*
X133304301Y-111003000D01*
X133259310Y-110958009D01*
X133239850Y-110893858D01*
X133160671Y-110745725D01*
X133054115Y-110615885D01*
X132924275Y-110509329D01*
X132776142Y-110430150D01*
X132615408Y-110381392D01*
X132448250Y-110364928D01*
X131935750Y-110364928D01*
X131768592Y-110381392D01*
X131607858Y-110430150D01*
X131459725Y-110509329D01*
X131329885Y-110615885D01*
X131223329Y-110745725D01*
X131144150Y-110893858D01*
X131095392Y-111054592D01*
X131078928Y-111221750D01*
X131078928Y-111443010D01*
X127648312Y-111443010D01*
X127208302Y-111003000D01*
X128030928Y-111003000D01*
X128034000Y-111154750D01*
X128192750Y-111313500D01*
X129017000Y-111313500D01*
X129017000Y-110526750D01*
X129271000Y-110526750D01*
X129271000Y-111313500D01*
X130095250Y-111313500D01*
X130254000Y-111154750D01*
X130257072Y-111003000D01*
X130244812Y-110878518D01*
X130208502Y-110758820D01*
X130149537Y-110648506D01*
X130070185Y-110551815D01*
X129973494Y-110472463D01*
X129863180Y-110413498D01*
X129743482Y-110377188D01*
X129619000Y-110364928D01*
X129429750Y-110368000D01*
X129271000Y-110526750D01*
X129017000Y-110526750D01*
X128858250Y-110368000D01*
X128669000Y-110364928D01*
X128544518Y-110377188D01*
X128424820Y-110413498D01*
X128314506Y-110472463D01*
X128217815Y-110551815D01*
X128138463Y-110648506D01*
X128079498Y-110758820D01*
X128043188Y-110878518D01*
X128030928Y-111003000D01*
X127208302Y-111003000D01*
X127163310Y-110958009D01*
X127143850Y-110893858D01*
X127064671Y-110745725D01*
X126958115Y-110615885D01*
X126828275Y-110509329D01*
X126680142Y-110430150D01*
X126519408Y-110381392D01*
X126352250Y-110364928D01*
X125839750Y-110364928D01*
X125672592Y-110381392D01*
X125511858Y-110430150D01*
X125363725Y-110509329D01*
X125233885Y-110615885D01*
X125127329Y-110745725D01*
X125048150Y-110893858D01*
X124999392Y-111054592D01*
X124982928Y-111221750D01*
X124982928Y-111478770D01*
X124206199Y-112255500D01*
X124034657Y-112255500D01*
X124053537Y-112232494D01*
X124112502Y-112122180D01*
X124148812Y-112002482D01*
X124161072Y-111878000D01*
X124158000Y-111726250D01*
X123999250Y-111567500D01*
X123175000Y-111567500D01*
X123175000Y-111587500D01*
X122921000Y-111587500D01*
X122921000Y-111567500D01*
X122096750Y-111567500D01*
X121938000Y-111726250D01*
X121934928Y-111878000D01*
X121947188Y-112002482D01*
X121983498Y-112122180D01*
X122042463Y-112232494D01*
X122097100Y-112299070D01*
X122079329Y-112320725D01*
X122000150Y-112468858D01*
X121951392Y-112629592D01*
X121934928Y-112796750D01*
X121934928Y-113234250D01*
X121951392Y-113401408D01*
X122000150Y-113562142D01*
X122079329Y-113710275D01*
X122185885Y-113840115D01*
X122288000Y-113923918D01*
X122288001Y-114748928D01*
X121913000Y-114748928D01*
X121788518Y-114761188D01*
X121668820Y-114797498D01*
X121558506Y-114856463D01*
X121461815Y-114935815D01*
X121382463Y-115032506D01*
X121323498Y-115142820D01*
X121287188Y-115262518D01*
X121274928Y-115387000D01*
X121274928Y-115837000D01*
X121284777Y-115937000D01*
X121274928Y-116037000D01*
X121274928Y-116487000D01*
X121284777Y-116587000D01*
X121274928Y-116687000D01*
X121274928Y-117137000D01*
X121284777Y-117237000D01*
X121274928Y-117337000D01*
X121274928Y-117787000D01*
X121284777Y-117887000D01*
X121274928Y-117987000D01*
X121274928Y-118437000D01*
X121284777Y-118537000D01*
X121274928Y-118637000D01*
X121274928Y-119087000D01*
X121284777Y-119187000D01*
X121274928Y-119287000D01*
X121274928Y-119737000D01*
X121287188Y-119861482D01*
X121323498Y-119981180D01*
X121382463Y-120091494D01*
X121461815Y-120188185D01*
X121558506Y-120267537D01*
X121668820Y-120326502D01*
X121788518Y-120362812D01*
X121913000Y-120375072D01*
X122928002Y-120375072D01*
X122928001Y-123889197D01*
X122028998Y-124788201D01*
X122000000Y-124811999D01*
X121976202Y-124840997D01*
X121976201Y-124840998D01*
X121905026Y-124927724D01*
X121885674Y-124963928D01*
X121690000Y-124963928D01*
X121565518Y-124976188D01*
X121445820Y-125012498D01*
X121335506Y-125071463D01*
X121238815Y-125150815D01*
X121159463Y-125247506D01*
X121100498Y-125357820D01*
X121064188Y-125477518D01*
X121051928Y-125602000D01*
X121051928Y-127302000D01*
X121064188Y-127426482D01*
X121100498Y-127546180D01*
X121159463Y-127656494D01*
X121238815Y-127753185D01*
X121335506Y-127832537D01*
X121445820Y-127891502D01*
X121565518Y-127927812D01*
X121690000Y-127940072D01*
X123390000Y-127940072D01*
X123514482Y-127927812D01*
X123634180Y-127891502D01*
X123744494Y-127832537D01*
X123841185Y-127753185D01*
X123920537Y-127656494D01*
X123979502Y-127546180D01*
X124001513Y-127473620D01*
X124133368Y-127605475D01*
X124376589Y-127767990D01*
X124646842Y-127879932D01*
X124933740Y-127937000D01*
X125226260Y-127937000D01*
X125513158Y-127879932D01*
X125783411Y-127767990D01*
X126026632Y-127605475D01*
X126233475Y-127398632D01*
X126355195Y-127216466D01*
X126424822Y-127333355D01*
X126619731Y-127549588D01*
X126853080Y-127723641D01*
X127115901Y-127848825D01*
X127263110Y-127893476D01*
X127493000Y-127772155D01*
X127493000Y-126579000D01*
X127747000Y-126579000D01*
X127747000Y-127772155D01*
X127976890Y-127893476D01*
X128124099Y-127848825D01*
X128386920Y-127723641D01*
X128620269Y-127549588D01*
X128815178Y-127333355D01*
X128964157Y-127083252D01*
X129061481Y-126808891D01*
X128940814Y-126579000D01*
X127747000Y-126579000D01*
X127493000Y-126579000D01*
X127473000Y-126579000D01*
X127473000Y-126325000D01*
X127493000Y-126325000D01*
X127493000Y-125131845D01*
X127747000Y-125131845D01*
X127747000Y-126325000D01*
X128940814Y-126325000D01*
X129061481Y-126095109D01*
X128964157Y-125820748D01*
X128815178Y-125570645D01*
X128620269Y-125354412D01*
X128386920Y-125180359D01*
X128124099Y-125055175D01*
X127976890Y-125010524D01*
X127747000Y-125131845D01*
X127493000Y-125131845D01*
X127263110Y-125010524D01*
X127115901Y-125055175D01*
X126853080Y-125180359D01*
X126619731Y-125354412D01*
X126424822Y-125570645D01*
X126355195Y-125687534D01*
X126233475Y-125505368D01*
X126026632Y-125298525D01*
X125840000Y-125173822D01*
X125840000Y-118416322D01*
X125843676Y-118378999D01*
X125840000Y-118341676D01*
X125840000Y-118341667D01*
X125829003Y-118230014D01*
X125785546Y-118086753D01*
X125714974Y-117954724D01*
X125620001Y-117838999D01*
X125591004Y-117815202D01*
X124362801Y-116587000D01*
X126607003Y-114342799D01*
X126636001Y-114319001D01*
X126730974Y-114203276D01*
X126801546Y-114071247D01*
X126843001Y-113934586D01*
X126958115Y-113840115D01*
X127011143Y-113775500D01*
X128228857Y-113775500D01*
X128281885Y-113840115D01*
X128411725Y-113946671D01*
X128559858Y-114025850D01*
X128720592Y-114074608D01*
X128887750Y-114091072D01*
X129400250Y-114091072D01*
X129567408Y-114074608D01*
X129728142Y-114025850D01*
X129876275Y-113946671D01*
X130006115Y-113840115D01*
X130059143Y-113775500D01*
X131276857Y-113775500D01*
X131329885Y-113840115D01*
X131443410Y-113933282D01*
X129901072Y-115475621D01*
X129901072Y-115387000D01*
X129888812Y-115262518D01*
X129852502Y-115142820D01*
X129793537Y-115032506D01*
X129714185Y-114935815D01*
X129617494Y-114856463D01*
X129507180Y-114797498D01*
X129387482Y-114761188D01*
X129263000Y-114748928D01*
X127813000Y-114748928D01*
X127688518Y-114761188D01*
X127568820Y-114797498D01*
X127458506Y-114856463D01*
X127361815Y-114935815D01*
X127282463Y-115032506D01*
X127223498Y-115142820D01*
X127187188Y-115262518D01*
X127174928Y-115387000D01*
X127174928Y-115837000D01*
X127184777Y-115937000D01*
X127174928Y-116037000D01*
X127174928Y-116487000D01*
X127184777Y-116587000D01*
X127174928Y-116687000D01*
X127174928Y-117137000D01*
X127185095Y-117240227D01*
X127178000Y-117305250D01*
X127210247Y-117337497D01*
X127223498Y-117381180D01*
X127282463Y-117491494D01*
X127292668Y-117503929D01*
X127284343Y-117506454D01*
X127152314Y-117577026D01*
X127036589Y-117671999D01*
X127012791Y-117700997D01*
X126526986Y-118186803D01*
X126497988Y-118210601D01*
X126474190Y-118239599D01*
X126403015Y-118326325D01*
X126355813Y-118414634D01*
X126332443Y-118458355D01*
X126288986Y-118601616D01*
X126277989Y-118713269D01*
X126277989Y-118713279D01*
X126274313Y-118750601D01*
X126277989Y-118787924D01*
X126277991Y-120146070D01*
X126274314Y-120183402D01*
X126288988Y-120332387D01*
X126332444Y-120475648D01*
X126403016Y-120607678D01*
X126474191Y-120694404D01*
X126497990Y-120723403D01*
X126526988Y-120747201D01*
X130912667Y-125132881D01*
X130890815Y-125150815D01*
X130811463Y-125247506D01*
X130752498Y-125357820D01*
X130716188Y-125477518D01*
X130703928Y-125602000D01*
X130703928Y-127302000D01*
X130716188Y-127426482D01*
X130752498Y-127546180D01*
X130811463Y-127656494D01*
X130890815Y-127753185D01*
X130987506Y-127832537D01*
X131097820Y-127891502D01*
X131217518Y-127927812D01*
X131342000Y-127940072D01*
X133042000Y-127940072D01*
X133166482Y-127927812D01*
X133286180Y-127891502D01*
X133396494Y-127832537D01*
X133493185Y-127753185D01*
X133572537Y-127656494D01*
X133631502Y-127546180D01*
X133653513Y-127473620D01*
X133785368Y-127605475D01*
X134028589Y-127767990D01*
X134298842Y-127879932D01*
X134585740Y-127937000D01*
X134878260Y-127937000D01*
X135165158Y-127879932D01*
X135435411Y-127767990D01*
X135678632Y-127605475D01*
X135885475Y-127398632D01*
X136002000Y-127224240D01*
X136118525Y-127398632D01*
X136325368Y-127605475D01*
X136568589Y-127767990D01*
X136838842Y-127879932D01*
X137125740Y-127937000D01*
X137418260Y-127937000D01*
X137705158Y-127879932D01*
X137975411Y-127767990D01*
X138218632Y-127605475D01*
X138425475Y-127398632D01*
X138587990Y-127155411D01*
X138699932Y-126885158D01*
X138757000Y-126598260D01*
X138757000Y-126305740D01*
X138699932Y-126018842D01*
X138587990Y-125748589D01*
X138425475Y-125505368D01*
X138218632Y-125298525D01*
X138032000Y-125173822D01*
X138032000Y-122977625D01*
X138067000Y-122981072D01*
X138256250Y-122978000D01*
X138415000Y-122819250D01*
X138415000Y-122032500D01*
X138395000Y-122032500D01*
X138395000Y-121778500D01*
X138415000Y-121778500D01*
X138415000Y-121758500D01*
X138669000Y-121758500D01*
X138669000Y-121778500D01*
X138689000Y-121778500D01*
X138689000Y-122032500D01*
X138669000Y-122032500D01*
X138669000Y-122819250D01*
X138827750Y-122978000D01*
X139017000Y-122981072D01*
X139141482Y-122968812D01*
X139261180Y-122932502D01*
X139340000Y-122890371D01*
X139340000Y-128840000D01*
X120660000Y-128840000D01*
X120660000Y-111003000D01*
X121934928Y-111003000D01*
X121938000Y-111154750D01*
X122096750Y-111313500D01*
X122921000Y-111313500D01*
X122921000Y-110526750D01*
X123175000Y-110526750D01*
X123175000Y-111313500D01*
X123999250Y-111313500D01*
X124158000Y-111154750D01*
X124161072Y-111003000D01*
X124148812Y-110878518D01*
X124112502Y-110758820D01*
X124053537Y-110648506D01*
X123974185Y-110551815D01*
X123877494Y-110472463D01*
X123767180Y-110413498D01*
X123647482Y-110377188D01*
X123523000Y-110364928D01*
X123333750Y-110368000D01*
X123175000Y-110526750D01*
X122921000Y-110526750D01*
X122762250Y-110368000D01*
X122573000Y-110364928D01*
X122448518Y-110377188D01*
X122328820Y-110413498D01*
X122218506Y-110472463D01*
X122121815Y-110551815D01*
X122042463Y-110648506D01*
X121983498Y-110758820D01*
X121947188Y-110878518D01*
X121934928Y-111003000D01*
X120660000Y-111003000D01*
X120660000Y-110160000D01*
X139340001Y-110160000D01*
X139340001Y-110898713D01*
G37*
X139340001Y-110898713D02*
X139338012Y-110878518D01*
X139301702Y-110758820D01*
X139242737Y-110648506D01*
X139163385Y-110551815D01*
X139066694Y-110472463D01*
X138956380Y-110413498D01*
X138836682Y-110377188D01*
X138712200Y-110364928D01*
X138522950Y-110368000D01*
X138364200Y-110526750D01*
X138364200Y-111313500D01*
X138384200Y-111313500D01*
X138384200Y-111567500D01*
X138364200Y-111567500D01*
X138364200Y-111587500D01*
X138110200Y-111587500D01*
X138110200Y-111567500D01*
X137285950Y-111567500D01*
X137127200Y-111726250D01*
X137124128Y-111878000D01*
X137136388Y-112002482D01*
X137172698Y-112122180D01*
X137231663Y-112232494D01*
X137286300Y-112299070D01*
X137268529Y-112320725D01*
X137189350Y-112468858D01*
X137169891Y-112533008D01*
X136278979Y-113423919D01*
X136285808Y-113401408D01*
X136302272Y-113234250D01*
X136302272Y-112796750D01*
X136285808Y-112629592D01*
X136237050Y-112468858D01*
X136157871Y-112320725D01*
X136140100Y-112299070D01*
X136194737Y-112232494D01*
X136253702Y-112122180D01*
X136290012Y-112002482D01*
X136302272Y-111878000D01*
X136299200Y-111726250D01*
X136140450Y-111567500D01*
X135316200Y-111567500D01*
X135316200Y-111587500D01*
X135062200Y-111587500D01*
X135062200Y-111567500D01*
X134237950Y-111567500D01*
X134079200Y-111726250D01*
X134076128Y-111878000D01*
X134088388Y-112002482D01*
X134124698Y-112122180D01*
X134183663Y-112232494D01*
X134233284Y-112292957D01*
X134191898Y-112305511D01*
X134177251Y-112309954D01*
X134045221Y-112380526D01*
X133961581Y-112449168D01*
X133929497Y-112475499D01*
X133905699Y-112504497D01*
X133752010Y-112658186D01*
X133752010Y-111802843D01*
X133755687Y-111765510D01*
X133741013Y-111616524D01*
X133697556Y-111473263D01*
X133680044Y-111440501D01*
X133626984Y-111341234D01*
X133532011Y-111225509D01*
X133503007Y-111201706D01*
X133304301Y-111003000D01*
X134076128Y-111003000D01*
X134079200Y-111154750D01*
X134237950Y-111313500D01*
X135062200Y-111313500D01*
X135062200Y-110526750D01*
X135316200Y-110526750D01*
X135316200Y-111313500D01*
X136140450Y-111313500D01*
X136299200Y-111154750D01*
X136302272Y-111003000D01*
X137124128Y-111003000D01*
X137127200Y-111154750D01*
X137285950Y-111313500D01*
X138110200Y-111313500D01*
X138110200Y-110526750D01*
X137951450Y-110368000D01*
X137762200Y-110364928D01*
X137637718Y-110377188D01*
X137518020Y-110413498D01*
X137407706Y-110472463D01*
X137311015Y-110551815D01*
X137231663Y-110648506D01*
X137172698Y-110758820D01*
X137136388Y-110878518D01*
X137124128Y-111003000D01*
X136302272Y-111003000D01*
X136290012Y-110878518D01*
X136253702Y-110758820D01*
X136194737Y-110648506D01*
X136115385Y-110551815D01*
X136018694Y-110472463D01*
X135908380Y-110413498D01*
X135788682Y-110377188D01*
X135664200Y-110364928D01*
X135474950Y-110368000D01*
X135316200Y-110526750D01*
X135062200Y-110526750D01*
X134903450Y-110368000D01*
X134714200Y-110364928D01*
X134589718Y-110377188D01*
X134470020Y-110413498D01*
X134359706Y-110472463D01*
X134263015Y-110551815D01*
X134183663Y-110648506D01*
X134124698Y-110758820D01*
X134088388Y-110878518D01*
X134076128Y-111003000D01*
X133304301Y-111003000D01*
X133259310Y-110958009D01*
X133239850Y-110893858D01*
X133160671Y-110745725D01*
X133054115Y-110615885D01*
X132924275Y-110509329D01*
X132776142Y-110430150D01*
X132615408Y-110381392D01*
X132448250Y-110364928D01*
X131935750Y-110364928D01*
X131768592Y-110381392D01*
X131607858Y-110430150D01*
X131459725Y-110509329D01*
X131329885Y-110615885D01*
X131223329Y-110745725D01*
X131144150Y-110893858D01*
X131095392Y-111054592D01*
X131078928Y-111221750D01*
X131078928Y-111443010D01*
X127648312Y-111443010D01*
X127208302Y-111003000D01*
X128030928Y-111003000D01*
X128034000Y-111154750D01*
X128192750Y-111313500D01*
X129017000Y-111313500D01*
X129017000Y-110526750D01*
X129271000Y-110526750D01*
X129271000Y-111313500D01*
X130095250Y-111313500D01*
X130254000Y-111154750D01*
X130257072Y-111003000D01*
X130244812Y-110878518D01*
X130208502Y-110758820D01*
X130149537Y-110648506D01*
X130070185Y-110551815D01*
X129973494Y-110472463D01*
X129863180Y-110413498D01*
X129743482Y-110377188D01*
X129619000Y-110364928D01*
X129429750Y-110368000D01*
X129271000Y-110526750D01*
X129017000Y-110526750D01*
X128858250Y-110368000D01*
X128669000Y-110364928D01*
X128544518Y-110377188D01*
X128424820Y-110413498D01*
X128314506Y-110472463D01*
X128217815Y-110551815D01*
X128138463Y-110648506D01*
X128079498Y-110758820D01*
X128043188Y-110878518D01*
X128030928Y-111003000D01*
X127208302Y-111003000D01*
X127163310Y-110958009D01*
X127143850Y-110893858D01*
X127064671Y-110745725D01*
X126958115Y-110615885D01*
X126828275Y-110509329D01*
X126680142Y-110430150D01*
X126519408Y-110381392D01*
X126352250Y-110364928D01*
X125839750Y-110364928D01*
X125672592Y-110381392D01*
X125511858Y-110430150D01*
X125363725Y-110509329D01*
X125233885Y-110615885D01*
X125127329Y-110745725D01*
X125048150Y-110893858D01*
X124999392Y-111054592D01*
X124982928Y-111221750D01*
X124982928Y-111478770D01*
X124206199Y-112255500D01*
X124034657Y-112255500D01*
X124053537Y-112232494D01*
X124112502Y-112122180D01*
X124148812Y-112002482D01*
X124161072Y-111878000D01*
X124158000Y-111726250D01*
X123999250Y-111567500D01*
X123175000Y-111567500D01*
X123175000Y-111587500D01*
X122921000Y-111587500D01*
X122921000Y-111567500D01*
X122096750Y-111567500D01*
X121938000Y-111726250D01*
X121934928Y-111878000D01*
X121947188Y-112002482D01*
X121983498Y-112122180D01*
X122042463Y-112232494D01*
X122097100Y-112299070D01*
X122079329Y-112320725D01*
X122000150Y-112468858D01*
X121951392Y-112629592D01*
X121934928Y-112796750D01*
X121934928Y-113234250D01*
X121951392Y-113401408D01*
X122000150Y-113562142D01*
X122079329Y-113710275D01*
X122185885Y-113840115D01*
X122288000Y-113923918D01*
X122288001Y-114748928D01*
X121913000Y-114748928D01*
X121788518Y-114761188D01*
X121668820Y-114797498D01*
X121558506Y-114856463D01*
X121461815Y-114935815D01*
X121382463Y-115032506D01*
X121323498Y-115142820D01*
X121287188Y-115262518D01*
X121274928Y-115387000D01*
X121274928Y-115837000D01*
X121284777Y-115937000D01*
X121274928Y-116037000D01*
X121274928Y-116487000D01*
X121284777Y-116587000D01*
X121274928Y-116687000D01*
X121274928Y-117137000D01*
X121284777Y-117237000D01*
X121274928Y-117337000D01*
X121274928Y-117787000D01*
X121284777Y-117887000D01*
X121274928Y-117987000D01*
X121274928Y-118437000D01*
X121284777Y-118537000D01*
X121274928Y-118637000D01*
X121274928Y-119087000D01*
X121284777Y-119187000D01*
X121274928Y-119287000D01*
X121274928Y-119737000D01*
X121287188Y-119861482D01*
X121323498Y-119981180D01*
X121382463Y-120091494D01*
X121461815Y-120188185D01*
X121558506Y-120267537D01*
X121668820Y-120326502D01*
X121788518Y-120362812D01*
X121913000Y-120375072D01*
X122928002Y-120375072D01*
X122928001Y-123889197D01*
X122028998Y-124788201D01*
X122000000Y-124811999D01*
X121976202Y-124840997D01*
X121976201Y-124840998D01*
X121905026Y-124927724D01*
X121885674Y-124963928D01*
X121690000Y-124963928D01*
X121565518Y-124976188D01*
X121445820Y-125012498D01*
X121335506Y-125071463D01*
X121238815Y-125150815D01*
X121159463Y-125247506D01*
X121100498Y-125357820D01*
X121064188Y-125477518D01*
X121051928Y-125602000D01*
X121051928Y-127302000D01*
X121064188Y-127426482D01*
X121100498Y-127546180D01*
X121159463Y-127656494D01*
X121238815Y-127753185D01*
X121335506Y-127832537D01*
X121445820Y-127891502D01*
X121565518Y-127927812D01*
X121690000Y-127940072D01*
X123390000Y-127940072D01*
X123514482Y-127927812D01*
X123634180Y-127891502D01*
X123744494Y-127832537D01*
X123841185Y-127753185D01*
X123920537Y-127656494D01*
X123979502Y-127546180D01*
X124001513Y-127473620D01*
X124133368Y-127605475D01*
X124376589Y-127767990D01*
X124646842Y-127879932D01*
X124933740Y-127937000D01*
X125226260Y-127937000D01*
X125513158Y-127879932D01*
X125783411Y-127767990D01*
X126026632Y-127605475D01*
X126233475Y-127398632D01*
X126355195Y-127216466D01*
X126424822Y-127333355D01*
X126619731Y-127549588D01*
X126853080Y-127723641D01*
X127115901Y-127848825D01*
X127263110Y-127893476D01*
X127493000Y-127772155D01*
X127493000Y-126579000D01*
X127747000Y-126579000D01*
X127747000Y-127772155D01*
X127976890Y-127893476D01*
X128124099Y-127848825D01*
X128386920Y-127723641D01*
X128620269Y-127549588D01*
X128815178Y-127333355D01*
X128964157Y-127083252D01*
X129061481Y-126808891D01*
X128940814Y-126579000D01*
X127747000Y-126579000D01*
X127493000Y-126579000D01*
X127473000Y-126579000D01*
X127473000Y-126325000D01*
X127493000Y-126325000D01*
X127493000Y-125131845D01*
X127747000Y-125131845D01*
X127747000Y-126325000D01*
X128940814Y-126325000D01*
X129061481Y-126095109D01*
X128964157Y-125820748D01*
X128815178Y-125570645D01*
X128620269Y-125354412D01*
X128386920Y-125180359D01*
X128124099Y-125055175D01*
X127976890Y-125010524D01*
X127747000Y-125131845D01*
X127493000Y-125131845D01*
X127263110Y-125010524D01*
X127115901Y-125055175D01*
X126853080Y-125180359D01*
X126619731Y-125354412D01*
X126424822Y-125570645D01*
X126355195Y-125687534D01*
X126233475Y-125505368D01*
X126026632Y-125298525D01*
X125840000Y-125173822D01*
X125840000Y-118416322D01*
X125843676Y-118378999D01*
X125840000Y-118341676D01*
X125840000Y-118341667D01*
X125829003Y-118230014D01*
X125785546Y-118086753D01*
X125714974Y-117954724D01*
X125620001Y-117838999D01*
X125591004Y-117815202D01*
X124362801Y-116587000D01*
X126607003Y-114342799D01*
X126636001Y-114319001D01*
X126730974Y-114203276D01*
X126801546Y-114071247D01*
X126843001Y-113934586D01*
X126958115Y-113840115D01*
X127011143Y-113775500D01*
X128228857Y-113775500D01*
X128281885Y-113840115D01*
X128411725Y-113946671D01*
X128559858Y-114025850D01*
X128720592Y-114074608D01*
X128887750Y-114091072D01*
X129400250Y-114091072D01*
X129567408Y-114074608D01*
X129728142Y-114025850D01*
X129876275Y-113946671D01*
X130006115Y-113840115D01*
X130059143Y-113775500D01*
X131276857Y-113775500D01*
X131329885Y-113840115D01*
X131443410Y-113933282D01*
X129901072Y-115475621D01*
X129901072Y-115387000D01*
X129888812Y-115262518D01*
X129852502Y-115142820D01*
X129793537Y-115032506D01*
X129714185Y-114935815D01*
X129617494Y-114856463D01*
X129507180Y-114797498D01*
X129387482Y-114761188D01*
X129263000Y-114748928D01*
X127813000Y-114748928D01*
X127688518Y-114761188D01*
X127568820Y-114797498D01*
X127458506Y-114856463D01*
X127361815Y-114935815D01*
X127282463Y-115032506D01*
X127223498Y-115142820D01*
X127187188Y-115262518D01*
X127174928Y-115387000D01*
X127174928Y-115837000D01*
X127184777Y-115937000D01*
X127174928Y-116037000D01*
X127174928Y-116487000D01*
X127184777Y-116587000D01*
X127174928Y-116687000D01*
X127174928Y-117137000D01*
X127185095Y-117240227D01*
X127178000Y-117305250D01*
X127210247Y-117337497D01*
X127223498Y-117381180D01*
X127282463Y-117491494D01*
X127292668Y-117503929D01*
X127284343Y-117506454D01*
X127152314Y-117577026D01*
X127036589Y-117671999D01*
X127012791Y-117700997D01*
X126526986Y-118186803D01*
X126497988Y-118210601D01*
X126474190Y-118239599D01*
X126403015Y-118326325D01*
X126355813Y-118414634D01*
X126332443Y-118458355D01*
X126288986Y-118601616D01*
X126277989Y-118713269D01*
X126277989Y-118713279D01*
X126274313Y-118750601D01*
X126277989Y-118787924D01*
X126277991Y-120146070D01*
X126274314Y-120183402D01*
X126288988Y-120332387D01*
X126332444Y-120475648D01*
X126403016Y-120607678D01*
X126474191Y-120694404D01*
X126497990Y-120723403D01*
X126526988Y-120747201D01*
X130912667Y-125132881D01*
X130890815Y-125150815D01*
X130811463Y-125247506D01*
X130752498Y-125357820D01*
X130716188Y-125477518D01*
X130703928Y-125602000D01*
X130703928Y-127302000D01*
X130716188Y-127426482D01*
X130752498Y-127546180D01*
X130811463Y-127656494D01*
X130890815Y-127753185D01*
X130987506Y-127832537D01*
X131097820Y-127891502D01*
X131217518Y-127927812D01*
X131342000Y-127940072D01*
X133042000Y-127940072D01*
X133166482Y-127927812D01*
X133286180Y-127891502D01*
X133396494Y-127832537D01*
X133493185Y-127753185D01*
X133572537Y-127656494D01*
X133631502Y-127546180D01*
X133653513Y-127473620D01*
X133785368Y-127605475D01*
X134028589Y-127767990D01*
X134298842Y-127879932D01*
X134585740Y-127937000D01*
X134878260Y-127937000D01*
X135165158Y-127879932D01*
X135435411Y-127767990D01*
X135678632Y-127605475D01*
X135885475Y-127398632D01*
X136002000Y-127224240D01*
X136118525Y-127398632D01*
X136325368Y-127605475D01*
X136568589Y-127767990D01*
X136838842Y-127879932D01*
X137125740Y-127937000D01*
X137418260Y-127937000D01*
X137705158Y-127879932D01*
X137975411Y-127767990D01*
X138218632Y-127605475D01*
X138425475Y-127398632D01*
X138587990Y-127155411D01*
X138699932Y-126885158D01*
X138757000Y-126598260D01*
X138757000Y-126305740D01*
X138699932Y-126018842D01*
X138587990Y-125748589D01*
X138425475Y-125505368D01*
X138218632Y-125298525D01*
X138032000Y-125173822D01*
X138032000Y-122977625D01*
X138067000Y-122981072D01*
X138256250Y-122978000D01*
X138415000Y-122819250D01*
X138415000Y-122032500D01*
X138395000Y-122032500D01*
X138395000Y-121778500D01*
X138415000Y-121778500D01*
X138415000Y-121758500D01*
X138669000Y-121758500D01*
X138669000Y-121778500D01*
X138689000Y-121778500D01*
X138689000Y-122032500D01*
X138669000Y-122032500D01*
X138669000Y-122819250D01*
X138827750Y-122978000D01*
X139017000Y-122981072D01*
X139141482Y-122968812D01*
X139261180Y-122932502D01*
X139340000Y-122890371D01*
X139340000Y-128840000D01*
X120660000Y-128840000D01*
X120660000Y-111003000D01*
X121934928Y-111003000D01*
X121938000Y-111154750D01*
X122096750Y-111313500D01*
X122921000Y-111313500D01*
X122921000Y-110526750D01*
X123175000Y-110526750D01*
X123175000Y-111313500D01*
X123999250Y-111313500D01*
X124158000Y-111154750D01*
X124161072Y-111003000D01*
X124148812Y-110878518D01*
X124112502Y-110758820D01*
X124053537Y-110648506D01*
X123974185Y-110551815D01*
X123877494Y-110472463D01*
X123767180Y-110413498D01*
X123647482Y-110377188D01*
X123523000Y-110364928D01*
X123333750Y-110368000D01*
X123175000Y-110526750D01*
X122921000Y-110526750D01*
X122762250Y-110368000D01*
X122573000Y-110364928D01*
X122448518Y-110377188D01*
X122328820Y-110413498D01*
X122218506Y-110472463D01*
X122121815Y-110551815D01*
X122042463Y-110648506D01*
X121983498Y-110758820D01*
X121947188Y-110878518D01*
X121934928Y-111003000D01*
X120660000Y-111003000D01*
X120660000Y-110160000D01*
X139340001Y-110160000D01*
X139340001Y-110898713D01*
M02*
