EESchema Schematic File Version 4
EELAYER 30 0
EELAYER END
$Descr A4 11693 8268
encoding utf-8
Sheet 1 1
Title ""
Date ""
Rev ""
Comp ""
Comment1 ""
Comment2 ""
Comment3 ""
Comment4 ""
$EndDescr
$Comp
L Connector_Generic:Conn_01x03 J1
U 1 1 609360FD
P 3300 4050
F 0 "J1" H 3218 4367 50  0000 C CNN
F 1 "Conn_01x03" H 3218 4276 50  0000 C CNN
F 2 "Connector_PinHeader_2.54mm:PinHeader_1x03_P2.54mm_Vertical" H 3300 4050 50  0001 C CNN
F 3 "~" H 3300 4050 50  0001 C CNN
	1    3300 4050
	-1   0    0    -1  
$EndComp
$Comp
L Connector_Generic:Conn_01x03 J2
U 1 1 6093E2DF
P 8150 4150
F 0 "J2" H 8230 4192 50  0000 L CNN
F 1 "Conn_01x03" H 8230 4101 50  0000 L CNN
F 2 "Connector_PinHeader_2.54mm:PinHeader_1x03_P2.54mm_Vertical" H 8150 4150 50  0001 C CNN
F 3 "~" H 8150 4150 50  0001 C CNN
	1    8150 4150
	1    0    0    -1  
$EndComp
$Comp
L power:GND #PWR04
U 1 1 609461B6
P 3650 4250
F 0 "#PWR04" H 3650 4000 50  0001 C CNN
F 1 "GND" H 3655 4077 50  0000 C CNN
F 2 "" H 3650 4250 50  0001 C CNN
F 3 "" H 3650 4250 50  0001 C CNN
	1    3650 4250
	1    0    0    -1  
$EndComp
$Comp
L power:VCC #PWR03
U 1 1 6094730A
P 3650 3850
F 0 "#PWR03" H 3650 3700 50  0001 C CNN
F 1 "VCC" H 3667 4023 50  0000 C CNN
F 2 "" H 3650 3850 50  0001 C CNN
F 3 "" H 3650 3850 50  0001 C CNN
	1    3650 3850
	1    0    0    -1  
$EndComp
$Comp
L power:VCC #PWR01
U 1 1 6094C166
P 2900 4450
F 0 "#PWR01" H 2900 4300 50  0001 C CNN
F 1 "VCC" H 2917 4623 50  0000 C CNN
F 2 "" H 2900 4450 50  0001 C CNN
F 3 "" H 2900 4450 50  0001 C CNN
	1    2900 4450
	1    0    0    -1  
$EndComp
$Comp
L power:GND #PWR02
U 1 1 6094C501
P 2900 5050
F 0 "#PWR02" H 2900 4800 50  0001 C CNN
F 1 "GND" H 2905 4877 50  0000 C CNN
F 2 "" H 2900 5050 50  0001 C CNN
F 3 "" H 2900 5050 50  0001 C CNN
	1    2900 5050
	1    0    0    -1  
$EndComp
$Comp
L Device:R_US R1
U 1 1 6094CC3E
P 4150 4650
F 0 "R1" H 4082 4604 50  0000 R CNN
F 1 "330R" H 4082 4695 50  0000 R CNN
F 2 "Resistor_SMD:R_0603_1608Metric" V 4190 4640 50  0001 C CNN
F 3 "~" H 4150 4650 50  0001 C CNN
	1    4150 4650
	-1   0    0    1   
$EndComp
$Comp
L Device:R_US R2
U 1 1 60954906
P 4800 4500
F 0 "R2" V 4595 4500 50  0000 C CNN
F 1 "33k" V 4686 4500 50  0000 C CNN
F 2 "Resistor_SMD:R_0603_1608Metric" V 4840 4490 50  0001 C CNN
F 3 "~" H 4800 4500 50  0001 C CNN
	1    4800 4500
	0    1    1    0   
$EndComp
$Comp
L Device:R_US R3
U 1 1 609554AA
P 5300 4400
F 0 "R3" H 5368 4446 50  0000 L CNN
F 1 "10k" H 5368 4355 50  0000 L CNN
F 2 "Resistor_SMD:R_0603_1608Metric" V 5340 4390 50  0001 C CNN
F 3 "~" H 5300 4400 50  0001 C CNN
	1    5300 4400
	1    0    0    -1  
$EndComp
Wire Wire Line
	3500 3950 3650 3950
Wire Wire Line
	3650 4250 3650 4150
Wire Wire Line
	3650 4150 3500 4150
Wire Wire Line
	3650 3950 3650 3850
$Comp
L Device:C_Small C1
U 1 1 6096119A
P 4800 4900
F 0 "C1" V 4571 4900 50  0000 C CNN
F 1 "10p" V 4662 4900 50  0000 C CNN
F 2 "Capacitor_SMD:C_0603_1608Metric" H 4800 4900 50  0001 C CNN
F 3 "~" H 4800 4900 50  0001 C CNN
	1    4800 4900
	0    1    1    0   
$EndComp
$Comp
L Device:C_Small C2
U 1 1 6096533B
P 7150 4450
F 0 "C2" H 7242 4496 50  0000 L CNN
F 1 "1n" H 7242 4405 50  0000 L CNN
F 2 "Capacitor_SMD:C_0603_1608Metric" H 7150 4450 50  0001 C CNN
F 3 "~" H 7150 4450 50  0001 C CNN
	1    7150 4450
	1    0    0    -1  
$EndComp
$Comp
L power:GND #PWR05
U 1 1 6097599A
P 4150 4850
F 0 "#PWR05" H 4150 4600 50  0001 C CNN
F 1 "GND" H 4155 4677 50  0000 C CNN
F 2 "" H 4150 4850 50  0001 C CNN
F 3 "" H 4150 4850 50  0001 C CNN
	1    4150 4850
	1    0    0    -1  
$EndComp
Wire Wire Line
	4200 4250 4150 4250
Wire Wire Line
	4150 4250 4150 4500
Wire Wire Line
	4150 4800 4150 4850
Wire Wire Line
	4150 4500 4600 4500
Connection ~ 4150 4500
Wire Wire Line
	4600 4500 4600 4900
Wire Wire Line
	4600 4900 4700 4900
Connection ~ 4600 4500
Wire Wire Line
	4600 4500 4650 4500
Wire Wire Line
	4900 4900 5000 4900
Wire Wire Line
	5000 4900 5000 4500
Wire Wire Line
	5000 4500 4950 4500
Wire Wire Line
	5000 4500 5000 4150
Wire Wire Line
	5000 4150 4800 4150
Connection ~ 5000 4500
Wire Wire Line
	5000 4150 5300 4150
Wire Wire Line
	5300 4150 5300 4250
Connection ~ 5000 4150
$Comp
L power:GND #PWR06
U 1 1 6097AE93
P 5300 4600
F 0 "#PWR06" H 5300 4350 50  0001 C CNN
F 1 "GND" H 5305 4427 50  0000 C CNN
F 2 "" H 5300 4600 50  0001 C CNN
F 3 "" H 5300 4600 50  0001 C CNN
	1    5300 4600
	1    0    0    -1  
$EndComp
Wire Wire Line
	5300 4600 5300 4550
Connection ~ 5300 4150
Wire Wire Line
	5300 4150 5650 4150
$Comp
L Device:R_US R4
U 1 1 60982BE9
P 5650 4750
F 0 "R4" H 5582 4704 50  0000 R CNN
F 1 "100k" H 5582 4795 50  0000 R CNN
F 2 "Resistor_SMD:R_0603_1608Metric" V 5690 4740 50  0001 C CNN
F 3 "~" H 5650 4750 50  0001 C CNN
	1    5650 4750
	-1   0    0    1   
$EndComp
$Comp
L power:GND #PWR07
U 1 1 60982BF3
P 5650 4900
F 0 "#PWR07" H 5650 4650 50  0001 C CNN
F 1 "GND" H 5655 4727 50  0000 C CNN
F 2 "" H 5650 4900 50  0001 C CNN
F 3 "" H 5650 4900 50  0001 C CNN
	1    5650 4900
	1    0    0    -1  
$EndComp
Wire Wire Line
	5650 4350 5650 4550
Connection ~ 5650 4550
Wire Wire Line
	5650 4550 5650 4600
$Comp
L Diode:MBR0540 D2
U 1 1 6098D226
P 6600 4250
F 0 "D2" H 6600 4034 50  0000 C CNN
F 1 "B5819W" H 6600 4125 50  0000 C CNN
F 2 "Diode_SMD:D_SOD-123" H 6600 4075 50  0001 C CNN
F 3 "http://www.mccsemi.com/up_pdf/MBR0520~MBR0580(SOD123).pdf" H 6600 4250 50  0001 C CNN
	1    6600 4250
	-1   0    0    1   
$EndComp
Wire Wire Line
	6800 4250 6750 4250
$Comp
L power:GND #PWR08
U 1 1 609905EA
P 7150 4650
F 0 "#PWR08" H 7150 4400 50  0001 C CNN
F 1 "GND" H 7155 4477 50  0000 C CNN
F 2 "" H 7150 4650 50  0001 C CNN
F 3 "" H 7150 4650 50  0001 C CNN
	1    7150 4650
	1    0    0    -1  
$EndComp
Wire Wire Line
	7150 4550 7150 4650
Wire Wire Line
	7150 4350 7150 4250
Wire Wire Line
	7150 4250 6800 4250
Connection ~ 6800 4250
Wire Wire Line
	7150 4250 7500 4250
Connection ~ 7150 4250
Wire Wire Line
	7500 4250 7500 4300
$Comp
L Device:R_US R6
U 1 1 60956E38
P 7500 4450
F 0 "R6" H 7432 4404 50  0000 R CNN
F 1 "22k" H 7432 4495 50  0000 R CNN
F 2 "Resistor_SMD:R_0603_1608Metric" V 7540 4440 50  0001 C CNN
F 3 "~" H 7500 4450 50  0001 C CNN
	1    7500 4450
	-1   0    0    1   
$EndComp
$Comp
L power:GND #PWR09
U 1 1 6099355A
P 7500 4650
F 0 "#PWR09" H 7500 4400 50  0001 C CNN
F 1 "GND" H 7505 4477 50  0000 C CNN
F 2 "" H 7500 4650 50  0001 C CNN
F 3 "" H 7500 4650 50  0001 C CNN
	1    7500 4650
	1    0    0    -1  
$EndComp
Wire Wire Line
	7500 4600 7500 4650
Wire Wire Line
	7900 3800 5300 3800
Wire Wire Line
	5300 3800 5300 4150
Wire Wire Line
	6350 3900 7800 3900
$Comp
L Device:R_US R5
U 1 1 60955B17
P 6600 4750
F 0 "R5" V 6805 4750 50  0000 C CNN
F 1 "100k" V 6714 4750 50  0000 C CNN
F 2 "Resistor_SMD:R_0603_1608Metric" V 6640 4740 50  0001 C CNN
F 3 "~" H 6600 4750 50  0001 C CNN
	1    6600 4750
	0    -1   -1   0   
$EndComp
Wire Wire Line
	6350 3900 6350 4250
Wire Wire Line
	6350 4250 6250 4250
Wire Wire Line
	6350 4250 6450 4250
Connection ~ 6350 4250
$Comp
L Diode:MBR0540 D1
U 1 1 60985B5F
P 6350 4400
F 0 "D1" V 6304 4479 50  0000 L CNN
F 1 "B5819W" V 6395 4479 50  0000 L CNN
F 2 "Diode_SMD:D_SOD-123" H 6350 4225 50  0001 C CNN
F 3 "http://www.mccsemi.com/up_pdf/MBR0520~MBR0580(SOD123).pdf" H 6350 4400 50  0001 C CNN
	1    6350 4400
	0    1    1    0   
$EndComp
Wire Wire Line
	5650 4550 6350 4550
Wire Wire Line
	6350 4550 6350 4750
Wire Wire Line
	6350 4750 6450 4750
Connection ~ 6350 4550
Wire Wire Line
	6750 4750 6800 4750
Wire Wire Line
	6800 4250 6800 4750
$Comp
L power:PWR_FLAG #FLG01
U 1 1 609C1A2A
P 3650 3950
F 0 "#FLG01" H 3650 4025 50  0001 C CNN
F 1 "PWR_FLAG" V 3650 4078 50  0000 L CNN
F 2 "" H 3650 3950 50  0001 C CNN
F 3 "~" H 3650 3950 50  0001 C CNN
	1    3650 3950
	0    1    1    0   
$EndComp
Connection ~ 3650 3950
$Comp
L power:PWR_FLAG #FLG02
U 1 1 609C57C5
P 3650 4150
F 0 "#FLG02" H 3650 4225 50  0001 C CNN
F 1 "PWR_FLAG" V 3650 4278 50  0000 L CNN
F 2 "" H 3650 4150 50  0001 C CNN
F 3 "~" H 3650 4150 50  0001 C CNN
	1    3650 4150
	0    1    1    0   
$EndComp
Connection ~ 3650 4150
Wire Wire Line
	3500 4050 4200 4050
Text Notes 7400 7500 0    50   ~ 0
Peak Detection Circuit
Text Notes 10600 7650 0    50   ~ 0
0.1
Text Notes 8150 7650 0    50   ~ 0
05/05/2021
Text Notes 10750 7300 0    50   ~ 0
Alan Pohl
Wire Wire Line
	7800 3900 7800 4150
Wire Wire Line
	7800 4150 7950 4150
$Comp
L Amplifier_Operational:ADA4807-4 U1
U 1 1 60A3A030
P 4500 4150
F 0 "U1" H 4500 4517 50  0000 C CNN
F 1 "ADA4807-4" H 4500 4426 50  0000 C CNN
F 2 "Package_SO:TSSOP-14_4.4x5mm_P0.65mm" H 4450 4250 50  0001 C CNN
F 3 "https://www.analog.com/media/en/technical-documentation/data-sheets/ADA4807-1_4807-2_4807-4.pdf" H 4550 4350 50  0001 C CNN
	1    4500 4150
	1    0    0    -1  
$EndComp
$Comp
L Amplifier_Operational:ADA4807-4 U1
U 5 1 60A3EEBD
P 3000 4750
F 0 "U1" H 2958 4796 50  0000 L CNN
F 1 "ADA4807-4" H 2958 4705 50  0000 L CNN
F 2 "Package_SO:TSSOP-14_4.4x5mm_P0.65mm" H 2950 4850 50  0001 C CNN
F 3 "https://www.analog.com/media/en/technical-documentation/data-sheets/ADA4807-1_4807-2_4807-4.pdf" H 3050 4950 50  0001 C CNN
	5    3000 4750
	1    0    0    -1  
$EndComp
$Comp
L Amplifier_Operational:ADA4807-4 U1
U 3 1 60A3971C
P 5950 4250
F 0 "U1" H 5950 4617 50  0000 C CNN
F 1 "ADA4807-4" H 5950 4526 50  0000 C CNN
F 2 "" H 5900 4350 50  0001 C CNN
F 3 "https://www.analog.com/media/en/technical-documentation/data-sheets/ADA4807-1_4807-2_4807-4.pdf" H 6000 4450 50  0001 C CNN
	3    5950 4250
	1    0    0    -1  
$EndComp
Wire Wire Line
	7950 4050 7900 4050
Wire Wire Line
	7900 4050 7900 3800
Connection ~ 7500 4250
Wire Wire Line
	7500 4250 7950 4250
$EndSCHEMATC
