Designator,Val,Package,Mid X,Mid Y,Rotation,Layer
"C1","10p","C_0603_1608Metric",132.192000,-112.228000,270.000000,top
"C2","20n","C_0603_1608Metric",138.237200,-112.228000,90.000000,top
"D1","MBR0540","D_SOD-123",138.034000,-116.800000,90.000000,top
"D2","MBR0540","D_SOD-123",133.970000,-116.800000,270.000000,top
"R1","330R","R_0603_1608Metric",129.144000,-112.228000,270.000000,top
"R2","6k8","R_0603_1608Metric",126.096000,-112.228000,270.000000,top
"R3","10k","R_0603_1608Metric",123.048000,-112.228000,90.000000,top
"R4","100k","R_0603_1608Metric",135.189200,-112.228000,270.000000,top
"R5","100k","R_0603_1608Metric",135.494000,-121.118000,90.000000,top
"R6","22k","R_0603_1608Metric",138.542000,-121.118000,90.000000,top
"U1","ADA4807-4","TSSOP-14_4.4x5mm_P0.65mm",125.588000,-117.562000,0.000000,top
