[
  {
    "author": "Albert Einstein",
    "source": "https://www.goodreads.com/quotes/38836",
    "tags": "imagination, creativity, inspiration",
    "text": "Imagination is everything. It is the preview of life's coming attractions."
  },
  {
    "author": "Albert Einstein",
    "source": "https://www.goodreads.com/quotes/297929",
    "tags": "imagination, creativity, intelligence",
    "text": "The true sign of intelligence is not knowledge but imagination."
  },
  {
    "author": "Albert Einstein",
    "source": "https://www.goodreads.com/quotes/11458",
    "tags": "talent, curious, curiosity, passion",
    "text": "I have no special talent. I am only passionately curious."
  },
  {
    "author": "Annie Dillard",
    "source": "https://www.goodreads.com/quotes/530337",
    "tags": "passion, try, live",
    "text": "How we spend our days is, of course, how we spend our lives."
  },
  {
    "author": "Bernard Shaw",
    "source": "https://www.goodreads.com/quotes/8727",
    "tags": "meaning, creativity",
    "text": "Life isn't about finding yourself. Life is about creating yourself."
  },
  {
    "author": "Bill Gates",
    "source": "https://www.goodreads.com/quotes/323288",
    "tags": "inspirational",
    "text": "Success is a lousy teacher. It seduces smart people into thinking they can't lose."
  },
  {
    "author": "Blaise Pascal",
    "text": "We must learn our limits. We are all something, but none of us are everything."
  },
  {
    "author": "Brian Tracy",
    "source": "https://www.goodreads.com/quotes/28134",
    "tags": "future, inner power",
    "text": "You have within you, right now, everything you need to deal with whatever the world can throw at you."
  },
  {
    "author": "Bruce Garrabrandt",
    "source": "https://www.google.com/search?q=Bruce+Garrabrandt+Creativity+doesn%27t+wait",
    "tags": "creativity, creative, perfect, waiting, ordinary",
    "text": "Creativity doesn't wait for that perfect moment. It fashions its own perfect moments out of ordinary ones."
  },
  {
    "author": "Bruce Lee",
    "source": "https://www.goodreads.com/quotes/302319",
    "tags": "knowledge, action",
    "text": "Knowing is not enough, we must apply. Willing is not enough, we must do."
  },
  {
    "author": "Buckminster Fuller",
    "source": "https://www.goodreads.com/quotes/13119",
    "tags": "future, progress, reality, new",
    "text": "You never change things by fighting the existing reality. To change something, build a new model that makes the existing model obsolete"
  },
  {
    "author": "Chinese proverb",
    "text": "A gem cannot be polished without friction, nor a man perfected without trials."
  },
  {
    "author": "Confucius",
    "source": "https://www.goodreads.com/quotes/961585",
    "tags": "future, tomorrow, past",
    "text": "Think of tomorrow, the past can't be mended."
  },
  {
    "author": "David Bowie",
    "source": "https://www.goodreads.com/quotes/462535",
    "tags": "future, life, listen",
    "text": "Tomorrow belongs to those who can hear it coming"
  },
  {
    "author": "Deepak Chopra",
    "source": "https://www.goodreads.com/quotes/381641",
    "tags": "future, choice, decision, change",
    "text": "When you make a choice, you change the future."
  },
  {
    "author": "Dieter F. Uchtdorf",
    "source": "https://www.goodreads.com/quotes/8070701",
    "tags": "creative, creativity, soul",
    "text": "The desire to create is one of the deepest yearnings of the human soul."
  },
  {
    "author": "Edith Södergran",
    "source": "https://www.goodreads.com/quotes/11458",
    "tags": "creativity, fire, passion",
    "text": "The inner fire is the most important thing mankind possesses."
  },
  {
    "author": "Eric Hoffer",
    "source": "https://www.goodreads.com/quotes/10562",
    "tags": "change, learners, learned, learn, world",
    "text": "In times of change learners inherit the earth, while the learned find themselves beautifully equipped to deal with a world that no longer exists."
  },
  {
    "author": "Ernest Hemingway",
    "source": "https://www.goodreads.com/quotes/353013",
    "tags": "listen, learn, learning",
    "text": "I like to listen. I have learned a great deal from listening carefully. Most people never listen."
  },
  {
    "author": "Ernest Hemingway",
    "source": "https://www.goodreads.com/quotes/392801",
    "tags": "action, motion, mistake",
    "text": "Never mistake motion for action."
  },
  {
    "author": "Florence Nightingale",
    "source": "https://www.goodreads.com/quotes/161358",
    "tags": "excuse, excuses, success",
    "text": "I attribute my success to this: I never gave or took an excuse."
  },
  {
    "author": "Forrest Gump",
    "source": "https://www.rottentomatoes.com/m/forrest_gump/quotes",
    "tags": "fictional, movie, life",
    "text": "My mama always said: life is like a box of chocolate, you never know what you gonna get."
  },
  {
    "author": "Franklin Roosevelt",
    "text": "Happiness is not in the mere possession of money; it lies in the joy of achievement, in the thrill of creative effort."
  },
  {
    "author": "Fyodor Dostoyevsky",
    "source": "https://www.goodreads.com/author/quotes/3137322.Fyodor_Dostoyevsky",
    "tags": "soul, children, healing",
    "text": "The soul is healed by being with children."
  },
  {
    "author": "Goethe",
    "source": "https://www.goodreads.com/quotes/6774650",
    "tags": "time, effectiveness",
    "text": "If I know how you spend your time, then I know what might become of you."
  },
  {
    "author": "Henri Matisse",
    "source": "https://www.goodreads.com/quotes/21433",
    "tags": "creativity, courage",
    "text": "Creativity takes courage."
  },
  {
    "author": "Henry David Thoreau",
    "source": "https://www.brainyquote.com/quotes/henry_david_thoreau_106427",
    "tags": "price, priorities, life",
    "text": "The price of anything is the amount of life you exchange for it."
  },
  {
    "author": "J.K. Rowling",
    "source": "https://www.goodreads.com/quotes/396385",
    "tags": "future, adversity, failure, life, foundation",
    "text": "Rock bottom became the solid foundation on which I rebuilt my life."
  },
  {
    "author": "Jack Canfield",
    "source": "https://www.goodreads.com/quotes/495741",
    "tags": "overcome, action, try, persevere",
    "text": "Everything you want is on the other side of fear."
  },
  {
    "author": "Jean de la Bruyere",
    "source": "https://www.brainyquote.com/quotes/jean_de_la_bruyere_104446",
    "tags": "time, complain",
    "text": "Those who make the worse use of their time are the first to complain of its shortness"
  },
  {
    "author": "John Cleese",
    "source": "https://www.goodreads.com/quotes/548576",
    "tags": "urgent, important, trivial, thinking, ",
    "text": "It's easier to do trivial things that are urgent than it is to do important things that are not, like thinking. And it's also easier to do little things we know we can do than to start on big things that we’re not so sure about."
  },
  {
    "author": "Joseph Chilton Pearce",
    "source": "https://www.goodreads.com/quotes/30290",
    "tags": "creativity, life, fear",
    "text": "To live a creative life, we must lose our fear of being wrong."
  },
  {
    "author": "Ken Robinson",
    "source": "https://www.ted.com/talks/sir_ken_robinson_do_schools_kill_creativity",
    "tags": "creative, creativity, original, originality, wrong, mistakes",
    "text": "If you're not prepared to be wrong, you'll never come up with anything original."
  },
  {
    "author": "Louis Pasteur",
    "source": "https://www.goodreads.com/quotes/9178",
    "tags": "creativity, prepared, preparedness",
    "text": "Chance favors the prepared mind."
  },
  {
    "author": "Mahatma Gandhi",
    "source": "https://www.goodreads.com/quotes/16418",
    "tags": "action, change, world, present, future, today",
    "text": "The future depends on what you do today."
  },
  {
    "author": "Malcolm X",
    "source": "https://www.goodreads.com/quotes/788",
    "tags": "education, future, tomorrow, today",
    "text": "Education is our passport to the future, for tomorrow belongs to the people who prepare for it today."
  },
  {
    "author": "Marcus Aurelius",
    "text": "You have power over your mind, not outside events. Realize this, and you will find strength."
  },
  {
    "author": "Maya Angelou",
    "source": "https://www.goodreads.com/quotes/153929",
    "tags": "curiosity, limitless",
    "text": "You can't use up creativity. The more you use, the more you have."
  },
  {
    "author": "Michelangelo",
    "source": "https://www.brainyquote.com/quotes/michelangelo_183580",
    "tags": "time, waste",
    "text": "There is no greater harm than that of time wasted."
  },
  {
    "author": "Peter Drucker",
    "source": "https://www.goodreads.com/quotes/784267",
    "tags": "time, management",
    "text": "Until we can manage time, we can manage nothing else."
  },
  {
    "author": "Rainer Maria Rilke",
    "text": "Let everything happen to you. Beauty and terror. Just keep going. No feeling is final",
    "tags": "life, feelings, fearlessness, persistence",
    "source": "https://goodreads.com/quotes/95915"
  },
  {
    "author": "Richard Feynman",
    "source": "https://simple.wikiquote.org/wiki/Richard_Feynman",
    "tags": "create, creation, understand, understanding",
    "text": "What I cannot create, I do not understand."
  },
  {
    "author": "Satya Nadella",
    "source": "https://www.goodreads.com/quotes/8907834",
    "tags": "technology",
    "text": "Our industry does not respect tradition. What it respects is innovation."
  },
  {
    "author": "Shannon L. Alder",
    "source": "https://www.goodreads.com/quotes/736095",
    "tags": "choices, courage, decisions, questions, avoid, avoiding, avoidance, procrastination",
    "text": "Courage doesn’t happen when you have all the answers. It happens when you are ready to face the questions you have been avoiding your whole life."
  },
  {
    "author": "Sophocles",
    "text": "Wisdom is the supreme part of happiness."
  },
  {
    "author": "Sophia Loren",
    "source": "https://www.goodreads.com/quotes/8746",
    "tags": "creativity, youth, age, mind",
    "text": "There is a fountain of youth: it is your mind, your talents, the creativity you bring to your life and the lives of people you love. When you learn to tap this source, you will truly have defeated age."
  },
  {
    "author": "Steve Jobs",
    "source": "https://www.goodreads.com/author/quotes/5255891.Steve_Jobs",
    "tags": "inspirational",
    "text": "Stay hungry. Stay foolish."
  },
  {
    "author": "Sylvia Plath",
    "source": "https://www.goodreads.com/quotes/358562",
    "tags": "creativity, confidence, self-doubt, enemy",
    "text": "The worst enemy to creativity is self-doubt."
  },
  {
    "author": "Søren Kierkegaard",
    "source": "https://www.goodreads.com/quotes/6812",
    "tags": "fictional, movie, do, try, star wars",
    "text": "Life can only be understood backwards; but it must be lived forwards."
  },
  {
    "author": "Terry Tempest Williams",
    "source": "https://www.goodreads.com/quotes/784313",
    "tags": "creative, creativity",
    "text": "Creativity involves breaking out of expected patterns in order to look at things in a different way."
  },
  {
    "author": "Unknown",
    "source": "https://quoteinvestigator.com/2017/03/23/same/",
    "tags": "action, change, creative, creativity, sanity",
    "text": "The definition of insanity is doing the same thing over and over again and expecting a different result."
  },
  {
    "author": "Ursula Leguin",
    "source": "https://www.goodreads.com/quotes/1260096",
    "tags": "creative, creativity, child",
    "text": "The creative adult is the child who survived."
  },
  {
    "author": "Wolfgang Amadeus Mozart",
    "text": "Neither a lofty degree of intelligence nor imagination nor both together go to the making of genius. Love, love, love, that is the soul of genius."
  }
]
