[
  {
    "_id": "614c978e898fa70010774a95",
    "firstname": "tit",
    "lastname": "ci",
    "balance": 1241.6775757575758,
    "charisma": 1.5,
    "phone": 6123465789,
    "email": "titouanjoseph@gmail.com",
    "team": [
      "admin",
      "hard",
      "humain"
    ],
    "friends": [],
    "availabilities": [
      {
        "_id": "1",
        "groupTitle": "Aller peindre le conteneur",
        "groupDescription": "aller le peindre",
        "timeframe": {
          "start": 1653004800000,
          "end": 1653012000000
        },
        "charisma": 15,
        "available?": [
          "614c978e898fa70010774a95",
          "614ef8d4898fa70010774ac2",
          "61541bda5151840013ee1b04",
          "6150b638029e0d0010af112b"
        ]
      },
      {
        "_id": "2",
        "groupTitle": "Aller peindre le conteneur",
        "groupDescription": "aller le peindre",
        "timeframe": {
          "start": 1653012000000,
          "end": 1653019200000
        },
        "charisma": 15,
        "available?": [
          "614c978e898fa70010774a95",
          "614ef8d4898fa70010774ac2",
          "61541bda5151840013ee1b04",
          "6150b638029e0d0010af112b",
          "6162f706f744e200128510d6",
          "61895df78cca870010108ea5",
          "618e40fc39daea0010aeb80c"
        ]
      },
      {
        "_id": "3",
        "groupTitle": "Aller peindre le conteneur",
        "groupDescription": "aller le peindre",
        "timeframe": {
          "start": 1653019200000,
          "end": 1653026400000
        },
        "charisma": 15,
        "available?": [
          "614c978e898fa70010774a95",
          "614ef8d4898fa70010774ac2",
          "61541bda5151840013ee1b04",
          "6162f706f744e200128510d6",
          "61895df78cca870010108ea5",
          "618e40fc39daea0010aeb80c",
          "61926658234e610012e9f44a"
        ]
      }
    ],
    "pp": "8c9baef749deb8f822464a85ed6e0735"
  },
  {
    "_id": "614c9f62898fa70010774aa4",
    "firstname": "Christophe",
    "lastname": "Monnier",
    "nickname": "πSTOOPHE",
    "balance": 103.28149350649332,
    "phone": 645887062,
    "email": "christophe.monnier@24heures.org",
    "team": [
      null,
      "hard",
      "admin",
      "log"
    ],
    "hasDriverLicense": true,
    "friends": [],
    "availabilities": []
  },
  {
    "_id": "614ef8d4898fa70010774ac2",
    "firstname": "Hamza",
    "lastname": "BADAOUI",
    "nickname": "Cookie",
    "balance": -839.0612337662337,
    "phone": 781093971,
    "email": "azmah.ba@gmail.com",
    "team": [
      "hard",
      "admin",
      "log"
    ],
    "friends": [
      {
        "username": "PY.Tardieu",
        "id": "6151b9f0029e0d0010af11cf"
      }
    ],
    "availabilities": [
      {
        "_id": "1",
        "groupTitle": "Aller peindre le conteneur",
        "groupDescription": "aller le peindre",
        "timeframe": {
          "start": 1653004800000,
          "end": 1653012000000
        },
        "charisma": 15,
        "available?": [
          "614c978e898fa70010774a95",
          "614ef8d4898fa70010774ac2",
          "61541bda5151840013ee1b04",
          "6150b638029e0d0010af112b"
        ]
      },
      {
        "_id": "2",
        "groupTitle": "Aller peindre le conteneur",
        "groupDescription": "aller le peindre",
        "timeframe": {
          "start": 1653012000000,
          "end": 1653019200000
        },
        "charisma": 15,
        "available?": [
          "614c978e898fa70010774a95",
          "614ef8d4898fa70010774ac2",
          "61541bda5151840013ee1b04",
          "6150b638029e0d0010af112b",
          "6162f706f744e200128510d6",
          "61895df78cca870010108ea5",
          "618e40fc39daea0010aeb80c"
        ]
      },
      {
        "_id": "3",
        "groupTitle": "Aller peindre le conteneur",
        "groupDescription": "aller le peindre",
        "timeframe": {
          "start": 1653019200000,
          "end": 1653026400000
        },
        "charisma": 15,
        "available?": [
          "614c978e898fa70010774a95",
          "614ef8d4898fa70010774ac2",
          "61541bda5151840013ee1b04",
          "6162f706f744e200128510d6",
          "61895df78cca870010108ea5",
          "618e40fc39daea0010aeb80c",
          "61926658234e610012e9f44a"
        ]
      }
    ],
    "pp": "f50849817796d19311d88e9e7fa6babd"
  },
  {
    "_id": "6150a893029e0d0010af111e",
    "firstname": "Pauline",
    "lastname": "Koch",
    "nickname": "Paulout",
    "balance": -865.8279653679654,
    "phone": 767337332,
    "email": "pauline.koch19@gmail.com",
    "team": [
      "hard",
      "humain"
    ],
    "friends": [],
    "availabilities": []
  },
  {
    "_id": "6150b638029e0d0010af112b",
    "firstname": "Aude",
    "lastname": "Baudoux",
    "nickname": "shtomel",
    "balance": 257.1394155844156,
    "charisma": 0,
    "phone": 644015009,
    "email": "aude.baudoux@gmail.com",
    "team": [
      "hard",
      "admin",
      "humain"
    ],
    "hasDriverLicense": true,
    "friends": [],
    "availabilities": [
      {
        "_id": "1",
        "groupTitle": "Aller peindre le conteneur",
        "groupDescription": "aller le peindre",
        "timeframe": {
          "start": 1653004800000,
          "end": 1653012000000
        },
        "charisma": 15,
        "available?": [
          "614c978e898fa70010774a95",
          "614ef8d4898fa70010774ac2",
          "61541bda5151840013ee1b04",
          "6150b638029e0d0010af112b"
        ]
      },
      {
        "_id": "2",
        "groupTitle": "Aller peindre le conteneur",
        "groupDescription": "aller le peindre",
        "timeframe": {
          "start": 1653012000000,
          "end": 1653019200000
        },
        "charisma": 15,
        "available?": [
          "614c978e898fa70010774a95",
          "614ef8d4898fa70010774ac2",
          "61541bda5151840013ee1b04",
          "6150b638029e0d0010af112b",
          "6162f706f744e200128510d6",
          "61895df78cca870010108ea5",
          "618e40fc39daea0010aeb80c"
        ]
      }
    ],
    "pp": "0461d537e1861769585a2f2fa4508c77"
  },
  {
    "_id": "6150c171029e0d0010af113c",
    "firstname": "Matthieu",
    "lastname": "BARA",
    "nickname": "La Taupe",
    "balance": 33.1607142857143,
    "phone": 647599437,
    "email": "matthieubara@gmail.com",
    "team": [
      "hard"
    ],
    "hasDriverLicense": true,
    "friends": [],
    "availabilities": []
  },
  {
    "_id": "6150dbc7029e0d0010af1169",
    "firstname": "El Mehdi",
    "lastname": "OUZEHIMI",
    "nickname": "Mehdipole",
    "balance": 73.03000000000004,
    "phone": 769494094,
    "email": "mehdi.ouzehimi@gmail.com",
    "team": [
      "hard"
    ],
    "hasDriverLicense": true,
    "friends": [],
    "availabilities": []
  },
  {
    "_id": "6150e31c029e0d0010af117a",
    "firstname": "Pedro",
    "lastname": "Guedes",
    "balance": 163.84000000000003,
    "phone": 626419958,
    "email": "pedroguedesbm@gmail.com",
    "team": [
      "hard"
    ],
    "friends": [],
    "availabilities": []
  },
  {
    "_id": "6151b9f0029e0d0010af11cf",
    "firstname": "PY",
    "lastname": "Tardieu",
    "nickname": "pine d'huitre",
    "balance": 193.36,
    "phone": 726352635,
    "email": "tg@gmail.com",
    "team": [
      "hard",
      "admin",
      "log"
    ],
    "hasDriverLicense": true,
    "friends": [
      {
        "username": "Hamza.BADAOUI",
        "id": "614ef8d4898fa70010774ac2"
      }
    ],
    "pp": "fac959797163a7c3edca7267daac47a0"
  },
  {
    "_id": "6151f7c35151840013ee19c1",
    "firstname": "paul",
    "lastname": "belin",
    "nickname": "Nuts",
    "balance": 156.56,
    "charisma": null,
    "phone": 750824924,
    "email": "paul.belin00@gmail.com",
    "team": [
      "admin",
      "hard"
    ],
    "hasDriverLicense": true,
    "friends": [],
    "availabilities": []
  },
  {
    "_id": "615335655151840013ee1ae8",
    "firstname": "user",
    "lastname": "random",
    "nickname": "oui",
    "balance": 193.36,
    "phone": 672782945,
    "email": "azmah.bdsa@gmail.com",
    "team": [],
    "friends": [],
    "availabilities": []
  },
  {
    "_id": "61541bda5151840013ee1b04",
    "firstname": "Hugo",
    "lastname": "Courté",
    "nickname": "Vauban",
    "balance": 169.36,
    "charisma": 15,
    "phone": 638817407,
    "email": "hugocourte@gmail.com",
    "team": [
      "hard",
      "admin",
      null,
      "humain"
    ],
    "hasDriverLicense": true,
    "friends": [],
    "availabilities": [
      {
        "_id": "1",
        "groupTitle": "Aller peindre le conteneur",
        "groupDescription": "aller le peindre",
        "timeframe": {
          "start": 1653004800000,
          "end": 1653012000000
        },
        "charisma": 15,
        "available?": [
          "614c978e898fa70010774a95",
          "614ef8d4898fa70010774ac2",
          "61541bda5151840013ee1b04",
          "6150b638029e0d0010af112b"
        ]
      },
      {
        "_id": "2",
        "groupTitle": "Aller peindre le conteneur",
        "groupDescription": "aller le peindre",
        "timeframe": {
          "start": 1653012000000,
          "end": 1653019200000
        },
        "charisma": 15,
        "available?": [
          "614c978e898fa70010774a95",
          "614ef8d4898fa70010774ac2",
          "61541bda5151840013ee1b04",
          "6150b638029e0d0010af112b",
          "6162f706f744e200128510d6",
          "61895df78cca870010108ea5",
          "618e40fc39daea0010aeb80c"
        ]
      },
      {
        "_id": "3",
        "groupTitle": "Aller peindre le conteneur",
        "groupDescription": "aller le peindre",
        "timeframe": {
          "start": 1653019200000,
          "end": 1653026400000
        },
        "charisma": 15,
        "available?": [
          "614c978e898fa70010774a95",
          "614ef8d4898fa70010774ac2",
          "61541bda5151840013ee1b04",
          "6162f706f744e200128510d6",
          "61895df78cca870010108ea5",
          "618e40fc39daea0010aeb80c",
          "61926658234e610012e9f44a"
        ]
      }
    ]
  },
  {
    "_id": "615b562d3cf3eb001230a1fc",
    "firstname": "tom",
    "lastname": "sampic",
    "balance": 94.61,
    "phone": 600000000,
    "email": "t@gmail.com",
    "team": [
      "hard",
      "admin"
    ],
    "friends": [],
    "availabilities": []
  },
  {
    "_id": "6162f451f744e20012851058",
    "firstname": "Tib",
    "lastname": "Moi",
    "nickname": "Moule",
    "phone": 666666666,
    "email": "mabite.cedugato@gmail.com",
    "team": [
      "hard",
      "admin"
    ],
    "friends": [],
    "availabilities": []
  },
  {
    "_id": "6162f706f744e200128510d6",
    "firstname": "antonin",
    "lastname": "besson",
    "balance": 11.650000000000002,
    "phone": 667669667,
    "email": "antonin.besson2.0@gmail.com",
    "team": [
      "hard"
    ],
    "friends": [],
    "availabilities": [
      {
        "_id": "2",
        "groupTitle": "Aller peindre le conteneur",
        "groupDescription": "aller le peindre",
        "timeframe": {
          "start": 1653012000000,
          "end": 1653019200000
        },
        "charisma": 15,
        "available?": [
          "614c978e898fa70010774a95",
          "614ef8d4898fa70010774ac2",
          "61541bda5151840013ee1b04",
          "6150b638029e0d0010af112b",
          "6162f706f744e200128510d6",
          "61895df78cca870010108ea5",
          "618e40fc39daea0010aeb80c"
        ]
      },
      {
        "_id": "3",
        "groupTitle": "Aller peindre le conteneur",
        "groupDescription": "aller le peindre",
        "timeframe": {
          "start": 1653019200000,
          "end": 1653026400000
        },
        "charisma": 15,
        "available?": [
          "614c978e898fa70010774a95",
          "614ef8d4898fa70010774ac2",
          "61541bda5151840013ee1b04",
          "6162f706f744e200128510d6",
          "61895df78cca870010108ea5",
          "618e40fc39daea0010aeb80c",
          "61926658234e610012e9f44a"
        ]
      }
    ],
    "pp": "33aa78688eea0c9f3ee3cd7966a12f20"
  },
  {
    "_id": "61658eb26ff71d0011a0da09",
    "firstname": "ma",
    "lastname": "elle",
    "nickname": "silvano",
    "balance": -40.39,
    "phone": 674477653,
    "email": "maelle.silvano99@gmail.com",
    "team": [
      "hard",
      "admin"
    ],
    "friends": [],
    "availabilities": []
  },
  {
    "_id": "6165cf9c6ff71d0011a0db68",
    "firstname": "Damien",
    "lastname": "Carreau",
    "nickname": "Hublot",
    "balance": -11.000000000000002,
    "phone": 609729006,
    "email": "carreau.damien@gmail.com",
    "team": [
      "hard",
      "humain",
      "admin"
    ],
    "hasDriverLicense": true,
    "friends": [],
    "availabilities": []
  },
  {
    "_id": "61895df78cca870010108ea5",
    "firstname": "Adèle",
    "lastname": "Prouvost",
    "nickname": "Franck",
    "phone": 651569928,
    "email": "adele.prouvost@gmail.com",
    "team": [
      "bureau",
      "hard"
    ],
    "friends": [],
    "availabilities": [
      {
        "_id": "2",
        "groupTitle": "Aller peindre le conteneur",
        "groupDescription": "aller le peindre",
        "timeframe": {
          "start": 1653012000000,
          "end": 1653019200000
        },
        "charisma": 15,
        "available?": [
          "614c978e898fa70010774a95",
          "614ef8d4898fa70010774ac2",
          "61541bda5151840013ee1b04",
          "6150b638029e0d0010af112b",
          "6162f706f744e200128510d6",
          "61895df78cca870010108ea5",
          "618e40fc39daea0010aeb80c"
        ]
      },
      {
        "_id": "3",
        "groupTitle": "Aller peindre le conteneur",
        "groupDescription": "aller le peindre",
        "timeframe": {
          "start": 1653019200000,
          "end": 1653026400000
        },
        "charisma": 15,
        "available?": [
          "614c978e898fa70010774a95",
          "614ef8d4898fa70010774ac2",
          "61541bda5151840013ee1b04",
          "6162f706f744e200128510d6",
          "61895df78cca870010108ea5",
          "618e40fc39daea0010aeb80c",
          "61926658234e610012e9f44a"
        ]
      }
    ]
  },
  {
    "_id": "61895ed98cca870010108ecd",
    "firstname": "test",
    "lastname": "test",
    "phone": 612345678,
    "email": "test@gmail.com",
    "team": [
      null,
      "hard",
      "admin",
      "humain"
    ],
    "friends": [],
    "availabilities": []
  },
  {
    "_id": "618b00eb03b97e0010ef1980",
    "firstname": "test2",
    "lastname": "test2",
    "phone": 602457898,
    "email": "test2@gmail.com",
    "team": [
      "admin",
      "humain",
      "",
      "h",
      "hard",
      ""
    ],
    "friends": [],
    "availabilities": []
  },
  {
    "_id": "618e40fc39daea0010aeb80c",
    "firstname": "Lucie",
    "lastname": "Adisson",
    "nickname": "lusoft",
    "phone": 782921180,
    "email": "adisson.lucie@gmail.com",
    "team": [
      "hard"
    ],
    "hasDriverLicense": true,
    "friends": [],
    "availabilities": [
      {
        "_id": "2",
        "groupTitle": "Aller peindre le conteneur",
        "groupDescription": "aller le peindre",
        "timeframe": {
          "start": 1653012000000,
          "end": 1653019200000
        },
        "charisma": 15,
        "available?": [
          "614c978e898fa70010774a95",
          "614ef8d4898fa70010774ac2",
          "61541bda5151840013ee1b04",
          "6150b638029e0d0010af112b",
          "6162f706f744e200128510d6",
          "61895df78cca870010108ea5",
          "618e40fc39daea0010aeb80c"
        ]
      },
      {
        "_id": "3",
        "groupTitle": "Aller peindre le conteneur",
        "groupDescription": "aller le peindre",
        "timeframe": {
          "start": 1653019200000,
          "end": 1653026400000
        },
        "charisma": 15,
        "available?": [
          "614c978e898fa70010774a95",
          "614ef8d4898fa70010774ac2",
          "61541bda5151840013ee1b04",
          "6162f706f744e200128510d6",
          "61895df78cca870010108ea5",
          "618e40fc39daea0010aeb80c",
          "61926658234e610012e9f44a"
        ]
      }
    ]
  },
  {
    "_id": "61926658234e610012e9f44a",
    "firstname": "Pauline ",
    "lastname": "R",
    "phone": 611325762,
    "email": "rossignol.pauline2001@gmail.com",
    "team": [],
    "hasDriverLicense": false,
    "friends": [],
    "availabilities": [
      {
        "_id": "3",
        "groupTitle": "Aller peindre le conteneur",
        "groupDescription": "aller le peindre",
        "timeframe": {
          "start": 1653019200000,
          "end": 1653026400000
        },
        "charisma": 15,
        "available?": [
          "614c978e898fa70010774a95",
          "614ef8d4898fa70010774ac2",
          "61541bda5151840013ee1b04",
          "6162f706f744e200128510d6",
          "61895df78cca870010108ea5",
          "618e40fc39daea0010aeb80c",
          "61926658234e610012e9f44a"
        ]
      }
    ]
  }
]