[
  {
    "_id": "614c9f62898fa70010774aa4",
    "firstname": "Christophe",
    "lastname": "Monnier",
    "nickname": "πSTOOPHE",
    "email": "christophe.monnier@24heures.org",
    "balance": 103.28149350649332,
    "phone": 645887062,
    "team": [
      null,
      "hard",
      "admin",
      "log",
      "elec"
    ],
    "friends": [],
    "availabilities": [],
    "hasDriverLicense": true,
    "hasPayedContribution": false
  },
  {
    "_id": "614ef8d4898fa70010774ac2",
    "firstname": "Hamza",
    "lastname": "BADAOUI",
    "nickname": "Cookie",
    "email": "azmah.ba@gmail.com",
    "balance": -839.0612337662337,
    "phone": 781093971,
    "team": [
      "hard",
      "admin",
      "log"
    ],
    "friends": [
      {
        "username": "PY.Tardieu",
        "id": "6151b9f0029e0d0010af11cf"
      }
    ],
    "pp": "f50849817796d19311d88e9e7fa6babd",
    "availabilities": [],
    "hasDriverLicense": false,
    "hasPayedContribution": false
  },
  {
    "_id": "6150a893029e0d0010af111e",
    "firstname": "Pauline",
    "lastname": "Koch",
    "nickname": "Paulout",
    "email": "pauline.koch19@gmail.com",
    "balance": -865.8279653679654,
    "phone": 767337332,
    "team": [
      "hard",
      "orga",
      "humain"
    ],
    "friends": [],
    "availabilities": [
      "619d324707febc0010a049d4",
      "619d324707febc0010a049d5",
      "619d324707febc0010a049d6",
      "619d324707febc0010a049d7",
      "619d324707febc0010a049d8",
      "619d324707febc0010a049d9",
      "619d324707febc0010a049da",
      "619d324707febc0010a049db",
      "619d324707febc0010a049dc",
      "619d324707febc0010a049dd",
      "619d324707febc0010a049de",
      "619d324707febc0010a049df",
      "619d324707febc0010a049e0",
      "619d324707febc0010a049e1",
      "619d324707febc0010a049e2",
      "619d324707febc0010a049e3",
      "619d324707febc0010a049e4",
      "619d324707febc0010a049e5",
      "619d324707febc0010a049e6",
      "619d324707febc0010a049e7",
      "619d324707febc0010a049e8",
      "619d324707febc0010a049e9",
      "619d324707febc0010a049ea",
      "619d324707febc0010a049eb",
      "619d324707febc0010a049ec",
      "619d324707febc0010a049ed",
      "619d324707febc0010a049ee",
      "619d324707febc0010a049ef",
      "619d324707febc0010a049f0",
      "619d324707febc0010a049f1",
      "619d324707febc0010a049f2",
      "619d324707febc0010a049f3",
      "619d324707febc0010a049f4",
      "619d324707febc0010a049f5",
      "619d324707febc0010a049f6",
      "619d324707febc0010a049f7",
      "619d324707febc0010a049f8",
      "619d324707febc0010a049f9",
      "619d324707febc0010a049fa",
      "619d324707febc0010a049fb",
      "619d324707febc0010a049fc",
      "619d324707febc0010a049fd"
    ],
    "hasDriverLicense": false,
    "hasPayedContribution": false
  },
  {
    "_id": "6150b638029e0d0010af112b",
    "firstname": "Aude",
    "lastname": "Baudoux",
    "nickname": "shtomel",
    "email": "aude.baudoux@gmail.com",
    "balance": 257.1394155844156,
    "charisma": 0,
    "phone": 644015009,
    "team": [
      "hard",
      "bar"
    ],
    "friends": [],
    "pp": "0461d537e1861769585a2f2fa4508c77",
    "availabilities": [
      "61d1a7385ed47400108e40b7",
      "61d1a7385ed47400108e40b8",
      "61d1a7385ed47400108e40b9",
      "61d1a7385ed47400108e40ba",
      "61d1a7385ed47400108e40bb",
      "61d1a7385ed47400108e40bc",
      "61d1a7385ed47400108e40bd",
      "61d1a7385ed47400108e40be",
      "61d1a7385ed47400108e40bf",
      "61d1a7385ed47400108e40c0",
      "61d1a7385ed47400108e40c1",
      "61d1a7385ed47400108e40c2",
      "61d1a7385ed47400108e40c3",
      "61d1a7385ed47400108e40c4",
      "61d1a7385ed47400108e40c5",
      "61d1a7385ed47400108e40c6",
      "61d1a7385ed47400108e40c7",
      "61d1a7385ed47400108e40c8",
      "61d1a7385ed47400108e40c9",
      "61d1a7385ed47400108e40ca",
      "61d1a7385ed47400108e40cb",
      "61d1a7385ed47400108e40cc",
      "61d1a7385ed47400108e40cd",
      "61d1a7385ed47400108e40ce",
      "61d1a7385ed47400108e40cf",
      "61d1a7385ed47400108e40d0",
      "61d1a7385ed47400108e40d1",
      "61d1a7385ed47400108e40d2",
      "61d1a7385ed47400108e40d3",
      "61d1a7385ed47400108e40d4",
      "61d1a7385ed47400108e40d5",
      "61d1a7385ed47400108e40d6",
      "61d1a7385ed47400108e40d7",
      "61d1a7385ed47400108e40d8",
      "61d1a7385ed47400108e40d9",
      "61d1a7385ed47400108e40da",
      "61d1a7385ed47400108e40db",
      "61d1a7385ed47400108e40dc",
      "61d1a7385ed47400108e40dd",
      "61d1a7385ed47400108e40de",
      "61d1a7385ed47400108e40df",
      "61d1a7385ed47400108e40e0",
      "61d1a7385ed47400108e40e1",
      "61d1a7385ed47400108e40e2",
      "61d1a7385ed47400108e40e3",
      "61d1a7385ed47400108e40e4",
      "61d1a7385ed47400108e40e5",
      "61d1a7385ed47400108e40e6",
      "61d1a7385ed47400108e40e7",
      "61d1a7385ed47400108e40e8",
      "61d1a7385ed47400108e40e9",
      "61d1a7385ed47400108e40ea",
      "61d1a7385ed47400108e40eb",
      "61d1a7385ed47400108e40ec",
      "61d1a7385ed47400108e40ed",
      "61d1a7385ed47400108e40ee",
      "61d1a7385ed47400108e40ef",
      "61d1a7385ed47400108e40f0",
      "61d1a7385ed47400108e40f1",
      "61d1a7385ed47400108e40f2",
      "61d1a7385ed47400108e40f3",
      "61d1a7385ed47400108e40f4",
      "61d1a7385ed47400108e40f5",
      "61d1a7385ed47400108e40f6",
      "61d1a7385ed47400108e40f7",
      "61d1a7385ed47400108e40f8",
      "61d1a7385ed47400108e40f9",
      "61d1a7385ed47400108e40fa",
      "61d1a7385ed47400108e40fb",
      "61d1a7385ed47400108e40fc",
      "61d1a7385ed47400108e40fd",
      "61d1a7385ed47400108e40fe",
      "61d1a7385ed47400108e40ff",
      "61d1a7385ed47400108e4100",
      "61d1a7385ed47400108e4101",
      "61d1a7385ed47400108e4102",
      "61d1a7385ed47400108e4103",
      "61d1a7385ed47400108e4104",
      "61d1a7385ed47400108e4105",
      "61d1a7385ed47400108e4106",
      "61d1a7385ed47400108e4107",
      "61d1a7385ed47400108e4108",
      "61d1a7385ed47400108e4109",
      "61d1a7385ed47400108e410a",
      "61d1a7385ed47400108e410b",
      "61d1a7385ed47400108e410c",
      "61d1a7385ed47400108e410d",
      "61d1a7385ed47400108e410e",
      "61d1a7395ed47400108e410f",
      "61d1a7395ed47400108e4110",
      "61d1a7395ed47400108e4111",
      "61d1a7395ed47400108e4112",
      "61d1a7395ed47400108e4113",
      "61d1a7395ed47400108e4114",
      "61d1a7395ed47400108e4115",
      "61d1a7395ed47400108e4116",
      "61d1a7395ed47400108e4117",
      "61d1a7395ed47400108e4118",
      "61d1a7395ed47400108e4119",
      "61d1a7395ed47400108e411a",
      "61d1a7395ed47400108e411b",
      "61d1a7395ed47400108e411c",
      "61d1a7395ed47400108e411d",
      "61d1a7395ed47400108e411e",
      "61d1a7395ed47400108e411f",
      "61d1a7395ed47400108e4120",
      "61d1a7395ed47400108e4121",
      "61d1a7395ed47400108e4122",
      "61d1a7395ed47400108e4123",
      "61d1a7395ed47400108e4124",
      "61d1a7395ed47400108e4125",
      "61d1a7395ed47400108e4126",
      "61d1a7395ed47400108e4127"
    ],
    "hasDriverLicense": true,
    "hasPayedContribution": false
  },
  {
    "_id": "6150c171029e0d0010af113c",
    "firstname": "Matthieu",
    "lastname": "BARA",
    "nickname": "La Taupe",
    "email": "matthieubara@gmail.com",
    "balance": 33.1607142857143,
    "phone": 647599437,
    "team": [
      "hard"
    ],
    "friends": [],
    "availabilities": [],
    "hasDriverLicense": true,
    "hasPayedContribution": false
  },
  {
    "_id": "6150dbc7029e0d0010af1169",
    "firstname": "El Mehdi",
    "lastname": "OUZEHIMI",
    "nickname": "Mehdipole",
    "email": "mehdi.ouzehimi@gmail.com",
    "balance": 73.03000000000004,
    "phone": 769494094,
    "team": [
      "hard",
      "orga",
      "barrieres"
    ],
    "friends": [],
    "availabilities": [],
    "hasDriverLicense": true,
    "hasPayedContribution": false
  },
  {
    "_id": "6150e31c029e0d0010af117a",
    "firstname": "Pedro",
    "lastname": "Guedes",
    "email": "pedroguedesbm@gmail.com",
    "balance": 163.84000000000003,
    "phone": 626419958,
    "team": [
      "hard"
    ],
    "friends": [],
    "availabilities": [],
    "hasDriverLicense": false,
    "hasPayedContribution": false
  },
  {
    "_id": "6151b9f0029e0d0010af11cf",
    "firstname": "PY",
    "lastname": "Tardieu",
    "nickname": "pine d'huitre",
    "email": "tg@gmail.com",
    "balance": 193.36,
    "phone": 726352635,
    "team": [
      "hard"
    ],
    "friends": [
      {
        "username": "Hamza.BADAOUI",
        "id": "614ef8d4898fa70010774ac2"
      }
    ],
    "pp": "fac959797163a7c3edca7267daac47a0",
    "availabilities": [],
    "hasDriverLicense": true,
    "hasPayedContribution": false
  },
  {
    "_id": "6151f7c35151840013ee19c1",
    "firstname": "paul",
    "lastname": "belin",
    "nickname": "Nuts",
    "email": "paul.belin00@gmail.com",
    "balance": 156.56,
    "charisma": null,
    "phone": 750824924,
    "team": [
      "hard"
    ],
    "friends": [],
    "availabilities": [],
    "hasDriverLicense": true,
    "hasPayedContribution": false
  },
  {
    "_id": "615335655151840013ee1ae8",
    "firstname": "user",
    "lastname": "random",
    "nickname": "oui",
    "email": "azmah.bdsa@gmail.com",
    "balance": 193.36,
    "phone": 672782945,
    "team": [],
    "friends": [],
    "availabilities": [],
    "hasDriverLicense": false,
    "hasPayedContribution": false
  },
  {
    "_id": "61541bda5151840013ee1b04",
    "firstname": "Hugo",
    "lastname": "Courté",
    "nickname": "Vauban",
    "email": "hugocourte@gmail.com",
    "balance": 169.36,
    "charisma": 15,
    "phone": 638817407,
    "team": [
      "hard",
      "admin",
      null,
      "humain"
    ],
    "friends": [],
    "availabilities": [
      "61604fef3807e800114b4a45",
      "619cfac307febc0010a0441b",
      "619cfac307febc0010a0441c",
      "619cfac307febc0010a0441d"
    ],
    "hasDriverLicense": true,
    "hasPayedContribution": false
  },
  {
    "_id": "615b562d3cf3eb001230a1fc",
    "firstname": "tom",
    "lastname": "sampic",
    "email": "t@gmail.com",
    "balance": 94.61,
    "phone": 600000000,
    "team": [
      "hard",
      "admin"
    ],
    "friends": [],
    "availabilities": [],
    "hasDriverLicense": false,
    "hasPayedContribution": false
  },
  {
    "_id": "6162f451f744e20012851058",
    "firstname": "Tib",
    "lastname": "Moi",
    "nickname": "Moule",
    "email": "mabite.cedugato@gmail.com",
    "phone": 666666666,
    "team": [
      "hard",
      "admin"
    ],
    "friends": [],
    "availabilities": [],
    "hasDriverLicense": false,
    "hasPayedContribution": false
  },
  {
    "_id": "6162f706f744e200128510d6",
    "firstname": "antonin",
    "lastname": "besson",
    "email": "antonin.besson2.0@gmail.com",
    "balance": 11.650000000000002,
    "phone": 667669667,
    "team": [
      "hard"
    ],
    "friends": [],
    "pp": "33aa78688eea0c9f3ee3cd7966a12f20",
    "availabilities": [],
    "hasDriverLicense": false,
    "hasPayedContribution": false
  },
  {
    "_id": "61658eb26ff71d0011a0da09",
    "firstname": "ma",
    "lastname": "elle",
    "nickname": "silvano",
    "email": "maelle.silvano99@gmail.com",
    "balance": -40.39,
    "phone": 674477653,
    "team": [
      "hard",
      "admin"
    ],
    "friends": [],
    "availabilities": [],
    "hasDriverLicense": false,
    "hasPayedContribution": true
  },
  {
    "_id": "6165cf9c6ff71d0011a0db68",
    "firstname": "Damien",
    "lastname": "Carreau",
    "nickname": "Hublot",
    "email": "carreau.damien@gmail.com",
    "balance": -11.000000000000002,
    "phone": 609729006,
    "team": [
      "hard",
      "orga",
      "admin",
      "humain"
    ],
    "friends": [],
    "availabilities": [
      "619d31d407febc0010a04978",
      "619d31d407febc0010a04979",
      "619d31d407febc0010a0497a",
      "619d31d407febc0010a0497b",
      "61c8a367fcdf880010ea11b1",
      "61c8a367fcdf880010ea11b2",
      "61c8a367fcdf880010ea11b3",
      "61c8a367fcdf880010ea11b4",
      "61c8a367fcdf880010ea11b5",
      "61c8a367fcdf880010ea11b6",
      "61c8a367fcdf880010ea11b7",
      "61c8a367fcdf880010ea11b8",
      "61c8a367fcdf880010ea11b9",
      "61c8a367fcdf880010ea11ba",
      "61c8a367fcdf880010ea11bb",
      "61c8a367fcdf880010ea11bc",
      "61c8a367fcdf880010ea11bd",
      "61c8a367fcdf880010ea11be",
      "61c8a367fcdf880010ea11bf",
      "61c8a367fcdf880010ea11c0",
      "61c8a367fcdf880010ea11c1",
      "61c8a367fcdf880010ea11c2",
      "61c8a367fcdf880010ea11c3",
      "61c8a367fcdf880010ea11c4",
      "61c8a367fcdf880010ea11c5",
      "61c8a367fcdf880010ea11c6",
      "61c8a367fcdf880010ea11c7",
      "61c8a367fcdf880010ea11c8",
      "61c8a367fcdf880010ea11c9",
      "61c8a367fcdf880010ea11ca",
      "61c8a367fcdf880010ea11cb",
      "61c8a367fcdf880010ea11cc",
      "61c8a367fcdf880010ea11cd",
      "61c8a367fcdf880010ea11ce",
      "61c8a367fcdf880010ea11cf",
      "61c8a367fcdf880010ea11d0",
      "61c8a367fcdf880010ea11d1",
      "61c8a367fcdf880010ea11d2",
      "61c8a367fcdf880010ea11d3",
      "61c8a367fcdf880010ea11d4",
      "61c8a367fcdf880010ea11d5",
      "61c8a367fcdf880010ea11d6",
      "61c8a367fcdf880010ea11d7",
      "61c8a367fcdf880010ea11d8",
      "61c8a367fcdf880010ea11d9",
      "61c8a367fcdf880010ea11da",
      "61c8a367fcdf880010ea11db",
      "61c8a367fcdf880010ea11dc",
      "61c8a367fcdf880010ea11dd",
      "61c8a367fcdf880010ea11de",
      "61c8a367fcdf880010ea11df",
      "61c8a367fcdf880010ea11e0",
      "61c8a367fcdf880010ea11e1",
      "61c8a367fcdf880010ea11e2",
      "61c8a367fcdf880010ea11e3",
      "61c8a367fcdf880010ea11e4",
      "61c8a367fcdf880010ea11e5",
      "61c8a367fcdf880010ea11e6",
      "61c8a367fcdf880010ea11e7",
      "61c8a367fcdf880010ea11e8",
      "61c8a367fcdf880010ea11e9",
      "61c8a367fcdf880010ea11ea",
      "61c8a367fcdf880010ea11eb",
      "61c8a367fcdf880010ea11ec",
      "61c8a367fcdf880010ea11ed",
      "61c8a367fcdf880010ea11ee",
      "61c8a367fcdf880010ea11ef",
      "61c8a367fcdf880010ea11f0",
      "61c8a367fcdf880010ea11f1",
      "61c8a367fcdf880010ea11f2",
      "61c8a367fcdf880010ea11f3",
      "61c8a367fcdf880010ea11f4",
      "61c8a367fcdf880010ea11f5",
      "61c8a367fcdf880010ea11f6",
      "61c8a367fcdf880010ea11f7",
      "61c8a367fcdf880010ea11f8",
      "61c8a367fcdf880010ea11f9",
      "61c8a367fcdf880010ea11fa",
      "61c8a367fcdf880010ea11fb",
      "61c8a367fcdf880010ea11fc",
      "61c8a367fcdf880010ea11fd",
      "61c8a367fcdf880010ea11fe",
      "61c8a367fcdf880010ea11ff",
      "61c8a367fcdf880010ea1200",
      "61c8a367fcdf880010ea1201",
      "61c8a367fcdf880010ea1202",
      "61c8a367fcdf880010ea1203",
      "61c8a367fcdf880010ea1204",
      "61c8a367fcdf880010ea1205",
      "61c8a367fcdf880010ea1206",
      "61c8a367fcdf880010ea1207",
      "61c8a367fcdf880010ea1208",
      "61c8a367fcdf880010ea1209",
      "61c8a367fcdf880010ea120a",
      "61c8a367fcdf880010ea120b",
      "61c8a367fcdf880010ea120c",
      "61c8a367fcdf880010ea120d",
      "61c8a367fcdf880010ea120e",
      "61c8a367fcdf880010ea120f",
      "61c8a367fcdf880010ea1210",
      "61c8a367fcdf880010ea1211",
      "61c8a367fcdf880010ea1212",
      "61c8a367fcdf880010ea1213",
      "61c8a367fcdf880010ea1214",
      "61c8a367fcdf880010ea1215",
      "61c8a367fcdf880010ea1216",
      "61c8a367fcdf880010ea1217",
      "61c8a367fcdf880010ea1218",
      "61c8a367fcdf880010ea1219",
      "61c8a367fcdf880010ea121a",
      "61c8a367fcdf880010ea121b",
      "61c8a367fcdf880010ea121c",
      "61c8a367fcdf880010ea121d",
      "61c8a367fcdf880010ea121e",
      "61c8a367fcdf880010ea121f",
      "61c8a367fcdf880010ea1220",
      "61c8a367fcdf880010ea1221",
      "61c8a367fcdf880010ea1222",
      "61c8a367fcdf880010ea1223",
      "61c8a367fcdf880010ea1224",
      "61c8a367fcdf880010ea1225",
      "61c8a367fcdf880010ea1226",
      "61c8a367fcdf880010ea1227",
      "61c8a367fcdf880010ea1228",
      "61c8a367fcdf880010ea1229",
      "61c8a367fcdf880010ea122a",
      "61c8a367fcdf880010ea122b",
      "61c8a367fcdf880010ea122c",
      "61c8a367fcdf880010ea122d",
      "61c8a367fcdf880010ea122e",
      "61c8a367fcdf880010ea122f",
      "61c8a367fcdf880010ea1230",
      "61c8a367fcdf880010ea1231",
      "61c8a367fcdf880010ea1232",
      "61c8a367fcdf880010ea1233",
      "61c8a367fcdf880010ea1234",
      "61c8a367fcdf880010ea1235",
      "61c8a367fcdf880010ea1236",
      "61c8a367fcdf880010ea1237",
      "61c8a367fcdf880010ea1238",
      "61c8a367fcdf880010ea1239",
      "61c8a367fcdf880010ea123a",
      "61c8a367fcdf880010ea123b",
      "61c8a367fcdf880010ea123c",
      "61c8a367fcdf880010ea123d",
      "61c8a367fcdf880010ea123e",
      "61c8a367fcdf880010ea123f",
      "61c8a367fcdf880010ea1240",
      "61c8a367fcdf880010ea1241",
      "61c8a367fcdf880010ea1242",
      "61c8a367fcdf880010ea1243",
      "61c8a367fcdf880010ea1244",
      "61c8a367fcdf880010ea1245",
      "61c8a367fcdf880010ea1246",
      "61c8a367fcdf880010ea1247",
      "61c8a367fcdf880010ea1248",
      "61c8a367fcdf880010ea1249",
      "61c8a367fcdf880010ea124a",
      "61c8a367fcdf880010ea124b",
      "61c8a367fcdf880010ea124c",
      "61c8a367fcdf880010ea124d",
      "61c8a367fcdf880010ea124e",
      "61c8a367fcdf880010ea124f",
      "61c8a367fcdf880010ea1250",
      "61c8a367fcdf880010ea1251",
      "61c8a367fcdf880010ea1252",
      "61c8a367fcdf880010ea1253",
      "61c8a367fcdf880010ea1254",
      "61c8a367fcdf880010ea1255",
      "61c8a367fcdf880010ea1256",
      "61c8a367fcdf880010ea1257",
      "61c8a367fcdf880010ea1258",
      "61c8a367fcdf880010ea1259",
      "61c8a367fcdf880010ea125a",
      "61c8a367fcdf880010ea125b",
      "61c8a367fcdf880010ea125c",
      "61c8a367fcdf880010ea125d",
      "61c8a367fcdf880010ea125e",
      "61c8a367fcdf880010ea125f",
      "61c8a367fcdf880010ea1260",
      "61c8a367fcdf880010ea1261",
      "61c8a367fcdf880010ea1262",
      "61c8a367fcdf880010ea1263",
      "61c8a367fcdf880010ea1264",
      "61c8a367fcdf880010ea1265",
      "61c8a367fcdf880010ea1266",
      "61c8a367fcdf880010ea1267",
      "61c8a367fcdf880010ea1268",
      "61c8a367fcdf880010ea1269",
      "61c8a367fcdf880010ea126a",
      "61c8a367fcdf880010ea126b"
    ],
    "hasDriverLicense": true,
    "hasPayedContribution": false
  },
  {
    "_id": "61895df78cca870010108ea5",
    "firstname": "Adèle",
    "lastname": "Prouvost",
    "nickname": "Franck",
    "email": "adele.prouvost@gmail.com",
    "phone": 651569928,
    "team": [
      "hard",
      "bureau",
      "orga"
    ],
    "friends": [],
    "availabilities": [
      "61d1a7385ed47400108e40b7",
      "61d1a7385ed47400108e40b8",
      "61d1a7385ed47400108e40b9",
      "61d1a7385ed47400108e40ba",
      "61d1a7385ed47400108e40bb",
      "61d1a7385ed47400108e40bc",
      "61d1a7385ed47400108e40bd",
      "61d1a7385ed47400108e40be",
      "61d1a7385ed47400108e40bf",
      "61d1a7385ed47400108e40c0",
      "61d1a7385ed47400108e40c1",
      "61d1a7385ed47400108e40c2",
      "61d1a7385ed47400108e40c3",
      "61d1a7385ed47400108e40c4",
      "61d1a7385ed47400108e40c5",
      "61d1a7385ed47400108e40c6",
      "61d1a7385ed47400108e40c7",
      "61d1a7385ed47400108e40c8",
      "61d1a7385ed47400108e40c9",
      "61d1a7385ed47400108e40ca",
      "61d1a7385ed47400108e40cb",
      "61d1a7385ed47400108e40cc",
      "61d1a7385ed47400108e40cd",
      "61d1a7385ed47400108e40ce",
      "61d1a7385ed47400108e40cf",
      "61d1a7385ed47400108e40d0",
      "61d1a7385ed47400108e40d1",
      "61d1a7385ed47400108e40d2",
      "61d1a7385ed47400108e40d3",
      "61d1a7385ed47400108e40d4",
      "61d1a7385ed47400108e40d5",
      "61d1a7385ed47400108e40d6",
      "61d1a7385ed47400108e40d7",
      "61d1a7385ed47400108e40d8",
      "61d1a7385ed47400108e40d9",
      "61d1a7385ed47400108e40da",
      "61d1a7385ed47400108e40db",
      "61d1a7385ed47400108e40dc",
      "61d1a7385ed47400108e40dd",
      "61d1a7385ed47400108e40de",
      "61d1a7385ed47400108e40df",
      "61d1a7385ed47400108e40e0",
      "61d1a7385ed47400108e40e1",
      "61d1a7385ed47400108e40e2",
      "61d1a7385ed47400108e40e3",
      "61d1a7385ed47400108e40e4",
      "61d1a7385ed47400108e40e5",
      "61d1a7385ed47400108e40e6",
      "61d1a7385ed47400108e40e7",
      "61d1a7385ed47400108e40e8",
      "61d1a7385ed47400108e40e9",
      "61d1a7385ed47400108e40ea",
      "61d1a7385ed47400108e40eb",
      "61d1a7385ed47400108e40ec",
      "61d1a7385ed47400108e40ed",
      "61d1a7385ed47400108e40ee",
      "61d1a7385ed47400108e40ef",
      "61d1a7385ed47400108e40f0",
      "61d1a7385ed47400108e40f1",
      "61d1a7385ed47400108e40f2",
      "61d1a7385ed47400108e40f3",
      "61d1a7385ed47400108e40f4",
      "61d1a7385ed47400108e40f5",
      "61d1a7385ed47400108e40f6",
      "61d1a7385ed47400108e40f7",
      "61d1a7385ed47400108e40f8",
      "61d1a7385ed47400108e40f9",
      "61d1a7385ed47400108e40fa",
      "61d1a7385ed47400108e40fb",
      "61d1a7385ed47400108e40fc",
      "61d1a7385ed47400108e40fd",
      "61d1a7385ed47400108e40fe",
      "61d1a7385ed47400108e40ff",
      "61d1a7385ed47400108e4100",
      "61d1a7385ed47400108e4101",
      "61d1a7385ed47400108e4102",
      "61d1a7385ed47400108e4103",
      "61d1a7385ed47400108e4104",
      "61d1a7385ed47400108e4105",
      "61d1a7385ed47400108e4106",
      "61d1a7385ed47400108e4107",
      "61d1a7385ed47400108e4108",
      "61d1a7385ed47400108e4109",
      "61d1a7385ed47400108e410a",
      "61d1a7385ed47400108e410b",
      "61d1a7385ed47400108e410c",
      "61d1a7385ed47400108e410d",
      "61d1a7385ed47400108e410e",
      "61d1a7395ed47400108e410f",
      "61d1a7395ed47400108e4110",
      "61d1a7395ed47400108e4111",
      "61d1a7395ed47400108e4112",
      "61d1a7395ed47400108e4113",
      "61d1a7395ed47400108e4114",
      "61d1a7395ed47400108e4115",
      "61d1a7395ed47400108e4116",
      "61d1a7395ed47400108e4117",
      "61d1a7395ed47400108e4118",
      "61d1a7395ed47400108e4119",
      "61d1a7395ed47400108e411a",
      "61d1a7395ed47400108e411b",
      "61d1a7395ed47400108e411c",
      "61d1a7395ed47400108e411d",
      "61d1a7395ed47400108e411e",
      "61d1a7395ed47400108e411f",
      "61d1a7395ed47400108e4120",
      "61d1a7395ed47400108e4121",
      "61d1a7395ed47400108e4122",
      "61d1a7395ed47400108e4123",
      "61d1a7395ed47400108e4124",
      "61d1a7395ed47400108e4125",
      "61d1a7395ed47400108e4126",
      "61d1a7395ed47400108e4127"
    ],
    "hasDriverLicense": false,
    "hasPayedContribution": false
  },
  {
    "_id": "61895ed98cca870010108ecd",
    "firstname": "test",
    "lastname": "test",
    "email": "test@gmail.com",
    "phone": 612345678,
    "team": [
      "hard"
    ],
    "friends": [],
    "availabilities": [],
    "hasDriverLicense": false,
    "hasPayedContribution": false
  },
  {
    "_id": "618b00eb03b97e0010ef1980",
    "firstname": "test2",
    "lastname": "test2",
    "email": "test2@gmail.com",
    "phone": 602457898,
    "team": [
      "admin",
      "humain",
      "",
      "h",
      "hard",
      ""
    ],
    "friends": [],
    "availabilities": [],
    "hasDriverLicense": false,
    "hasPayedContribution": false
  },
  {
    "_id": "618e40fc39daea0010aeb80c",
    "firstname": "Lucie",
    "lastname": "Adisson",
    "nickname": "lusoft",
    "email": "adisson.lucie@gmail.com",
    "phone": 782921180,
    "team": [
      "hard"
    ],
    "friends": [],
    "availabilities": [
      "619cfac307febc0010a0441b",
      "619cfac307febc0010a0441c",
      "619d31d407febc0010a0497c",
      "619d31d407febc0010a0497b",
      "619d31d407febc0010a0497a",
      "619d31d407febc0010a04978",
      "619d31d407febc0010a04983",
      "619d31d407febc0010a04984",
      "619d31d407febc0010a04988",
      "619d31d407febc0010a04989",
      "619d31d407febc0010a0498a",
      "619d31d407febc0010a0498b",
      "619d31d407febc0010a04979",
      "619d31d407febc0010a04990",
      "619d31d407febc0010a04992",
      "619d31d407febc0010a04991",
      "619d31d407febc0010a04993",
      "619d31d407febc0010a04994",
      "619d31d407febc0010a0499d",
      "619d31d407febc0010a0499e",
      "619d31d407febc0010a0499f",
      "619d31d407febc0010a0497d",
      "619d31d407febc0010a0497f",
      "619d31d407febc0010a04980",
      "619d31d407febc0010a04981",
      "619d31d407febc0010a04982",
      "619d31d407febc0010a04985",
      "619d31d407febc0010a04986",
      "619d31d407febc0010a04987",
      "619d31d407febc0010a0498c",
      "619d31d407febc0010a0498d",
      "619d31d407febc0010a0498e",
      "619d31d407febc0010a0498f",
      "619d31d407febc0010a04995",
      "619d31d407febc0010a04996",
      "619d31d407febc0010a04997",
      "619d31d407febc0010a04998",
      "619d31d407febc0010a04999",
      "619d31d407febc0010a0499a",
      "619d31d407febc0010a0499b",
      "619d31d407febc0010a0499c",
      "619d31d407febc0010a049a0",
      "619d31d407febc0010a049a1",
      "619d32a407febc0010a04a00",
      "619d32a407febc0010a04a01",
      "619d32a407febc0010a04a02",
      "619d324707febc0010a049d5",
      "619d324707febc0010a049d7",
      "619d324707febc0010a049d9",
      "619d324707febc0010a049e2",
      "619d324707febc0010a049e3",
      "61d1a7385ed47400108e40b7",
      "61d1a7385ed47400108e40b8",
      "61d1a7385ed47400108e40b9",
      "61d1a7385ed47400108e40ba",
      "61d1a7385ed47400108e40bb",
      "61d1a7385ed47400108e40bc",
      "61d1a7385ed47400108e40bd",
      "61d1a7385ed47400108e40be",
      "61d1a7385ed47400108e40bf",
      "61d1a7385ed47400108e40c0",
      "61d1a7385ed47400108e40c1",
      "61d1a7385ed47400108e40c2",
      "61d1a7385ed47400108e40c3",
      "61d1a7385ed47400108e40c4",
      "61d1a7385ed47400108e40c5",
      "61d1a7385ed47400108e40c6",
      "61d1a7385ed47400108e40c7",
      "61d1a7385ed47400108e40c8",
      "61d1a7385ed47400108e40c9",
      "61d1a7385ed47400108e40ca",
      "61d1a7385ed47400108e40cb",
      "61d1a7385ed47400108e40cc",
      "61d1a7385ed47400108e40cd",
      "61d1a7385ed47400108e40ce",
      "61d1a7385ed47400108e40cf",
      "61d1a7385ed47400108e40d0",
      "61d1a7385ed47400108e40d1",
      "61d1a7385ed47400108e40d2",
      "61d1a7385ed47400108e40d3",
      "61d1a7385ed47400108e40d4",
      "61d1a7385ed47400108e40d5",
      "61d1a7385ed47400108e40d6",
      "61d1a7385ed47400108e40d7",
      "61d1a7385ed47400108e40d8",
      "61d1a7385ed47400108e40d9",
      "61d1a7385ed47400108e40da",
      "61d1a7385ed47400108e40db",
      "61d1a7385ed47400108e40dc",
      "61d1a7385ed47400108e40dd",
      "61d1a7385ed47400108e40de",
      "61d1a7385ed47400108e40df",
      "61d1a7385ed47400108e40e0",
      "61d1a7385ed47400108e40e1",
      "61d1a7385ed47400108e40e2",
      "61d1a7385ed47400108e40e3",
      "61d1a7385ed47400108e40e4",
      "61d1a7385ed47400108e40e5",
      "61d1a7385ed47400108e40e6",
      "61d1a7385ed47400108e40e7",
      "61d1a7385ed47400108e40e8",
      "61d1a7385ed47400108e40e9",
      "61d1a7385ed47400108e40ea",
      "61d1a7385ed47400108e40eb",
      "61d1a7385ed47400108e40ec",
      "61d1a7385ed47400108e40ed",
      "61d1a7385ed47400108e40ee",
      "61d1a7385ed47400108e40ef",
      "61d1a7385ed47400108e40f0",
      "61d1a7385ed47400108e40f1",
      "61d1a7385ed47400108e40f2",
      "61d1a7385ed47400108e40f3",
      "61d1a7385ed47400108e40f4",
      "61d1a7385ed47400108e40f5",
      "61d1a7385ed47400108e40f6",
      "61d1a7385ed47400108e40f7",
      "61d1a7385ed47400108e40f8",
      "61d1a7385ed47400108e40f9",
      "61d1a7385ed47400108e40fa",
      "61d1a7385ed47400108e40fb",
      "61d1a7385ed47400108e40fc",
      "61d1a7385ed47400108e40fd",
      "61d1a7385ed47400108e40fe",
      "61d1a7385ed47400108e40ff",
      "61d1a7385ed47400108e4100",
      "61d1a7385ed47400108e4101",
      "61d1a7385ed47400108e4102",
      "61d1a7385ed47400108e4103",
      "61d1a7385ed47400108e4104",
      "61d1a7385ed47400108e4105",
      "61d1a7385ed47400108e4106",
      "61d1a7385ed47400108e4107",
      "61d1a7385ed47400108e4108",
      "61d1a7385ed47400108e4109",
      "61d1a7385ed47400108e410a",
      "61d1a7385ed47400108e410b",
      "61d1a7385ed47400108e410c",
      "61d1a7385ed47400108e410d",
      "61d1a7385ed47400108e410e",
      "61d1a7395ed47400108e410f",
      "61d1a7395ed47400108e4110",
      "61d1a7395ed47400108e4111",
      "61d1a7395ed47400108e4112",
      "61d1a7395ed47400108e4113",
      "61d1a7395ed47400108e4114",
      "61d1a7395ed47400108e4115",
      "61d1a7395ed47400108e4116",
      "61d1a7395ed47400108e4117",
      "61d1a7395ed47400108e4118",
      "61d1a7395ed47400108e4119",
      "61d1a7395ed47400108e411a",
      "61d1a7395ed47400108e411b",
      "61d1a7395ed47400108e411c",
      "61d1a7395ed47400108e411d",
      "61d1a7395ed47400108e411e",
      "61d1a7395ed47400108e411f",
      "61d1a7395ed47400108e4120",
      "61d1a7395ed47400108e4121",
      "61d1a7395ed47400108e4122",
      "61d1a7395ed47400108e4123",
      "61d1a7395ed47400108e4124",
      "61d1a7395ed47400108e4125",
      "61d1a7395ed47400108e4126",
      "61d1a7395ed47400108e4127"
    ],
    "hasDriverLicense": true,
    "hasPayedContribution": false
  },
  {
    "_id": "61926658234e610012e9f44a",
    "firstname": "Pauline ",
    "lastname": "R",
    "email": "rossignol.pauline2001@gmail.com",
    "phone": 611325762,
    "team": [
      null,
      "hard",
      "humain",
      "admin"
    ],
    "friends": [],
    "availabilities": [],
    "hasDriverLicense": false,
    "hasPayedContribution": false
  },
  {
    "_id": "619be1e5998dff0010dd0d80",
    "firstname": "Clement ",
    "lastname": "DAGUILLON",
    "email": "cledaguillon@gmail.com",
    "phone": 782477597,
    "team": [
      "hard",
      "elec",
      "log"
    ],
    "friends": [],
    "availabilities": [
      "61d1a7385ed47400108e40b7",
      "61d1a7385ed47400108e40b8",
      "61d1a7385ed47400108e40b9",
      "61d1a7385ed47400108e40bd",
      "61d1a7385ed47400108e40be",
      "61d1a7385ed47400108e40bc",
      "61d1a7385ed47400108e40bf",
      "61d1a7385ed47400108e40c0",
      "61d1a7385ed47400108e40c1",
      "61d1a7385ed47400108e40c2",
      "61d1a7385ed47400108e40c3",
      "61d1a7385ed47400108e40c5",
      "61d1a7385ed47400108e40c6",
      "61d1a7385ed47400108e40c8",
      "61d1a7385ed47400108e40c9",
      "61d1a7385ed47400108e40cb",
      "61d1a7385ed47400108e40cc",
      "61d1a7385ed47400108e40d1",
      "61d1a7385ed47400108e40cf",
      "61d1a7385ed47400108e40d0",
      "61d1a7385ed47400108e40d5",
      "61d1a7385ed47400108e40d6",
      "61d1a7385ed47400108e40d7",
      "61d1a7385ed47400108e40d8",
      "61d1a7385ed47400108e40d9",
      "61d1a7385ed47400108e40db",
      "61d1a7385ed47400108e40da",
      "61d1a7385ed47400108e40dc",
      "61d1a7385ed47400108e40dd",
      "61d1a7385ed47400108e40de",
      "61d1a7385ed47400108e40df",
      "61d1a7385ed47400108e40e0",
      "61d1a7385ed47400108e40e1",
      "61d1a7385ed47400108e40e2",
      "61d1a7385ed47400108e40e3",
      "61d1a7385ed47400108e40e4",
      "61d1a7385ed47400108e40e5",
      "61d1a7385ed47400108e40e6",
      "61d1a7385ed47400108e40e7",
      "61d1a7385ed47400108e40e8",
      "61d1a7385ed47400108e40e9",
      "61d1a7385ed47400108e40ea",
      "61d1a7385ed47400108e40ec",
      "61d1a7385ed47400108e40ed",
      "61d1a7385ed47400108e40ee",
      "61d1a7385ed47400108e40ef",
      "61d1a7385ed47400108e40f0",
      "61d1a7385ed47400108e40f1",
      "61d1a7385ed47400108e40f2",
      "61d1a7385ed47400108e40f5",
      "61d1a7385ed47400108e40f8",
      "61d1a7385ed47400108e40f9",
      "61d1a7385ed47400108e40fa",
      "61d1a7385ed47400108e40fb",
      "61d1a7385ed47400108e40fc",
      "61d1a7385ed47400108e40fe",
      "61d1a7385ed47400108e40ff",
      "61d1a7385ed47400108e4101",
      "61d1a7385ed47400108e4102",
      "61d1a7385ed47400108e4104",
      "61d1a7385ed47400108e4105",
      "61d1a7385ed47400108e4106",
      "61d1a7385ed47400108e4107",
      "61d1a7385ed47400108e4108",
      "61d1a7385ed47400108e410a",
      "61d1a7385ed47400108e410b",
      "61d1a7385ed47400108e410d",
      "61d1a7385ed47400108e410e",
      "61d1a7395ed47400108e410f",
      "61d1a7395ed47400108e4110",
      "61d1a7395ed47400108e4112",
      "61d1a7395ed47400108e4113",
      "61d1a7395ed47400108e4114",
      "61d1a7395ed47400108e4115",
      "61d1a7395ed47400108e4116",
      "61d1a7395ed47400108e4117",
      "61d1a7395ed47400108e4118",
      "61d1a7395ed47400108e4119",
      "61d1a7395ed47400108e411d",
      "61d1a7395ed47400108e411e",
      "61d1a7395ed47400108e4127",
      "61d1a7395ed47400108e4126",
      "61d1a7395ed47400108e4125",
      "61d1a7395ed47400108e4124",
      "61d1a7395ed47400108e4123",
      "61d1a7395ed47400108e4122",
      "61d1a7395ed47400108e4121",
      "61d1a7395ed47400108e4120",
      "61d1a7395ed47400108e411f"
    ],
    "hasDriverLicense": false,
    "hasPayedContribution": false
  },
  {
    "_id": "619d3aba07febc0010a04aaf",
    "firstname": "tit",
    "lastname": "ci",
    "email": "titouanjoseph@gmail.com",
    "charisma": 10000,
    "phone": 612345678,
    "team": [
      "admin",
      "humain",
      "hard"
    ],
    "friends": [],
    "availabilities": [
      "619cfac307febc0010a0441b",
      "619cfac307febc0010a0441c",
      "619cfac307febc0010a0441d",
      "619d31d407febc0010a04978",
      "619d31d407febc0010a04979",
      "619d31d407febc0010a0497a",
      "619d31d407febc0010a0497b",
      "619d31d407febc0010a0497c",
      "619d31d407febc0010a0497d",
      "619d31d407febc0010a0497f",
      "619d31d407febc0010a04980",
      "619d31d407febc0010a04981",
      "619d31d407febc0010a04982",
      "619d31d407febc0010a04983",
      "619d31d407febc0010a04984",
      "619d31d407febc0010a04985",
      "619d31d407febc0010a04986",
      "619d31d407febc0010a04987",
      "619d31d407febc0010a04988",
      "619d31d407febc0010a04989",
      "619d31d407febc0010a0498a",
      "619d31d407febc0010a0498b",
      "619d31d407febc0010a0498c",
      "619d31d407febc0010a0498d",
      "619d31d407febc0010a0498e",
      "619d31d407febc0010a0498f",
      "619d31d407febc0010a04990",
      "619d31d407febc0010a04991",
      "619d31d407febc0010a04992",
      "619d31d407febc0010a04993",
      "619d31d407febc0010a04994",
      "619d31d407febc0010a04995",
      "619d31d407febc0010a04996",
      "619d31d407febc0010a04997",
      "619d31d407febc0010a04998",
      "619d31d407febc0010a04999",
      "619d31d407febc0010a0499a",
      "619d31d407febc0010a0499b",
      "619d31d407febc0010a0499c",
      "619d31d407febc0010a0499d",
      "619d31d407febc0010a0499e",
      "619d31d407febc0010a0499f",
      "619d31d407febc0010a049a0",
      "619d31d407febc0010a049a1",
      "619d32a407febc0010a04a00",
      "619d32a407febc0010a04a01",
      "619d32a407febc0010a04a02",
      "619d324707febc0010a049d4",
      "619d324707febc0010a049d5",
      "619d324707febc0010a049d6",
      "619d324707febc0010a049d7",
      "619d324707febc0010a049d8",
      "619d324707febc0010a049d9",
      "619d324707febc0010a049da",
      "619d324707febc0010a049db",
      "619d324707febc0010a049dc",
      "619d324707febc0010a049dd",
      "619d324707febc0010a049de",
      "619d324707febc0010a049df",
      "619d324707febc0010a049e0",
      "619d324707febc0010a049e1",
      "619d324707febc0010a049e2",
      "619d324707febc0010a049e3",
      "619d324707febc0010a049e4",
      "619d324707febc0010a049e5",
      "619d324707febc0010a049e6",
      "619d324707febc0010a049e7",
      "619d324707febc0010a049e8",
      "619d324707febc0010a049e9",
      "619d324707febc0010a049ea",
      "619d324707febc0010a049eb",
      "619d324707febc0010a049ec",
      "619d324707febc0010a049ed",
      "619d324707febc0010a049ee",
      "619d324707febc0010a049ef",
      "619d324707febc0010a049f0",
      "619d324707febc0010a049f1",
      "619d324707febc0010a049f2",
      "619d324707febc0010a049f3",
      "619d324707febc0010a049f4",
      "619d324707febc0010a049f5",
      "619d324707febc0010a049f6",
      "619d324707febc0010a049f7",
      "619d324707febc0010a049f8",
      "619d324707febc0010a049f9",
      "619d324707febc0010a049fa",
      "619d324707febc0010a049fb",
      "619d324707febc0010a049fc",
      "619d324707febc0010a049fd"
    ],
    "hasDriverLicense": false,
    "hasPayedContribution": false
  },
  {
    "_id": "61a00efb07febc0010a04d57",
    "firstname": "Marion",
    "lastname": "Roselier",
    "email": "marion.rsl14@gmail.com",
    "phone": 651407501,
    "team": [
      null,
      "hard",
      "log"
    ],
    "friends": [],
    "availabilities": [
      "61d1a7385ed47400108e40b7",
      "61d1a7385ed47400108e40b8",
      "61d1a7385ed47400108e40b9",
      "61d1a7385ed47400108e40ba",
      "61d1a7385ed47400108e40bb",
      "61d1a7385ed47400108e40bc",
      "61d1a7385ed47400108e40bd",
      "61d1a7385ed47400108e40be",
      "61d1a7385ed47400108e40bf",
      "61d1a7385ed47400108e40c0",
      "61d1a7385ed47400108e40c1",
      "61d1a7385ed47400108e40c2",
      "61d1a7385ed47400108e40c3",
      "61d1a7385ed47400108e40c4",
      "61d1a7385ed47400108e40c5",
      "61d1a7385ed47400108e40c6",
      "61d1a7385ed47400108e40c7",
      "61d1a7385ed47400108e40c8",
      "61d1a7385ed47400108e40c9",
      "61d1a7385ed47400108e40ca",
      "61d1a7385ed47400108e40cb",
      "61d1a7385ed47400108e40cc",
      "61d1a7385ed47400108e40cd",
      "61d1a7385ed47400108e40ce",
      "61d1a7385ed47400108e40cf",
      "61d1a7385ed47400108e40d0",
      "61d1a7385ed47400108e40d1",
      "61d1a7385ed47400108e40d2",
      "61d1a7385ed47400108e40d3",
      "61d1a7385ed47400108e40d4",
      "61d1a7385ed47400108e40d5",
      "61d1a7385ed47400108e40d6",
      "61d1a7385ed47400108e40d7",
      "61d1a7385ed47400108e40d8",
      "61d1a7385ed47400108e40d9",
      "61d1a7385ed47400108e40da",
      "61d1a7385ed47400108e40db",
      "61d1a7385ed47400108e40dc",
      "61d1a7385ed47400108e40dd",
      "61d1a7385ed47400108e40de",
      "61d1a7385ed47400108e40df",
      "61d1a7385ed47400108e40e0",
      "61d1a7385ed47400108e40e1",
      "61d1a7385ed47400108e40e2",
      "61d1a7385ed47400108e40e3",
      "61d1a7385ed47400108e40e4",
      "61d1a7385ed47400108e40e5",
      "61d1a7385ed47400108e40e6",
      "61d1a7385ed47400108e40e7",
      "61d1a7385ed47400108e40e8",
      "61d1a7385ed47400108e40e9",
      "61d1a7385ed47400108e40ea",
      "61d1a7385ed47400108e40eb",
      "61d1a7385ed47400108e40ec",
      "61d1a7385ed47400108e40ed",
      "61d1a7385ed47400108e40ee",
      "61d1a7385ed47400108e40ef",
      "61d1a7385ed47400108e40f0",
      "61d1a7385ed47400108e40f1",
      "61d1a7385ed47400108e40f2",
      "61d1a7385ed47400108e40f3",
      "61d1a7385ed47400108e40f4",
      "61d1a7385ed47400108e40f5",
      "61d1a7385ed47400108e40f6",
      "61d1a7385ed47400108e40f7",
      "61d1a7385ed47400108e40f8",
      "61d1a7385ed47400108e40f9",
      "61d1a7385ed47400108e40fa",
      "61d1a7385ed47400108e40fb",
      "61d1a7385ed47400108e40fc",
      "61d1a7385ed47400108e40fd",
      "61d1a7385ed47400108e40fe",
      "61d1a7385ed47400108e40ff",
      "61d1a7385ed47400108e4100",
      "61d1a7385ed47400108e4101",
      "61d1a7385ed47400108e4102",
      "61d1a7385ed47400108e4103",
      "61d1a7385ed47400108e4104",
      "61d1a7385ed47400108e4105",
      "61d1a7385ed47400108e4106",
      "61d1a7385ed47400108e4107",
      "61d1a7385ed47400108e4108",
      "61d1a7385ed47400108e4109",
      "61d1a7385ed47400108e410a",
      "61d1a7385ed47400108e410b",
      "61d1a7385ed47400108e410c",
      "61d1a7385ed47400108e410d",
      "61d1a7385ed47400108e410e",
      "61d1a7395ed47400108e410f",
      "61d1a7395ed47400108e4110",
      "61d1a7395ed47400108e4111",
      "61d1a7395ed47400108e4112",
      "61d1a7395ed47400108e4113",
      "61d1a7395ed47400108e4114",
      "61d1a7395ed47400108e4115",
      "61d1a7395ed47400108e4116",
      "61d1a7395ed47400108e4117",
      "61d1a7395ed47400108e4118",
      "61d1a7395ed47400108e4119",
      "61d1a7395ed47400108e411a",
      "61d1a7395ed47400108e411b",
      "61d1a7395ed47400108e411c",
      "61d1a7395ed47400108e411d",
      "61d1a7395ed47400108e411e",
      "61d1a7395ed47400108e411f",
      "61d1a7395ed47400108e4120",
      "61d1a7395ed47400108e4121",
      "61d1a7395ed47400108e4122",
      "61d1a7395ed47400108e4123",
      "61d1a7395ed47400108e4124",
      "61d1a7395ed47400108e4125",
      "61d1a7395ed47400108e4126",
      "61d1a7395ed47400108e4127"
    ],
    "hasDriverLicense": true,
    "hasPayedContribution": false
  },
  {
    "_id": "61a3c04bd3d36000119ff223",
    "firstname": "Corentin",
    "lastname": "Mammi",
    "nickname": "Corent2",
    "email": "corentin.mammi@gmail.com",
    "phone": 610923712,
    "team": [
      "hard",
      "signa",
      "log"
    ],
    "friends": [],
    "availabilities": [
      "61d1a7385ed47400108e40b7",
      "61d1a7385ed47400108e40b8",
      "61d1a7385ed47400108e40b9",
      "61d1a7385ed47400108e40ba",
      "61d1a7385ed47400108e40bb",
      "61d1a7385ed47400108e40bc",
      "61d1a7385ed47400108e40bd",
      "61d1a7385ed47400108e40be",
      "61d1a7385ed47400108e40bf",
      "61d1a7385ed47400108e40c0",
      "61d1a7385ed47400108e40c1",
      "61d1a7385ed47400108e40c2",
      "61d1a7385ed47400108e40c3",
      "61d1a7385ed47400108e40c4",
      "61d1a7385ed47400108e40c5",
      "61d1a7385ed47400108e40c6",
      "61d1a7385ed47400108e40c7",
      "61d1a7385ed47400108e40c8",
      "61d1a7385ed47400108e40c9",
      "61d1a7385ed47400108e40ca",
      "61d1a7385ed47400108e40cb",
      "61d1a7385ed47400108e40cc",
      "61d1a7385ed47400108e40cd",
      "61d1a7385ed47400108e40ce",
      "61d1a7385ed47400108e40cf",
      "61d1a7385ed47400108e40d0",
      "61d1a7385ed47400108e40d1",
      "61d1a7385ed47400108e40d2",
      "61d1a7385ed47400108e40d3",
      "61d1a7385ed47400108e40d4",
      "61d1a7385ed47400108e40d5",
      "61d1a7385ed47400108e40d6",
      "61d1a7385ed47400108e40d7",
      "61d1a7385ed47400108e40d8",
      "61d1a7385ed47400108e40d9",
      "61d1a7385ed47400108e40da",
      "61d1a7385ed47400108e40db",
      "61d1a7385ed47400108e40dc",
      "61d1a7385ed47400108e40dd",
      "61d1a7385ed47400108e40de",
      "61d1a7385ed47400108e40df",
      "61d1a7385ed47400108e40e0",
      "61d1a7385ed47400108e40e1",
      "61d1a7385ed47400108e40e2",
      "61d1a7385ed47400108e40e3",
      "61d1a7385ed47400108e40e4",
      "61d1a7385ed47400108e40e5",
      "61d1a7385ed47400108e40e6",
      "61d1a7385ed47400108e40e7",
      "61d1a7385ed47400108e40e8",
      "61d1a7385ed47400108e40e9",
      "61d1a7385ed47400108e40ea",
      "61d1a7385ed47400108e40eb",
      "61d1a7385ed47400108e40ec",
      "61d1a7385ed47400108e40ed",
      "61d1a7385ed47400108e40ee",
      "61d1a7385ed47400108e40ef",
      "61d1a7385ed47400108e40f0",
      "61d1a7385ed47400108e40f1",
      "61d1a7385ed47400108e40f2",
      "61d1a7385ed47400108e40f3",
      "61d1a7385ed47400108e40f4",
      "61d1a7385ed47400108e40f5",
      "61d1a7385ed47400108e40f6",
      "61d1a7385ed47400108e40f7",
      "61d1a7385ed47400108e40f8",
      "61d1a7385ed47400108e40f9",
      "61d1a7385ed47400108e40fa",
      "61d1a7385ed47400108e40fb",
      "61d1a7385ed47400108e40fc",
      "61d1a7385ed47400108e40fd",
      "61d1a7385ed47400108e40fe",
      "61d1a7385ed47400108e40ff",
      "61d1a7385ed47400108e4100",
      "61d1a7385ed47400108e4101",
      "61d1a7385ed47400108e4102",
      "61d1a7385ed47400108e4103",
      "61d1a7385ed47400108e4104",
      "61d1a7385ed47400108e4105",
      "61d1a7385ed47400108e4106",
      "61d1a7385ed47400108e4107",
      "61d1a7385ed47400108e4108",
      "61d1a7385ed47400108e4109",
      "61d1a7385ed47400108e410a",
      "61d1a7385ed47400108e410b",
      "61d1a7385ed47400108e410c",
      "61d1a7385ed47400108e410d",
      "61d1a7385ed47400108e410e",
      "61d1a7395ed47400108e410f",
      "61d1a7395ed47400108e4110",
      "61d1a7395ed47400108e4111",
      "61d1a7395ed47400108e4112",
      "61d1a7395ed47400108e4113",
      "61d1a7395ed47400108e4114",
      "61d1a7395ed47400108e4115",
      "61d1a7395ed47400108e4116",
      "61d1a7395ed47400108e4117",
      "61d1a7395ed47400108e4118",
      "61d1a7395ed47400108e4119",
      "61d1a7395ed47400108e411a",
      "61d1a7395ed47400108e411b",
      "61d1a7395ed47400108e411c",
      "61d1a7395ed47400108e411d",
      "61d1a7395ed47400108e411e",
      "61d1a7395ed47400108e411f",
      "61d1a7395ed47400108e4120",
      "61d1a7395ed47400108e4121",
      "61d1a7395ed47400108e4122",
      "61d1a7395ed47400108e4123",
      "61d1a7395ed47400108e4124",
      "61d1a7395ed47400108e4125",
      "61d1a7395ed47400108e4126",
      "61d1a7395ed47400108e4127"
    ],
    "hasDriverLicense": true,
    "hasPayedContribution": false
  },
  {
    "_id": "61a79813f3344f00129c4433",
    "firstname": "Loïs",
    "lastname": "Plaza",
    "nickname": "",
    "email": "lois.plaza@gmail.com",
    "phone": 781442635,
    "team": [
      "hard",
      "secu"
    ],
    "friends": [],
    "availabilities": [],
    "hasDriverLicense": true,
    "hasPayedContribution": false
  },
  {
    "_id": "61a7cf44a2d5f100104585ac",
    "firstname": "Alexis",
    "lastname": "Borel",
    "nickname": "Maaf",
    "email": "alexis.borel21@gmail.com",
    "phone": 770341631,
    "team": [
      "bureau",
      "hard"
    ],
    "friends": [],
    "availabilities": [],
    "hasDriverLicense": true,
    "hasPayedContribution": false
  },
  {
    "_id": "61a7d21ca2d5f100104585d5",
    "firstname": "Matteo",
    "lastname": "Saragoni",
    "nickname": "La Diva",
    "email": "saragoni19@gmail.com",
    "phone": 634553125,
    "team": [
      "bureau",
      "sponso",
      "hard"
    ],
    "friends": [],
    "availabilities": [],
    "hasDriverLicense": false,
    "hasPayedContribution": false
  },
  {
    "_id": "61a7f65ca2d5f1001045868c",
    "firstname": "Antoine",
    "lastname": "Merle",
    "nickname": "métro D direction gare de vaise",
    "email": "toinou1280@gmail.com",
    "phone": 750254941,
    "team": [
      "hard",
      "orga",
      "payant"
    ],
    "friends": [],
    "availabilities": [],
    "hasDriverLicense": true,
    "hasPayedContribution": false
  },
  {
    "_id": "61a8c2c7a2d5f100104589f4",
    "firstname": "Evanne",
    "lastname": "Martin",
    "nickname": "Bout 2 Bois",
    "email": "evanne.martin13@gmail.com",
    "phone": 679530091,
    "team": [
      "hard",
      "orga",
      "concert"
    ],
    "friends": [],
    "availabilities": [
      "61d1a7385ed47400108e40b7",
      "61d1a7385ed47400108e40b8",
      "61d1a7385ed47400108e40b9",
      "61d1a7385ed47400108e40ba",
      "61d1a7385ed47400108e40bb",
      "61d1a7385ed47400108e40bc",
      "61d1a7385ed47400108e40bd",
      "61d1a7385ed47400108e40be",
      "61d1a7385ed47400108e40bf",
      "61d1a7385ed47400108e40c0",
      "61d1a7385ed47400108e40c1",
      "61d1a7385ed47400108e40c2",
      "61d1a7385ed47400108e40c3",
      "61d1a7385ed47400108e40c4",
      "61d1a7385ed47400108e40c5",
      "61d1a7385ed47400108e40c6",
      "61d1a7385ed47400108e40c7",
      "61d1a7385ed47400108e40c8",
      "61d1a7385ed47400108e40c9",
      "61d1a7385ed47400108e40ca",
      "61d1a7385ed47400108e40cb",
      "61d1a7385ed47400108e40cc",
      "61d1a7385ed47400108e40cd",
      "61d1a7385ed47400108e40ce",
      "61d1a7385ed47400108e40cf",
      "61d1a7385ed47400108e40d0",
      "61d1a7385ed47400108e40d1",
      "61d1a7385ed47400108e40d2",
      "61d1a7385ed47400108e40d3",
      "61d1a7385ed47400108e40d4",
      "61d1a7385ed47400108e40d5",
      "61d1a7385ed47400108e40d6",
      "61d1a7385ed47400108e40d7",
      "61d1a7385ed47400108e40d8",
      "61d1a7385ed47400108e40d9",
      "61d1a7385ed47400108e40da",
      "61d1a7385ed47400108e40db",
      "61d1a7385ed47400108e40dc",
      "61d1a7385ed47400108e40dd",
      "61d1a7385ed47400108e40de",
      "61d1a7385ed47400108e40df",
      "61d1a7385ed47400108e40e0",
      "61d1a7385ed47400108e40e1",
      "61d1a7385ed47400108e40e2",
      "61d1a7385ed47400108e40e3",
      "61d1a7385ed47400108e40e4",
      "61d1a7385ed47400108e40e5",
      "61d1a7385ed47400108e40e6",
      "61d1a7385ed47400108e40e7",
      "61d1a7385ed47400108e40e8",
      "61d1a7385ed47400108e40e9",
      "61d1a7385ed47400108e40ea",
      "61d1a7385ed47400108e40eb",
      "61d1a7385ed47400108e40ec",
      "61d1a7385ed47400108e40ed",
      "61d1a7385ed47400108e40ee",
      "61d1a7385ed47400108e40ef",
      "61d1a7385ed47400108e40f0",
      "61d1a7385ed47400108e40f1",
      "61d1a7385ed47400108e40f2",
      "61d1a7385ed47400108e40f3",
      "61d1a7385ed47400108e40f4",
      "61d1a7385ed47400108e40f5",
      "61d1a7385ed47400108e40f6",
      "61d1a7385ed47400108e40f7",
      "61d1a7385ed47400108e40f8",
      "61d1a7385ed47400108e40f9",
      "61d1a7385ed47400108e40fa",
      "61d1a7385ed47400108e40fb",
      "61d1a7385ed47400108e40fc",
      "61d1a7385ed47400108e40fd",
      "61d1a7385ed47400108e40fe",
      "61d1a7385ed47400108e40ff",
      "61d1a7385ed47400108e4100",
      "61d1a7385ed47400108e4101",
      "61d1a7385ed47400108e4102",
      "61d1a7385ed47400108e4103",
      "61d1a7385ed47400108e4104",
      "61d1a7385ed47400108e4105",
      "61d1a7385ed47400108e4106",
      "61d1a7385ed47400108e4107",
      "61d1a7385ed47400108e4108",
      "61d1a7385ed47400108e4109",
      "61d1a7385ed47400108e410a",
      "61d1a7385ed47400108e410b",
      "61d1a7385ed47400108e410c",
      "61d1a7385ed47400108e410d",
      "61d1a7385ed47400108e410e",
      "61d1a7395ed47400108e410f",
      "61d1a7395ed47400108e4110",
      "61d1a7395ed47400108e4111",
      "61d1a7395ed47400108e4112",
      "61d1a7395ed47400108e4113",
      "61d1a7395ed47400108e4114",
      "61d1a7395ed47400108e4115",
      "61d1a7395ed47400108e4116",
      "61d1a7395ed47400108e4117",
      "61d1a7395ed47400108e4118",
      "61d1a7395ed47400108e4119",
      "61d1a7395ed47400108e411a",
      "61d1a7395ed47400108e411b",
      "61d1a7395ed47400108e411c",
      "61d1a7395ed47400108e411d",
      "61d1a7395ed47400108e411e",
      "61d1a7395ed47400108e411f",
      "61d1a7395ed47400108e4120",
      "61d1a7395ed47400108e4121",
      "61d1a7395ed47400108e4122",
      "61d1a7395ed47400108e4123",
      "61d1a7395ed47400108e4124",
      "61d1a7395ed47400108e4125",
      "61d1a7395ed47400108e4126",
      "61d1a7395ed47400108e4127"
    ],
    "hasDriverLicense": false,
    "hasPayedContribution": false
  },
  {
    "_id": "61a8e4b2a2d5f10010458d13",
    "firstname": "Alexis",
    "lastname": "Brissard",
    "nickname": "Amaguiz",
    "email": "brissardalexis@gmail.com",
    "phone": 668883918,
    "team": [
      "hard",
      "orga",
      "barrieres"
    ],
    "friends": [],
    "availabilities": [
      "61d1a7385ed47400108e40b7",
      "61d1a7385ed47400108e40b8",
      "61d1a7385ed47400108e40b9",
      "61d1a7385ed47400108e40ba",
      "61d1a7385ed47400108e40bb",
      "61d1a7385ed47400108e40bc",
      "61d1a7385ed47400108e40bd",
      "61d1a7385ed47400108e40be",
      "61d1a7385ed47400108e40bf",
      "61d1a7385ed47400108e40c0",
      "61d1a7385ed47400108e40c1",
      "61d1a7385ed47400108e40c2",
      "61d1a7385ed47400108e40c3",
      "61d1a7385ed47400108e40c4",
      "61d1a7385ed47400108e40c5",
      "61d1a7385ed47400108e40c6",
      "61d1a7385ed47400108e40c7",
      "61d1a7385ed47400108e40c8",
      "61d1a7385ed47400108e40c9",
      "61d1a7385ed47400108e40ca",
      "61d1a7385ed47400108e40cb",
      "61d1a7385ed47400108e40cc",
      "61d1a7385ed47400108e40cd",
      "61d1a7385ed47400108e40ce",
      "61d1a7385ed47400108e40cf",
      "61d1a7385ed47400108e40d0",
      "61d1a7385ed47400108e40d1",
      "61d1a7385ed47400108e40d2",
      "61d1a7385ed47400108e40d3",
      "61d1a7385ed47400108e40d4",
      "61d1a7385ed47400108e40d5",
      "61d1a7385ed47400108e40d6",
      "61d1a7385ed47400108e40d7",
      "61d1a7385ed47400108e40d8",
      "61d1a7385ed47400108e40d9",
      "61d1a7385ed47400108e40da",
      "61d1a7385ed47400108e40db",
      "61d1a7385ed47400108e40dc",
      "61d1a7385ed47400108e40dd",
      "61d1a7385ed47400108e40de",
      "61d1a7385ed47400108e40df",
      "61d1a7385ed47400108e40e0",
      "61d1a7385ed47400108e40e1",
      "61d1a7385ed47400108e40e2",
      "61d1a7385ed47400108e40e3",
      "61d1a7385ed47400108e40e4",
      "61d1a7385ed47400108e40e5",
      "61d1a7385ed47400108e40e6",
      "61d1a7385ed47400108e40e7",
      "61d1a7385ed47400108e40e8",
      "61d1a7385ed47400108e40e9",
      "61d1a7385ed47400108e40ea",
      "61d1a7385ed47400108e40eb",
      "61d1a7385ed47400108e40ec",
      "61d1a7385ed47400108e40ed",
      "61d1a7385ed47400108e40ee",
      "61d1a7385ed47400108e40ef",
      "61d1a7385ed47400108e40f0",
      "61d1a7385ed47400108e40f1",
      "61d1a7385ed47400108e40f2",
      "61d1a7385ed47400108e40f3",
      "61d1a7385ed47400108e40f4",
      "61d1a7385ed47400108e40f5",
      "61d1a7385ed47400108e40f6",
      "61d1a7385ed47400108e40f7",
      "61d1a7385ed47400108e40f8",
      "61d1a7385ed47400108e40f9",
      "61d1a7385ed47400108e40fa",
      "61d1a7385ed47400108e40fb",
      "61d1a7385ed47400108e40fc",
      "61d1a7385ed47400108e40fd",
      "61d1a7385ed47400108e40fe",
      "61d1a7385ed47400108e40ff",
      "61d1a7385ed47400108e4100",
      "61d1a7385ed47400108e4101",
      "61d1a7385ed47400108e4102",
      "61d1a7385ed47400108e4103",
      "61d1a7385ed47400108e4104",
      "61d1a7385ed47400108e4105",
      "61d1a7385ed47400108e4106",
      "61d1a7385ed47400108e4107",
      "61d1a7385ed47400108e4108",
      "61d1a7385ed47400108e4109",
      "61d1a7385ed47400108e410a",
      "61d1a7385ed47400108e410b",
      "61d1a7385ed47400108e410c",
      "61d1a7385ed47400108e410d",
      "61d1a7385ed47400108e410e",
      "61d1a7395ed47400108e410f",
      "61d1a7395ed47400108e4110",
      "61d1a7395ed47400108e4111",
      "61d1a7395ed47400108e4112",
      "61d1a7395ed47400108e4113",
      "61d1a7395ed47400108e4114",
      "61d1a7395ed47400108e4115",
      "61d1a7395ed47400108e4116",
      "61d1a7395ed47400108e4117",
      "61d1a7395ed47400108e4118",
      "61d1a7395ed47400108e4119",
      "61d1a7395ed47400108e411a",
      "61d1a7395ed47400108e411b",
      "61d1a7395ed47400108e411c",
      "61d1a7395ed47400108e411d",
      "61d1a7395ed47400108e411e",
      "61d1a7395ed47400108e411f",
      "61d1a7395ed47400108e4120",
      "61d1a7395ed47400108e4121",
      "61d1a7395ed47400108e4122",
      "61d1a7395ed47400108e4123",
      "61d1a7395ed47400108e4124",
      "61d1a7395ed47400108e4125",
      "61d1a7395ed47400108e4126",
      "61d1a7395ed47400108e4127"
    ],
    "hasDriverLicense": false,
    "hasPayedContribution": false
  },
  {
    "_id": "61a8ea2948a2540010c04afb",
    "firstname": "Pelé",
    "lastname": "Ricos",
    "nickname": "Le Ricos",
    "email": "emeric.pele47@gmail.com",
    "phone": 674657829,
    "team": [
      "hard",
      "orga",
      "bar"
    ],
    "friends": [],
    "availabilities": [
      "61d1a7385ed47400108e40fb",
      "61d1a7385ed47400108e40fc",
      "61d1a7385ed47400108e40fd",
      "61d1a7385ed47400108e40fe",
      "61d1a7385ed47400108e4100",
      "61d1a7385ed47400108e40ff",
      "61d1a7385ed47400108e4102",
      "61d1a7385ed47400108e4101",
      "61d1a7385ed47400108e4103",
      "61d1a7385ed47400108e4105",
      "61d1a7385ed47400108e4104",
      "61d1a7385ed47400108e4106",
      "61d1a7385ed47400108e40ef",
      "61d1a7385ed47400108e40f0",
      "61d1a7385ed47400108e40f1",
      "61d1a7385ed47400108e40f2",
      "61d1a7385ed47400108e40f3",
      "61d1a7385ed47400108e40f5",
      "61d1a7385ed47400108e40f4",
      "61d1a7385ed47400108e40f6",
      "61d1a7385ed47400108e40f9",
      "61d1a7385ed47400108e40f7",
      "61d1a7385ed47400108e40f8",
      "61d1a7385ed47400108e40ee",
      "61d1a7385ed47400108e40ed",
      "61d1a7385ed47400108e40eb",
      "61d1a7385ed47400108e40ec",
      "61d1a7385ed47400108e40ea",
      "61d1a7385ed47400108e40e7",
      "61d1a7385ed47400108e40e9",
      "61d1a7385ed47400108e40e8",
      "61d1a7385ed47400108e40e6",
      "61d1a7385ed47400108e40e3",
      "61d1a7385ed47400108e40e4",
      "61d1a7385ed47400108e40e5",
      "61d1a7385ed47400108e40fa"
    ],
    "hasDriverLicense": true,
    "hasPayedContribution": false
  },
  {
    "_id": "61aa3be327e58b0011103551",
    "firstname": "Maxime",
    "lastname": "Cornet",
    "nickname": "Urhino",
    "email": "maxime.cornet98@gmail.com",
    "phone": 699116937,
    "team": [
      "secu",
      "hard",
      "orga"
    ],
    "friends": [],
    "availabilities": [
      "61d1a7385ed47400108e40b7",
      "61d1a7385ed47400108e40b8",
      "61d1a7385ed47400108e40b9",
      "61d1a7385ed47400108e40ba",
      "61d1a7385ed47400108e40bb",
      "61d1a7385ed47400108e40bc",
      "61d1a7385ed47400108e40bd",
      "61d1a7385ed47400108e40be",
      "61d1a7385ed47400108e40bf",
      "61d1a7385ed47400108e40c0",
      "61d1a7385ed47400108e40c1",
      "61d1a7385ed47400108e40c2",
      "61d1a7385ed47400108e40c3",
      "61d1a7385ed47400108e40c4",
      "61d1a7385ed47400108e40c5",
      "61d1a7385ed47400108e40c6",
      "61d1a7385ed47400108e40c7",
      "61d1a7385ed47400108e40c8",
      "61d1a7385ed47400108e40c9",
      "61d1a7385ed47400108e40ca",
      "61d1a7385ed47400108e40cb",
      "61d1a7385ed47400108e40cc",
      "61d1a7385ed47400108e40cd",
      "61d1a7385ed47400108e40ce",
      "61d1a7385ed47400108e40cf",
      "61d1a7385ed47400108e40d0",
      "61d1a7385ed47400108e40d1",
      "61d1a7385ed47400108e40d2",
      "61d1a7385ed47400108e40d3",
      "61d1a7385ed47400108e40d4",
      "61d1a7385ed47400108e40d5",
      "61d1a7385ed47400108e40d6",
      "61d1a7385ed47400108e40d7",
      "61d1a7385ed47400108e40d8",
      "61d1a7385ed47400108e40d9",
      "61d1a7385ed47400108e40da",
      "61d1a7385ed47400108e40db",
      "61d1a7385ed47400108e40dc",
      "61d1a7385ed47400108e40dd",
      "61d1a7385ed47400108e40de",
      "61d1a7385ed47400108e40df",
      "61d1a7385ed47400108e40e0",
      "61d1a7385ed47400108e40e1",
      "61d1a7385ed47400108e40e2",
      "61d1a7385ed47400108e40e3",
      "61d1a7385ed47400108e40e4",
      "61d1a7385ed47400108e40e5",
      "61d1a7385ed47400108e40e6",
      "61d1a7385ed47400108e40e7",
      "61d1a7385ed47400108e40e8",
      "61d1a7385ed47400108e40e9",
      "61d1a7385ed47400108e40ea",
      "61d1a7385ed47400108e40eb",
      "61d1a7385ed47400108e40ec",
      "61d1a7385ed47400108e40ed",
      "61d1a7385ed47400108e40ee",
      "61d1a7385ed47400108e40ef",
      "61d1a7385ed47400108e40f0",
      "61d1a7385ed47400108e40f1",
      "61d1a7385ed47400108e40f2",
      "61d1a7385ed47400108e40f3",
      "61d1a7385ed47400108e40f4",
      "61d1a7385ed47400108e40f5",
      "61d1a7385ed47400108e40f6",
      "61d1a7385ed47400108e40f7",
      "61d1a7385ed47400108e40f8",
      "61d1a7385ed47400108e40f9",
      "61d1a7385ed47400108e40fa",
      "61d1a7385ed47400108e40fb",
      "61d1a7385ed47400108e40fc",
      "61d1a7385ed47400108e40fd",
      "61d1a7385ed47400108e40fe",
      "61d1a7385ed47400108e40ff",
      "61d1a7385ed47400108e4100",
      "61d1a7385ed47400108e4101",
      "61d1a7385ed47400108e4102",
      "61d1a7385ed47400108e4103",
      "61d1a7385ed47400108e4104",
      "61d1a7385ed47400108e4105",
      "61d1a7385ed47400108e4106",
      "61d1a7385ed47400108e4107",
      "61d1a7385ed47400108e4108",
      "61d1a7385ed47400108e4109",
      "61d1a7385ed47400108e410a",
      "61d1a7385ed47400108e410b",
      "61d1a7385ed47400108e410c",
      "61d1a7385ed47400108e410d",
      "61d1a7385ed47400108e410e",
      "61d1a7395ed47400108e410f",
      "61d1a7395ed47400108e4110",
      "61d1a7395ed47400108e4111",
      "61d1a7395ed47400108e4112",
      "61d1a7395ed47400108e4113",
      "61d1a7395ed47400108e4114",
      "61d1a7395ed47400108e4115",
      "61d1a7395ed47400108e4116",
      "61d1a7395ed47400108e4117",
      "61d1a7395ed47400108e4118",
      "61d1a7395ed47400108e4119",
      "61d1a7395ed47400108e411a",
      "61d1a7395ed47400108e411b",
      "61d1a7395ed47400108e411c",
      "61d1a7395ed47400108e411d",
      "61d1a7395ed47400108e411e",
      "61d1a7395ed47400108e411f",
      "61d1a7395ed47400108e4120",
      "61d1a7395ed47400108e4121",
      "61d1a7395ed47400108e4122",
      "61d1a7395ed47400108e4123",
      "61d1a7395ed47400108e4124",
      "61d1a7395ed47400108e4125",
      "61d1a7395ed47400108e4126",
      "61d1a7395ed47400108e4127"
    ],
    "hasDriverLicense": false,
    "hasPayedContribution": false
  },
  {
    "_id": "61ad39f49b1c38001068f915",
    "firstname": "tom",
    "lastname": "sampic",
    "nickname": "nimbus",
    "email": "tom.sampic26@gmail.com",
    "phone": 782223719,
    "team": [
      "hard",
      "admin"
    ],
    "friends": [],
    "availabilities": [],
    "hasDriverLicense": false,
    "hasPayedContribution": false
  },
  {
    "_id": "61bc76a3ff79940010d517f7",
    "firstname": "Paul",
    "lastname": "Lefrand",
    "nickname": "Lays",
    "email": "paul.lefrand@gmail.com",
    "phone": 695241187,
    "team": [
      "hard"
    ],
    "friends": [],
    "availabilities": [],
    "hasDriverLicense": true,
    "hasPayedContribution": false
  },
  {
    "_id": "61c2d2f6ff79940010d519a5",
    "firstname": "Leo",
    "lastname": "Mouyna",
    "nickname": "Shagasse",
    "email": "mouynaleo@gmail.com",
    "phone": 624302653,
    "team": [
      "hard"
    ],
    "friends": [],
    "availabilities": [],
    "hasDriverLicense": true,
    "hasPayedContribution": false
  },
  {
    "_id": "61d1cfe45ed47400108e4628",
    "firstname": "lou",
    "lastname": "vendittelli",
    "nickname": "chaaatte",
    "email": "lou.vendittelli@gmail.com",
    "phone": 651487627,
    "team": [
      "hard",
      "orga",
      "maman"
    ],
    "friends": [],
    "availabilities": [],
    "hasDriverLicense": true,
    "hasPayedContribution": false
  },
  {
    "_id": "61d2f0f45ed47400108e4a18",
    "firstname": "Colin",
    "lastname": "Carrere",
    "nickname": "Coco",
    "email": "colincarrere007@gmail.com",
    "phone": 766169341,
    "team": [
      "admin",
      "hard"
    ],
    "friends": [],
    "availabilities": [],
    "hasDriverLicense": false,
    "hasPayedContribution": false
  },
  {
    "_id": "61d32ad55ed47400108e4ba7",
    "firstname": "Elsa",
    "lastname": "Pruvost",
    "nickname": "Zael",
    "email": "pruvost.elsa@gmail.com",
    "phone": 652605261,
    "team": [
      "hard",
      "admin"
    ],
    "friends": [],
    "availabilities": [],
    "hasDriverLicense": true,
    "hasPayedContribution": false
  }
]