(kicad_sch (version 20211123) (generator eeschema)

  (uuid 50bf44fc-e3ad-40cd-8f84-d1a9300d72bd)

  (paper "A4")

  (lib_symbols
    (symbol "Device:R" (pin_numbers hide) (pin_names (offset 0)) (in_bom yes) (on_board yes)
      (property "Reference" "R" (id 0) (at 2.032 0 90)
        (effects (font (size 1.27 1.27)))
      )
      (property "Value" "R" (id 1) (at 0 0 90)
        (effects (font (size 1.27 1.27)))
      )
      (property "Footprint" "" (id 2) (at -1.778 0 90)
        (effects (font (size 1.27 1.27)) hide)
      )
      (property "Datasheet" "~" (id 3) (at 0 0 0)
        (effects (font (size 1.27 1.27)) hide)
      )
      (property "ki_keywords" "R res resistor" (id 4) (at 0 0 0)
        (effects (font (size 1.27 1.27)) hide)
      )
      (property "ki_description" "Resistor" (id 5) (at 0 0 0)
        (effects (font (size 1.27 1.27)) hide)
      )
      (property "ki_fp_filters" "R_*" (id 6) (at 0 0 0)
        (effects (font (size 1.27 1.27)) hide)
      )
      (symbol "R_0_1"
        (rectangle (start -1.016 -2.54) (end 1.016 2.54)
          (stroke (width 0.254) (type default) (color 0 0 0 0))
          (fill (type none))
        )
      )
      (symbol "R_1_1"
        (pin passive line (at 0 3.81 270) (length 1.27)
          (name "~" (effects (font (size 1.27 1.27))))
          (number "1" (effects (font (size 1.27 1.27))))
        )
        (pin passive line (at 0 -3.81 90) (length 1.27)
          (name "~" (effects (font (size 1.27 1.27))))
          (number "2" (effects (font (size 1.27 1.27))))
        )
      )
    )
    (symbol "Diode:1N5822" (pin_numbers hide) (pin_names (offset 1.016) hide) (in_bom yes) (on_board yes)
      (property "Reference" "D" (id 0) (at 0 2.54 0)
        (effects (font (size 1.27 1.27)))
      )
      (property "Value" "1N5822" (id 1) (at 0 -2.54 0)
        (effects (font (size 1.27 1.27)))
      )
      (property "Footprint" "Diode_THT:D_DO-201AD_P15.24mm_Horizontal" (id 2) (at 0 -4.445 0)
        (effects (font (size 1.27 1.27)) hide)
      )
      (property "Datasheet" "http://www.vishay.com/docs/88526/1n5820.pdf" (id 3) (at 0 0 0)
        (effects (font (size 1.27 1.27)) hide)
      )
      (property "ki_keywords" "diode Schottky" (id 4) (at 0 0 0)
        (effects (font (size 1.27 1.27)) hide)
      )
      (property "ki_description" "40V 3A Schottky Barrier Rectifier Diode, DO-201AD" (id 5) (at 0 0 0)
        (effects (font (size 1.27 1.27)) hide)
      )
      (property "ki_fp_filters" "D*DO?201AD*" (id 6) (at 0 0 0)
        (effects (font (size 1.27 1.27)) hide)
      )
      (symbol "1N5822_0_1"
        (polyline
          (pts
            (xy 1.27 0)
            (xy -1.27 0)
          )
          (stroke (width 0) (type default) (color 0 0 0 0))
          (fill (type none))
        )
        (polyline
          (pts
            (xy 1.27 1.27)
            (xy 1.27 -1.27)
            (xy -1.27 0)
            (xy 1.27 1.27)
          )
          (stroke (width 0.254) (type default) (color 0 0 0 0))
          (fill (type none))
        )
        (polyline
          (pts
            (xy -1.905 0.635)
            (xy -1.905 1.27)
            (xy -1.27 1.27)
            (xy -1.27 -1.27)
            (xy -0.635 -1.27)
            (xy -0.635 -0.635)
          )
          (stroke (width 0.254) (type default) (color 0 0 0 0))
          (fill (type none))
        )
      )
      (symbol "1N5822_1_1"
        (pin passive line (at -3.81 0 0) (length 2.54)
          (name "K" (effects (font (size 1.27 1.27))))
          (number "1" (effects (font (size 1.27 1.27))))
        )
        (pin passive line (at 3.81 0 180) (length 2.54)
          (name "A" (effects (font (size 1.27 1.27))))
          (number "2" (effects (font (size 1.27 1.27))))
        )
      )
    )
    (symbol "Isolator:PC817" (pin_names (offset 1.016)) (in_bom yes) (on_board yes)
      (property "Reference" "U" (id 0) (at -5.08 5.08 0)
        (effects (font (size 1.27 1.27)) (justify left))
      )
      (property "Value" "PC817" (id 1) (at 0 5.08 0)
        (effects (font (size 1.27 1.27)) (justify left))
      )
      (property "Footprint" "Package_DIP:DIP-4_W7.62mm" (id 2) (at -5.08 -5.08 0)
        (effects (font (size 1.27 1.27) italic) (justify left) hide)
      )
      (property "Datasheet" "http://www.soselectronic.cz/a_info/resource/d/pc817.pdf" (id 3) (at 0 0 0)
        (effects (font (size 1.27 1.27)) (justify left) hide)
      )
      (property "ki_keywords" "NPN DC Optocoupler" (id 4) (at 0 0 0)
        (effects (font (size 1.27 1.27)) hide)
      )
      (property "ki_description" "DC Optocoupler, Vce 35V, CTR 50-300%, DIP-4" (id 5) (at 0 0 0)
        (effects (font (size 1.27 1.27)) hide)
      )
      (property "ki_fp_filters" "DIP*W7.62mm*" (id 6) (at 0 0 0)
        (effects (font (size 1.27 1.27)) hide)
      )
      (symbol "PC817_0_1"
        (rectangle (start -5.08 3.81) (end 5.08 -3.81)
          (stroke (width 0.254) (type default) (color 0 0 0 0))
          (fill (type background))
        )
        (polyline
          (pts
            (xy -3.175 -0.635)
            (xy -1.905 -0.635)
          )
          (stroke (width 0.254) (type default) (color 0 0 0 0))
          (fill (type none))
        )
        (polyline
          (pts
            (xy 2.54 0.635)
            (xy 4.445 2.54)
          )
          (stroke (width 0) (type default) (color 0 0 0 0))
          (fill (type none))
        )
        (polyline
          (pts
            (xy 4.445 -2.54)
            (xy 2.54 -0.635)
          )
          (stroke (width 0) (type default) (color 0 0 0 0))
          (fill (type outline))
        )
        (polyline
          (pts
            (xy 4.445 -2.54)
            (xy 5.08 -2.54)
          )
          (stroke (width 0) (type default) (color 0 0 0 0))
          (fill (type none))
        )
        (polyline
          (pts
            (xy 4.445 2.54)
            (xy 5.08 2.54)
          )
          (stroke (width 0) (type default) (color 0 0 0 0))
          (fill (type none))
        )
        (polyline
          (pts
            (xy -5.08 2.54)
            (xy -2.54 2.54)
            (xy -2.54 -0.635)
          )
          (stroke (width 0) (type default) (color 0 0 0 0))
          (fill (type none))
        )
        (polyline
          (pts
            (xy -2.54 -0.635)
            (xy -2.54 -2.54)
            (xy -5.08 -2.54)
          )
          (stroke (width 0) (type default) (color 0 0 0 0))
          (fill (type none))
        )
        (polyline
          (pts
            (xy 2.54 1.905)
            (xy 2.54 -1.905)
            (xy 2.54 -1.905)
          )
          (stroke (width 0.508) (type default) (color 0 0 0 0))
          (fill (type none))
        )
        (polyline
          (pts
            (xy -2.54 -0.635)
            (xy -3.175 0.635)
            (xy -1.905 0.635)
            (xy -2.54 -0.635)
          )
          (stroke (width 0.254) (type default) (color 0 0 0 0))
          (fill (type none))
        )
        (polyline
          (pts
            (xy -0.508 -0.508)
            (xy 0.762 -0.508)
            (xy 0.381 -0.635)
            (xy 0.381 -0.381)
            (xy 0.762 -0.508)
          )
          (stroke (width 0) (type default) (color 0 0 0 0))
          (fill (type none))
        )
        (polyline
          (pts
            (xy -0.508 0.508)
            (xy 0.762 0.508)
            (xy 0.381 0.381)
            (xy 0.381 0.635)
            (xy 0.762 0.508)
          )
          (stroke (width 0) (type default) (color 0 0 0 0))
          (fill (type none))
        )
        (polyline
          (pts
            (xy 3.048 -1.651)
            (xy 3.556 -1.143)
            (xy 4.064 -2.159)
            (xy 3.048 -1.651)
            (xy 3.048 -1.651)
          )
          (stroke (width 0) (type default) (color 0 0 0 0))
          (fill (type outline))
        )
      )
      (symbol "PC817_1_1"
        (pin passive line (at -7.62 2.54 0) (length 2.54)
          (name "~" (effects (font (size 1.27 1.27))))
          (number "1" (effects (font (size 1.27 1.27))))
        )
        (pin passive line (at -7.62 -2.54 0) (length 2.54)
          (name "~" (effects (font (size 1.27 1.27))))
          (number "2" (effects (font (size 1.27 1.27))))
        )
        (pin passive line (at 7.62 -2.54 180) (length 2.54)
          (name "~" (effects (font (size 1.27 1.27))))
          (number "3" (effects (font (size 1.27 1.27))))
        )
        (pin passive line (at 7.62 2.54 180) (length 2.54)
          (name "~" (effects (font (size 1.27 1.27))))
          (number "4" (effects (font (size 1.27 1.27))))
        )
      )
    )
    (symbol "Transistor_FET:IRLZ44N" (pin_names hide) (in_bom yes) (on_board yes)
      (property "Reference" "Q" (id 0) (at 6.35 1.905 0)
        (effects (font (size 1.27 1.27)) (justify left))
      )
      (property "Value" "IRLZ44N" (id 1) (at 6.35 0 0)
        (effects (font (size 1.27 1.27)) (justify left))
      )
      (property "Footprint" "Package_TO_SOT_THT:TO-220-3_Vertical" (id 2) (at 6.35 -1.905 0)
        (effects (font (size 1.27 1.27) italic) (justify left) hide)
      )
      (property "Datasheet" "http://www.irf.com/product-info/datasheets/data/irlz44n.pdf" (id 3) (at 0 0 0)
        (effects (font (size 1.27 1.27)) (justify left) hide)
      )
      (property "ki_keywords" "N-Channel HEXFET MOSFET Logic-Level" (id 4) (at 0 0 0)
        (effects (font (size 1.27 1.27)) hide)
      )
      (property "ki_description" "47A Id, 55V Vds, 22mOhm Rds Single N-Channel HEXFET Power MOSFET, TO-220AB" (id 5) (at 0 0 0)
        (effects (font (size 1.27 1.27)) hide)
      )
      (property "ki_fp_filters" "TO?220*" (id 6) (at 0 0 0)
        (effects (font (size 1.27 1.27)) hide)
      )
      (symbol "IRLZ44N_0_1"
        (polyline
          (pts
            (xy 0.254 0)
            (xy -2.54 0)
          )
          (stroke (width 0) (type default) (color 0 0 0 0))
          (fill (type none))
        )
        (polyline
          (pts
            (xy 0.254 1.905)
            (xy 0.254 -1.905)
          )
          (stroke (width 0.254) (type default) (color 0 0 0 0))
          (fill (type none))
        )
        (polyline
          (pts
            (xy 0.762 -1.27)
            (xy 0.762 -2.286)
          )
          (stroke (width 0.254) (type default) (color 0 0 0 0))
          (fill (type none))
        )
        (polyline
          (pts
            (xy 0.762 0.508)
            (xy 0.762 -0.508)
          )
          (stroke (width 0.254) (type default) (color 0 0 0 0))
          (fill (type none))
        )
        (polyline
          (pts
            (xy 0.762 2.286)
            (xy 0.762 1.27)
          )
          (stroke (width 0.254) (type default) (color 0 0 0 0))
          (fill (type none))
        )
        (polyline
          (pts
            (xy 2.54 2.54)
            (xy 2.54 1.778)
          )
          (stroke (width 0) (type default) (color 0 0 0 0))
          (fill (type none))
        )
        (polyline
          (pts
            (xy 2.54 -2.54)
            (xy 2.54 0)
            (xy 0.762 0)
          )
          (stroke (width 0) (type default) (color 0 0 0 0))
          (fill (type none))
        )
        (polyline
          (pts
            (xy 0.762 -1.778)
            (xy 3.302 -1.778)
            (xy 3.302 1.778)
            (xy 0.762 1.778)
          )
          (stroke (width 0) (type default) (color 0 0 0 0))
          (fill (type none))
        )
        (polyline
          (pts
            (xy 1.016 0)
            (xy 2.032 0.381)
            (xy 2.032 -0.381)
            (xy 1.016 0)
          )
          (stroke (width 0) (type default) (color 0 0 0 0))
          (fill (type outline))
        )
        (polyline
          (pts
            (xy 2.794 0.508)
            (xy 2.921 0.381)
            (xy 3.683 0.381)
            (xy 3.81 0.254)
          )
          (stroke (width 0) (type default) (color 0 0 0 0))
          (fill (type none))
        )
        (polyline
          (pts
            (xy 3.302 0.381)
            (xy 2.921 -0.254)
            (xy 3.683 -0.254)
            (xy 3.302 0.381)
          )
          (stroke (width 0) (type default) (color 0 0 0 0))
          (fill (type none))
        )
        (circle (center 1.651 0) (radius 2.794)
          (stroke (width 0.254) (type default) (color 0 0 0 0))
          (fill (type none))
        )
        (circle (center 2.54 -1.778) (radius 0.254)
          (stroke (width 0) (type default) (color 0 0 0 0))
          (fill (type outline))
        )
        (circle (center 2.54 1.778) (radius 0.254)
          (stroke (width 0) (type default) (color 0 0 0 0))
          (fill (type outline))
        )
      )
      (symbol "IRLZ44N_1_1"
        (pin input line (at -5.08 0 0) (length 2.54)
          (name "G" (effects (font (size 1.27 1.27))))
          (number "1" (effects (font (size 1.27 1.27))))
        )
        (pin passive line (at 2.54 5.08 270) (length 2.54)
          (name "D" (effects (font (size 1.27 1.27))))
          (number "2" (effects (font (size 1.27 1.27))))
        )
        (pin passive line (at 2.54 -5.08 90) (length 2.54)
          (name "S" (effects (font (size 1.27 1.27))))
          (number "3" (effects (font (size 1.27 1.27))))
        )
      )
    )
    (symbol "modules:TP4056-MODULE - BUCK" (in_bom yes) (on_board yes)
      (property "Reference" "U" (id 0) (at 0 0 0)
        (effects (font (size 1.27 1.27)))
      )
      (property "Value" "TP4056-MODULE - BUCK" (id 1) (at 0 2.54 0)
        (effects (font (size 1.27 1.27)))
      )
      (property "Footprint" "" (id 2) (at 0 0 0)
        (effects (font (size 1.27 1.27)) hide)
      )
      (property "Datasheet" "" (id 3) (at 0 0 0)
        (effects (font (size 1.27 1.27)) hide)
      )
      (symbol "TP4056-MODULE - BUCK_0_1"
        (rectangle (start 7.62 -13.97) (end -7.62 -1.27)
          (stroke (width 0) (type default) (color 0 0 0 0))
          (fill (type none))
        )
      )
      (symbol "TP4056-MODULE - BUCK_1_1"
        (pin input line (at -10.16 -8.89 0) (length 2.54)
          (name "BAT+" (effects (font (size 1.27 1.27))))
          (number "" (effects (font (size 1.27 1.27))))
        )
        (pin input line (at -10.16 -11.43 0) (length 2.54)
          (name "BAT-" (effects (font (size 1.27 1.27))))
          (number "" (effects (font (size 1.27 1.27))))
        )
        (pin input line (at -10.16 -2.54 0) (length 2.54)
          (name "IN+" (effects (font (size 1.27 1.27))))
          (number "" (effects (font (size 1.27 1.27))))
        )
        (pin input line (at -10.16 -5.08 0) (length 2.54)
          (name "IN-" (effects (font (size 1.27 1.27))))
          (number "" (effects (font (size 1.27 1.27))))
        )
        (pin output line (at 10.16 -6.35 180) (length 2.54)
          (name "Vout+" (effects (font (size 1.27 1.27))))
          (number "" (effects (font (size 1.27 1.27))))
        )
        (pin output line (at 10.16 -8.89 180) (length 2.54)
          (name "Vout-" (effects (font (size 1.27 1.27))))
          (number "" (effects (font (size 1.27 1.27))))
        )
      )
    )
    (symbol "power:GND" (power) (pin_names (offset 0)) (in_bom yes) (on_board yes)
      (property "Reference" "#PWR" (id 0) (at 0 -6.35 0)
        (effects (font (size 1.27 1.27)) hide)
      )
      (property "Value" "GND" (id 1) (at 0 -3.81 0)
        (effects (font (size 1.27 1.27)))
      )
      (property "Footprint" "" (id 2) (at 0 0 0)
        (effects (font (size 1.27 1.27)) hide)
      )
      (property "Datasheet" "" (id 3) (at 0 0 0)
        (effects (font (size 1.27 1.27)) hide)
      )
      (property "ki_keywords" "power-flag" (id 4) (at 0 0 0)
        (effects (font (size 1.27 1.27)) hide)
      )
      (property "ki_description" "Power symbol creates a global label with name \"GND\" , ground" (id 5) (at 0 0 0)
        (effects (font (size 1.27 1.27)) hide)
      )
      (symbol "GND_0_1"
        (polyline
          (pts
            (xy 0 0)
            (xy 0 -1.27)
            (xy 1.27 -1.27)
            (xy 0 -2.54)
            (xy -1.27 -1.27)
            (xy 0 -1.27)
          )
          (stroke (width 0) (type default) (color 0 0 0 0))
          (fill (type none))
        )
      )
      (symbol "GND_1_1"
        (pin power_in line (at 0 0 270) (length 0) hide
          (name "GND" (effects (font (size 1.27 1.27))))
          (number "1" (effects (font (size 1.27 1.27))))
        )
      )
    )
  )

  (junction (at 160.02 101.6) (diameter 0) (color 0 0 0 0)
    (uuid 5a74f537-bb63-4576-af0b-dfc4fc878b3b)
  )
  (junction (at 127 99.06) (diameter 0) (color 0 0 0 0)
    (uuid 75e84725-7201-4c50-b1a0-88e3a30903e4)
  )
  (junction (at 129.54 77.47) (diameter 0) (color 0 0 0 0)
    (uuid 80e082fa-d596-41e6-9138-0763418c87db)
  )
  (junction (at 146.05 67.31) (diameter 0) (color 0 0 0 0)
    (uuid 8205509c-43a9-4456-a754-b3d1290c1c83)
  )
  (junction (at 160.02 106.68) (diameter 0) (color 0 0 0 0)
    (uuid cc96d85f-3917-47ce-aa67-3facb765aa29)
  )
  (junction (at 102.87 68.58) (diameter 0) (color 0 0 0 0)
    (uuid e5c8fd7b-1ef5-4d3d-80cb-23c8691b67ce)
  )

  (wire (pts (xy 160.02 101.6) (xy 163.83 101.6))
    (stroke (width 0) (type default) (color 0 0 0 0))
    (uuid 0cae1ecc-1500-4b88-be07-94a359dc0c17)
  )
  (wire (pts (xy 146.05 67.31) (xy 146.05 68.58))
    (stroke (width 0) (type default) (color 0 0 0 0))
    (uuid 107ac57e-8b12-4d1c-997d-5ac639bcd78e)
  )
  (wire (pts (xy 123.19 92.71) (xy 127 92.71))
    (stroke (width 0) (type default) (color 0 0 0 0))
    (uuid 2150ab02-5bc7-4733-aeca-ea143b680285)
  )
  (wire (pts (xy 160.02 95.25) (xy 163.83 95.25))
    (stroke (width 0) (type default) (color 0 0 0 0))
    (uuid 30bbb195-e948-4f70-b58c-c4be047826ca)
  )
  (wire (pts (xy 127 92.71) (xy 127 99.06))
    (stroke (width 0) (type default) (color 0 0 0 0))
    (uuid 495f936e-93c0-4486-acea-386d0f2c2038)
  )
  (wire (pts (xy 185.42 99.06) (xy 185.42 106.68))
    (stroke (width 0) (type default) (color 0 0 0 0))
    (uuid 4ce3c2fe-6799-49c9-ab92-b7e3b9447b10)
  )
  (wire (pts (xy 146.05 53.34) (xy 146.05 57.15))
    (stroke (width 0) (type default) (color 0 0 0 0))
    (uuid 4de96cd0-6e63-46c8-8fbe-d4005c164031)
  )
  (wire (pts (xy 127 99.06) (xy 127 106.68))
    (stroke (width 0) (type default) (color 0 0 0 0))
    (uuid 555b1f0d-a044-46b7-97f1-0515e7124b1b)
  )
  (wire (pts (xy 129.54 73.66) (xy 129.54 77.47))
    (stroke (width 0) (type default) (color 0 0 0 0))
    (uuid 6e25e58d-7d64-40bc-8e6d-9a6f6415defe)
  )
  (wire (pts (xy 95.25 68.58) (xy 102.87 68.58))
    (stroke (width 0) (type default) (color 0 0 0 0))
    (uuid 71fcff1f-ff86-457e-93b3-494f298edbf0)
  )
  (wire (pts (xy 157.48 99.06) (xy 163.83 99.06))
    (stroke (width 0) (type default) (color 0 0 0 0))
    (uuid 721df915-4945-44b5-b0a7-78818202d6d3)
  )
  (wire (pts (xy 146.05 68.58) (xy 144.78 68.58))
    (stroke (width 0) (type default) (color 0 0 0 0))
    (uuid 7db2676d-febc-4027-8e18-fa78b7d8e6e5)
  )
  (wire (pts (xy 146.05 67.31) (xy 148.59 67.31))
    (stroke (width 0) (type default) (color 0 0 0 0))
    (uuid 7f9bd960-9499-49af-9778-c452540c5376)
  )
  (wire (pts (xy 106.68 97.79) (xy 109.22 97.79))
    (stroke (width 0) (type default) (color 0 0 0 0))
    (uuid 82d31532-b960-45bc-b7e6-772a07a8618d)
  )
  (wire (pts (xy 95.25 106.68) (xy 101.6 106.68))
    (stroke (width 0) (type default) (color 0 0 0 0))
    (uuid 865ab2bf-9b8c-4e40-b11e-e77eedd0a371)
  )
  (wire (pts (xy 102.87 68.58) (xy 102.87 92.71))
    (stroke (width 0) (type default) (color 0 0 0 0))
    (uuid 89727264-ef8c-40e4-8b3a-52bdf9826943)
  )
  (wire (pts (xy 184.15 99.06) (xy 185.42 99.06))
    (stroke (width 0) (type default) (color 0 0 0 0))
    (uuid 8984014c-f128-49c1-9eb4-45bef24a5886)
  )
  (wire (pts (xy 146.05 64.77) (xy 146.05 67.31))
    (stroke (width 0) (type default) (color 0 0 0 0))
    (uuid 8b3fc58a-ab73-4172-a8e7-b74de2bcf25e)
  )
  (wire (pts (xy 160.02 101.6) (xy 160.02 106.68))
    (stroke (width 0) (type default) (color 0 0 0 0))
    (uuid 952ec016-d636-4630-a0b0-4bbc03e569c2)
  )
  (wire (pts (xy 144.78 73.66) (xy 146.05 73.66))
    (stroke (width 0) (type default) (color 0 0 0 0))
    (uuid a7729a60-fb3b-40df-aa4a-24b70f22206a)
  )
  (wire (pts (xy 160.02 106.68) (xy 185.42 106.68))
    (stroke (width 0) (type default) (color 0 0 0 0))
    (uuid a9117aa1-4387-477f-9a47-b548dd91d7ad)
  )
  (wire (pts (xy 116.84 68.58) (xy 129.54 68.58))
    (stroke (width 0) (type default) (color 0 0 0 0))
    (uuid b23372e8-727f-4be2-9d83-38018865dbad)
  )
  (wire (pts (xy 123.19 106.68) (xy 127 106.68))
    (stroke (width 0) (type default) (color 0 0 0 0))
    (uuid bb7a0d5a-1bc7-4818-81a8-09a84ff94f10)
  )
  (wire (pts (xy 127 99.06) (xy 132.08 99.06))
    (stroke (width 0) (type default) (color 0 0 0 0))
    (uuid be506d01-4fb1-4818-aa15-8bff3d8add99)
  )
  (wire (pts (xy 106.68 99.06) (xy 106.68 97.79))
    (stroke (width 0) (type default) (color 0 0 0 0))
    (uuid bf986845-c5b0-4528-999f-c839244f40ba)
  )
  (wire (pts (xy 160.02 95.25) (xy 160.02 101.6))
    (stroke (width 0) (type default) (color 0 0 0 0))
    (uuid cca85874-6ab0-4e57-ad06-f91b8f453cfa)
  )
  (wire (pts (xy 129.54 77.47) (xy 129.54 78.74))
    (stroke (width 0) (type default) (color 0 0 0 0))
    (uuid ccf7bbff-d539-4ec0-afc4-3b912c46f20f)
  )
  (wire (pts (xy 129.54 77.47) (xy 146.05 77.47))
    (stroke (width 0) (type default) (color 0 0 0 0))
    (uuid cfea211b-4310-4b08-94d7-481273d5088c)
  )
  (wire (pts (xy 102.87 68.58) (xy 109.22 68.58))
    (stroke (width 0) (type default) (color 0 0 0 0))
    (uuid d4c8b9dc-ed58-4c87-bc2e-9610df1cde63)
  )
  (wire (pts (xy 160.02 106.68) (xy 160.02 107.95))
    (stroke (width 0) (type default) (color 0 0 0 0))
    (uuid da3add20-d975-4a34-9940-91a966a6201c)
  )
  (wire (pts (xy 146.05 77.47) (xy 146.05 73.66))
    (stroke (width 0) (type default) (color 0 0 0 0))
    (uuid e4a99aaa-104b-45d3-8c7e-025e9a9573f0)
  )
  (wire (pts (xy 111.76 106.68) (xy 115.57 106.68))
    (stroke (width 0) (type default) (color 0 0 0 0))
    (uuid eb6e344c-2825-4d5a-9f76-b4d4ef37c292)
  )
  (wire (pts (xy 102.87 92.71) (xy 115.57 92.71))
    (stroke (width 0) (type default) (color 0 0 0 0))
    (uuid f10fdec1-81a1-4f94-84c7-278accfc04ea)
  )
  (wire (pts (xy 157.48 92.71) (xy 163.83 92.71))
    (stroke (width 0) (type default) (color 0 0 0 0))
    (uuid fa9ebd86-fc95-4eb2-a6db-baeeb4bcd15d)
  )

  (label "Supply+" (at 132.08 99.06 0)
    (effects (font (size 1.27 1.27)) (justify left bottom))
    (uuid 05d5fafc-c56f-4d2b-9c93-4482e759864d)
  )
  (label "Supply+" (at 157.48 92.71 180)
    (effects (font (size 1.27 1.27)) (justify right bottom))
    (uuid 2a9047db-7c4d-48e4-bef1-48cc155c64c5)
  )
  (label "CHANGE_SUPPLY" (at 109.22 97.79 0)
    (effects (font (size 1.27 1.27)) (justify left bottom))
    (uuid 318b40e8-2c38-4261-a149-f06812e3ec92)
  )
  (label "+Bat" (at 157.48 99.06 180)
    (effects (font (size 1.27 1.27)) (justify right bottom))
    (uuid 55718ec6-b736-4767-9f00-7f19ac456e3b)
  )
  (label "Sys-" (at 184.15 99.06 0)
    (effects (font (size 1.27 1.27)) (justify left bottom))
    (uuid 6d23dfec-0bb2-4f13-8d56-4229a1f3150c)
  )
  (label "CHANGE_SUPPLY" (at 148.59 67.31 0)
    (effects (font (size 1.27 1.27)) (justify left bottom))
    (uuid 7c93f000-9c60-4434-bd10-3b93e9ff0790)
  )
  (label "Sys+" (at 146.05 53.34 0)
    (effects (font (size 1.27 1.27)) (justify left bottom))
    (uuid 7f4c061a-2244-4649-a704-6dc7e3df889c)
  )
  (label "+Panel" (at 95.25 106.68 180)
    (effects (font (size 1.27 1.27)) (justify right bottom))
    (uuid 89ca2e05-fc96-4567-aee6-41f19690646b)
  )
  (label "+Vin" (at 95.25 68.58 180)
    (effects (font (size 1.27 1.27)) (justify right bottom))
    (uuid c1b02523-7c34-45f8-b572-ff74c3b4111e)
  )
  (label "Sys+" (at 184.15 96.52 0)
    (effects (font (size 1.27 1.27)) (justify left bottom))
    (uuid e18cef0d-4d42-4b76-8342-69be078b3888)
  )

  (symbol (lib_id "Device:R") (at 146.05 60.96 0) (unit 1)
    (in_bom yes) (on_board yes) (fields_autoplaced)
    (uuid 00fdef5d-b387-4ea1-b358-fa34ca1bbe59)
    (property "Reference" "R?" (id 0) (at 148.59 59.6899 0)
      (effects (font (size 1.27 1.27)) (justify left))
    )
    (property "Value" "1k" (id 1) (at 148.59 62.2299 0)
      (effects (font (size 1.27 1.27)) (justify left))
    )
    (property "Footprint" "" (id 2) (at 144.272 60.96 90)
      (effects (font (size 1.27 1.27)) hide)
    )
    (property "Datasheet" "~" (id 3) (at 146.05 60.96 0)
      (effects (font (size 1.27 1.27)) hide)
    )
    (pin "1" (uuid 51a6b804-55df-48b8-9062-fccd63a08734))
    (pin "2" (uuid 8e5fc375-52f3-4b07-b945-7686eb5d62c3))
  )

  (symbol (lib_id "Diode:1N5822") (at 119.38 106.68 180) (unit 1)
    (in_bom yes) (on_board yes) (fields_autoplaced)
    (uuid 12907fda-9563-4e4f-82cd-cdc8436f7d8b)
    (property "Reference" "D?" (id 0) (at 119.6975 100.33 0))
    (property "Value" "1N5822" (id 1) (at 119.6975 102.87 0))
    (property "Footprint" "Diode_THT:D_DO-201AD_P15.24mm_Horizontal" (id 2) (at 119.38 102.235 0)
      (effects (font (size 1.27 1.27)) hide)
    )
    (property "Datasheet" "http://www.vishay.com/docs/88526/1n5820.pdf" (id 3) (at 119.38 106.68 0)
      (effects (font (size 1.27 1.27)) hide)
    )
    (pin "1" (uuid a60d54fa-ed3b-4d0e-b923-695309d20b63))
    (pin "2" (uuid 99fdfad5-3799-46fa-8fd1-21f9a6ba7868))
  )

  (symbol (lib_id "modules:TP4056-MODULE - BUCK") (at 173.99 90.17 0) (unit 1)
    (in_bom yes) (on_board yes) (fields_autoplaced)
    (uuid 15e53760-e6cc-4766-90d7-d2bd2dacdde4)
    (property "Reference" "U?" (id 0) (at 173.99 86.36 0))
    (property "Value" "TP4056-MODULE - BUCK" (id 1) (at 173.99 88.9 0))
    (property "Footprint" "" (id 2) (at 173.99 90.17 0)
      (effects (font (size 1.27 1.27)) hide)
    )
    (property "Datasheet" "" (id 3) (at 173.99 90.17 0)
      (effects (font (size 1.27 1.27)) hide)
    )
    (pin "" (uuid 7a88b9b3-bac2-4067-aef4-393bd2b9f548))
    (pin "" (uuid d90fa7da-a115-4037-8b70-493a7df309cb))
    (pin "" (uuid c67a99ba-12e3-4d75-8811-943dc32420ac))
    (pin "" (uuid d34c65e2-86c8-4b5f-a9cc-fef618cd8dce))
    (pin "" (uuid 72fff205-6571-4803-a5f5-1c3c28edd1ef))
    (pin "" (uuid c20ee66c-747c-47e8-83a3-7b615ee25779))
  )

  (symbol (lib_id "Transistor_FET:IRLZ44N") (at 106.68 104.14 90) (mirror x) (unit 1)
    (in_bom yes) (on_board yes) (fields_autoplaced)
    (uuid 3fcda4e6-eb82-47f4-8dd1-83ae5e5fda16)
    (property "Reference" "Q?" (id 0) (at 106.68 111.76 90))
    (property "Value" "IRLZ44N" (id 1) (at 106.68 114.3 90))
    (property "Footprint" "Package_TO_SOT_THT:TO-220-3_Vertical" (id 2) (at 108.585 110.49 0)
      (effects (font (size 1.27 1.27) italic) (justify left) hide)
    )
    (property "Datasheet" "http://www.irf.com/product-info/datasheets/data/irlz44n.pdf" (id 3) (at 106.68 104.14 0)
      (effects (font (size 1.27 1.27)) (justify left) hide)
    )
    (pin "1" (uuid f64add66-43f7-4655-8b86-6b845671950b))
    (pin "2" (uuid d625ebdf-64e4-486e-ba6d-f7dd09df1dcf))
    (pin "3" (uuid 813f34a2-1fe0-42e6-bfd6-d7a315ab9850))
  )

  (symbol (lib_id "Diode:1N5822") (at 119.38 92.71 180) (unit 1)
    (in_bom yes) (on_board yes) (fields_autoplaced)
    (uuid 4e70c583-2ac0-4d42-b4c1-0bacbbb1d502)
    (property "Reference" "D?" (id 0) (at 119.6975 86.36 0))
    (property "Value" "1N5822" (id 1) (at 119.6975 88.9 0))
    (property "Footprint" "Diode_THT:D_DO-201AD_P15.24mm_Horizontal" (id 2) (at 119.38 88.265 0)
      (effects (font (size 1.27 1.27)) hide)
    )
    (property "Datasheet" "http://www.vishay.com/docs/88526/1n5820.pdf" (id 3) (at 119.38 92.71 0)
      (effects (font (size 1.27 1.27)) hide)
    )
    (pin "1" (uuid 88530016-d8c1-439d-8d5e-75d1705ea2a3))
    (pin "2" (uuid 8ad14775-c363-421c-a8b1-1611dd8bf21d))
  )

  (symbol (lib_id "power:GND") (at 160.02 107.95 0) (unit 1)
    (in_bom yes) (on_board yes) (fields_autoplaced)
    (uuid 8d9df0c3-0c8d-45e2-9b59-236ffd1e1d44)
    (property "Reference" "#PWR?" (id 0) (at 160.02 114.3 0)
      (effects (font (size 1.27 1.27)) hide)
    )
    (property "Value" "GND" (id 1) (at 160.02 113.03 0))
    (property "Footprint" "" (id 2) (at 160.02 107.95 0)
      (effects (font (size 1.27 1.27)) hide)
    )
    (property "Datasheet" "" (id 3) (at 160.02 107.95 0)
      (effects (font (size 1.27 1.27)) hide)
    )
    (pin "1" (uuid 4b694c41-4ab4-49c8-8fc7-c0ca653d453c))
  )

  (symbol (lib_id "power:GND") (at 129.54 78.74 0) (unit 1)
    (in_bom yes) (on_board yes) (fields_autoplaced)
    (uuid 9e4bf25f-0cf5-427c-bf0b-af10ecfe9617)
    (property "Reference" "#PWR?" (id 0) (at 129.54 85.09 0)
      (effects (font (size 1.27 1.27)) hide)
    )
    (property "Value" "GND" (id 1) (at 129.54 83.82 0))
    (property "Footprint" "" (id 2) (at 129.54 78.74 0)
      (effects (font (size 1.27 1.27)) hide)
    )
    (property "Datasheet" "" (id 3) (at 129.54 78.74 0)
      (effects (font (size 1.27 1.27)) hide)
    )
    (pin "1" (uuid 2edd2021-8028-40ab-af0c-4952994011e4))
  )

  (symbol (lib_id "Isolator:PC817") (at 137.16 71.12 0) (unit 1)
    (in_bom yes) (on_board yes)
    (uuid a0827b16-7e49-4319-ac0c-5570f85363ab)
    (property "Reference" "U?" (id 0) (at 137.16 73.66 0))
    (property "Value" "PC817" (id 1) (at 137.16 66.04 0))
    (property "Footprint" "Package_DIP:DIP-4_W7.62mm" (id 2) (at 132.08 76.2 0)
      (effects (font (size 1.27 1.27) italic) (justify left) hide)
    )
    (property "Datasheet" "http://www.soselectronic.cz/a_info/resource/d/pc817.pdf" (id 3) (at 137.16 71.12 0)
      (effects (font (size 1.27 1.27)) (justify left) hide)
    )
    (pin "1" (uuid cb02f0fd-0438-4679-b748-b69329fa57ed))
    (pin "2" (uuid 8bbe7b28-0a73-436f-afb2-842e0a620196))
    (pin "3" (uuid 6011275c-adc3-4cbf-87d0-b66f25eae8a5))
    (pin "4" (uuid 3e6bfcfb-041f-415a-ad90-bd40064252f9))
  )

  (symbol (lib_id "Device:R") (at 113.03 68.58 90) (unit 1)
    (in_bom yes) (on_board yes) (fields_autoplaced)
    (uuid da73626b-2938-4cd4-9036-eeb811e7907b)
    (property "Reference" "R?" (id 0) (at 113.03 62.23 90))
    (property "Value" "180" (id 1) (at 113.03 64.77 90))
    (property "Footprint" "" (id 2) (at 113.03 70.358 90)
      (effects (font (size 1.27 1.27)) hide)
    )
    (property "Datasheet" "~" (id 3) (at 113.03 68.58 0)
      (effects (font (size 1.27 1.27)) hide)
    )
    (pin "1" (uuid 9659898d-dfde-4d0e-99cb-b0f56a216d3e))
    (pin "2" (uuid 5072da56-9bc8-41ad-ae45-ab4a008dd749))
  )
)
