___lldiv@counter 2C 0 BANK0 1
__S0 800 0 ABS 0
__S1 BE 0 ABS 0
__S2 0 0 ABS 0
__S3 0 0 ABS 0
__Hintentry 0 0 CODE 0
__Lintentry 0 0 CODE 0
_dec 4C 0 BANK0 1
_uni 50 0 BANK0 1
__end_of_muxInit 3DB 0 CODE 0
_dataRc_c 54 0 BANK0 1
_RCIE 465 0 ABS 0
_RCIF 65 0 ABS 0
_BRGH 4C2 0 ABS 0
_SYNC 4C4 0 ABS 0
_CREN C4 0 ABS 0
_SPEN C7 0 ABS 0
_main 572 0 CODE 0
___sp 0 0 STACK 2
btemp 7E 0 ABS 0
start 0 0 CODE 0
_RCREG 1A 0 ABS 0
_TRISA 85 0 ABS 0
_TRISB 86 0 ABS 0
reset_vec 0 0 CODE 0
_PORTB 6 0 ABS 0
_SPBRG 99 0 ABS 0
_CMCON 1F 0 ABS 0
wtemp0 7E 0 ABS 0
__Hconfig 2008 0 CONFIG 4
__Lconfig 0 0 CONFIG 4
?___llmod 70 0 COMMON 1
__Hram 0 0 ABS 0
__Lram 0 0 ABS 0
__Hfunctab 0 0 ENTRY 0
__Lfunctab 0 0 ENTRY 0
__Hcommon 0 0 ABS 0
__Lcommon 0 0 ABS 0
__Heeprom_data 0 0 EEDATA 3
__Leeprom_data 0 0 EEDATA 3
_rcReadString 474 0 CODE 0
___int_sp 0 0 STACK 2
?___lldiv 20 0 BANK0 1
main@cont 37 0 BANK0 1
__Habs1 0 0 ABS 0
__Labs1 0 0 ABS 0
__Hsfr0 0 0 ABS 0
__Lsfr0 0 0 ABS 0
__Hsfr1 0 0 ABS 0
__Lsfr1 0 0 ABS 0
__Hsfr2 0 0 ABS 0
__Lsfr2 0 0 ABS 0
__Hsfr3 0 0 ABS 0
__Lsfr3 0 0 ABS 0
__size_of_muxView 0 0 ABS 0
__end_of_bootPic 3C9 0 CODE 0
___stackhi 0 0 ABS 0
_dataRc A0 0 BANK1 1
_rcRead 3DB 0 CODE 0
__Hcode 0 0 ABS 0
__Lcode 0 0 ABS 0
__size_of_bootPic 0 0 ABS 0
__HcstackBANK0 0 0 ABS 0
__LcstackBANK0 0 0 ABS 0
__pcstackBANK0 20 0 BANK0 1
___lmul 4D8 0 CODE 0
__Hinit 0 0 CODE 0
__Linit 0 0 CODE 0
_strtol 6AB 0 CODE 0
__end_of_main 5CE 0 CODE 0
__Htext 0 0 ABS 0
__Ltext 0 0 ABS 0
___lmul@multiplier 70 0 COMMON 1
muxNumber@numDigits 31 0 BANK0 1
__HdataBANK0 0 0 ABS 0
__LdataBANK0 0 0 ABS 0
__pdataBANK0 55 0 BANK0 1
end_of_initialization 7FE 0 CODE 0
_muxNumber 636 0 CODE 0
___stacklo 0 0 ABS 0
___lmul@multiplicand 74 0 COMMON 1
__size_of_isalpha 0 0 ABS 0
strtol@endptr 20 0 BANK0 1
_TRISBbits 86 0 ABS 0
_PORTAbits 5 0 ABS 0
__Hstrings 0 0 ABS 0
__Lstrings 0 0 ABS 0
__Hbank0 0 0 ABS 0
__Lbank0 0 0 ABS 0
__Hbank1 0 0 ABS 0
__Lbank1 0 0 ABS 0
__Hbank2 0 0 ABS 0
__Lbank2 0 0 ABS 0
__Hbank3 0 0 BANK3 1
__Lbank3 0 0 BANK3 1
___latbits 0 0 ABS 0
__end_of___lmul 51E 0 CODE 0
__Hpowerup 0 0 CODE 0
__Lpowerup 0 0 CODE 0
strtol@base 21 0 BANK0 1
rcReadString@size 71 0 COMMON 1
__size_of_rcRead 0 0 ABS 0
__ptext1 6AB 0 CODE 0
__ptext2 41D 0 CODE 0
__ptext3 45C 0 CODE 0
__ptext4 40B 0 CODE 0
muxView@digitsView 70 0 COMMON 1
__ptext5 444 0 CODE 0
__size_of_initRcUART 0 0 ABS 0
__ptext6 3F9 0 CODE 0
__ptext7 4D8 0 CODE 0
__ptext8 474 0 CODE 0
__ptext9 3DB 0 CODE 0
__Hclrtext 0 0 ABS 0
__Lclrtext 0 0 ABS 0
__size_of_muxInit 0 0 ABS 0
__end_of_isspace 474 0 CODE 0
strtol@a 29 0 BANK0 1
__end_of__initialization 7FE 0 CODE 0
strtol@c 2E 0 BANK0 1
__size_of_muxNumber 0 0 ABS 0
_isalpha$631 72 0 COMMON 1
_initRcUART 3E7 0 CODE 0
muxNumber@res 48 0 BANK0 1
_bootPic 3C1 0 CODE 0
strtol@s 2D 0 BANK0 1
main@ref 3B 0 BANK0 1
_isspace 45C 0 CODE 0
_isalpha 444 0 CODE 0
_isupper$640 70 0 COMMON 1
__Hstack 0 0 STACK 2
__Lstack 0 0 STACK 2
___llmod 51E 0 CODE 0
__end_of___lldiv 636 0 CODE 0
__Hspace_0 800 0 ABS 0
__Lspace_0 0 0 ABS 0
_dataNum 40 0 BANK0 1
__size_of_rcReadString 0 0 ABS 0
__Hspace_1 BE 0 ABS 0
__Lspace_1 0 0 ABS 0
strtol@sign 28 0 BANK0 1
?___lmul 70 0 COMMON 1
__Hspace_2 0 0 ABS 0
__Lspace_2 0 0 ABS 0
_muxInit 3D1 0 CODE 0
?_strtol 20 0 BANK0 1
_isdigit 40B 0 CODE 0
_isupper 3F9 0 CODE 0
__Hcinit 800 0 CODE 0
_toupper 41D 0 CODE 0
__Lcinit 7CD 0 CODE 0
_muxView 493 0 CODE 0
___lldiv 5CE 0 CODE 0
__Hspace_3 0 0 ABS 0
_numbers 55 0 BANK0 1
__Lspace_3 0 0 ABS 0
__size_of_main 0 0 ABS 0
__Hspace_4 400F 0 ABS 0
__Lspace_4 0 0 ABS 0
muxNumber@num 2D 0 BANK0 1
__HidataBANK0 0 0 ABS 0
__LidataBANK0 0 0 ABS 0
__pidataBANK0 430 0 CODE 0
__end_of_isdigit 41D 0 CODE 0
clear_ram0 3C9 0 CODE 0
rcReadString@i 76 0 COMMON 1
__HbssBANK0 0 0 ABS 0
__LbssBANK0 0 0 ABS 0
__end_of_muxNumber 6AB 0 CODE 0
__pbssBANK0 3C 0 BANK0 1
__size_of_isdigit 0 0 ABS 0
__size_of_isupper 0 0 ABS 0
__HbssBANK1 0 0 ABS 0
__LbssBANK1 0 0 ABS 0
__pbssBANK1 A0 0 BANK1 1
__ptext10 636 0 CODE 0
_isdigit$634 70 0 COMMON 1
__end_of_initRcUART 3F9 0 CODE 0
__ptext11 493 0 CODE 0
__ptext12 51E 0 CODE 0
__ptext13 5CE 0 CODE 0
__end_of_rcRead 3E7 0 CODE 0
__ptext14 3D1 0 CODE 0
__ptext15 3E7 0 CODE 0
__ptext16 3C1 0 CODE 0
___llmod@divisor 70 0 COMMON 1
rcReadString@out 75 0 COMMON 1
__size_of_toupper 0 0 ABS 0
_INTCONbits B 0 ABS 0
__Hend_init 1 0 CODE 0
__Lend_init 0 0 CODE 0
__end_of_isupper 40B 0 CODE 0
___lldiv@divisor 20 0 BANK0 1
__size_of___lldiv 0 0 ABS 0
_isspace$637 70 0 COMMON 1
__end_of___llmod 572 0 CODE 0
__Hreset_vec 0 0 CODE 0
__end_of_toupper 430 0 CODE 0
__Lreset_vec 0 0 CODE 0
intlevel0 0 0 ENTRY 0
intlevel1 0 0 ENTRY 0
__size_of_strtol 0 0 ABS 0
intlevel2 0 0 ENTRY 0
intlevel3 0 0 ENTRY 0
__size_of___lmul 0 0 ABS 0
intlevel4 0 0 ENTRY 0
intlevel5 0 0 ENTRY 0
__end_of_rcReadString 493 0 CODE 0
__HcstackCOMMON 0 0 ABS 0
__LcstackCOMMON 0 0 ABS 0
__pcstackCOMMON 70 0 COMMON 1
start_initialization 7CD 0 CODE 0
__end_of_isalpha 45C 0 CODE 0
___lldiv@quotient 28 0 BANK0 1
__end_of_strtol 7CD 0 CODE 0
__Hmaintext 0 0 ABS 0
__Lmaintext 0 0 ABS 0
__pmaintext 572 0 CODE 0
__initialization 7CD 0 CODE 0
___llmod@dividend 74 0 COMMON 1
___llmod@counter 79 0 COMMON 1
___lmul@product 79 0 COMMON 1
__size_of_isspace 0 0 ABS 0
isspace@c 71 0 COMMON 1
isalpha@c 73 0 COMMON 1
__end_of_muxView 4D8 0 CODE 0
__size_of___llmod 0 0 ABS 0
___lldiv@dividend 24 0 BANK0 1
isdigit@c 71 0 COMMON 1
isupper@c 71 0 COMMON 1
toupper@c 71 0 COMMON 1
%segments
reset_vec 0 1 CODE 0 0
cinit F9A FFF CODE F9A 0
cstackCOMMON 70 7D COMMON 70 1
bssBANK1 A0 BD BANK1 A0 1
cstackBANK0 20 68 BANK0 20 1
text1 D56 F99 CODE D56 0
text10 C6C D55 CODE C6C 0
text13 B9C C6B CODE B9C 0
maintext AE4 B9B CODE AE4 0
text12 A3C AE3 CODE A3C 0
text7 9B0 A3B CODE 9B0 0
text11 926 9AF CODE 926 0
text8 8E8 925 CODE 8E8 0
text3 8B8 8E7 CODE 8B8 0
text5 888 8B7 CODE 888 0
idataBANK0 860 887 CODE 860 0
text2 83A 85F CODE 83A 0
text4 816 839 CODE 816 0
text6 7F2 815 CODE 7F2 0
text15 7CE 7F1 CODE 7CE 0
text9 7B6 7CD CODE 7B6 0
text14 7A2 7B5 CODE 7A2 0
clrtext 792 7A1 CODE 792 0
text16 782 791 CODE 782 0
%locals
dist/default/production/UART_RC_16F627.X.production.o
/tmp/xcXADMFkl.s
336 7CD 0 CODE 0
339 7CD 0 CODE 0
383 7CD 0 CODE 0
384 7CE 0 CODE 0
385 7CF 0 CODE 0
386 7D0 0 CODE 0
387 7D1 0 CODE 0
388 7D2 0 CODE 0
389 7D3 0 CODE 0
390 7D4 0 CODE 0
391 7D5 0 CODE 0
392 7D6 0 CODE 0
393 7D7 0 CODE 0
394 7D8 0 CODE 0
395 7D9 0 CODE 0
396 7DA 0 CODE 0
397 7DB 0 CODE 0
398 7DC 0 CODE 0
399 7DD 0 CODE 0
400 7DE 0 CODE 0
401 7DF 0 CODE 0
402 7E0 0 CODE 0
403 7E1 0 CODE 0
404 7E2 0 CODE 0
405 7E3 0 CODE 0
406 7E4 0 CODE 0
407 7E5 0 CODE 0
408 7E6 0 CODE 0
409 7E7 0 CODE 0
410 7E8 0 CODE 0
411 7E9 0 CODE 0
412 7EA 0 CODE 0
413 7EB 0 CODE 0
414 7EC 0 CODE 0
415 7ED 0 CODE 0
416 7EE 0 CODE 0
417 7EF 0 CODE 0
418 7F0 0 CODE 0
419 7F1 0 CODE 0
420 7F2 0 CODE 0
421 7F3 0 CODE 0
422 7F4 0 CODE 0
441 7F5 0 CODE 0
442 7F6 0 CODE 0
443 7F7 0 CODE 0
444 7F8 0 CODE 0
445 7F9 0 CODE 0
448 7FA 0 CODE 0
449 7FB 0 CODE 0
450 7FC 0 CODE 0
451 7FD 0 CODE 0
457 7FE 0 CODE 0
459 7FE 0 CODE 0
460 7FF 0 CODE 0
428 3C9 0 CODE 0
429 3C9 0 CODE 0
430 3CA 0 CODE 0
431 3CA 0 CODE 0
432 3CB 0 CODE 0
433 3CC 0 CODE 0
434 3CD 0 CODE 0
435 3CE 0 CODE 0
436 3CF 0 CODE 0
437 3D0 0 CODE 0
mainRc.c
66 572 0 CODE 0
67 572 0 CODE 0
68 573 0 CODE 0
69 574 0 CODE 0
72 575 0 CODE 0
78 57F 0 CODE 0
81 585 0 CODE 0
84 59B 0 CODE 0
85 5AA 0 CODE 0
85 5AF 0 CODE 0
85 5B3 0 CODE 0
85 5B7 0 CODE 0
86 5BA 0 CODE 0
86 5C2 0 CODE 0
86 5C6 0 CODE 0
/opt/microchip/xc8/v2.32/pic/sources/c90/common/strtol.c
5 6AB 0 CODE 0
10 6AE 0 CODE 0
11 6AE 0 CODE 0
12 6BB 0 CODE 0
13 6C3 0 CODE 0
14 6CD 0 CODE 0
15 6CE 0 CODE 0
16 6D4 0 CODE 0
17 6D6 0 CODE 0
18 6E1 0 CODE 0
20 6E9 0 CODE 0
21 6EF 0 CODE 0
22 6FA 0 CODE 0
23 713 0 CODE 0
24 717 0 CODE 0
25 721 0 CODE 0
26 728 0 CODE 0
28 72C 0 CODE 0
29 732 0 CODE 0
31 736 0 CODE 0
32 73C 0 CODE 0
33 747 0 CODE 0
34 74F 0 CODE 0
37 753 0 CODE 0
37 756 0 CODE 0
37 75A 0 CODE 0
39 75F 0 CODE 0
39 77D 0 CODE 0
39 783 0 CODE 0
39 789 0 CODE 0
40 794 0 CODE 0
41 79F 0 CODE 0
42 7A0 0 CODE 0
43 7A7 0 CODE 0
44 7AF 0 CODE 0
45 7B4 0 CODE 0
45 7BD 0 CODE 0
45 7BF 0 CODE 0
45 7C1 0 CODE 0
46 7C4 0 CODE 0
47 7CC 0 CODE 0
/opt/microchip/xc8/v2.32/pic/sources/c90/common/toupper.c
5 41D 0 CODE 0
10 41E 0 CODE 0
10 420 0 CODE 0
10 426 0 CODE 0
11 42A 0 CODE 0
12 42E 0 CODE 0
13 42F 0 CODE 0
/opt/microchip/xc8/v2.32/pic/sources/c90/common/isspace.c
8 45C 0 CODE 0
14 45D 0 CODE 0
14 467 0 CODE 0
14 46D 0 CODE 0
15 473 0 CODE 0
/opt/microchip/xc8/v2.32/pic/sources/c90/common/isdigit.c
8 40B 0 CODE 0
14 40C 0 CODE 0
14 40F 0 CODE 0
14 415 0 CODE 0
15 41C 0 CODE 0
/opt/microchip/xc8/v2.32/pic/sources/c90/common/isalpha.c
8 444 0 CODE 0
14 445 0 CODE 0
14 449 0 CODE 0
14 44F 0 CODE 0
15 45B 0 CODE 0
/opt/microchip/xc8/v2.32/pic/sources/c90/common/isupper.c
8 3F9 0 CODE 0
14 3FA 0 CODE 0
14 3FD 0 CODE 0
14 403 0 CODE 0
15 40A 0 CODE 0
/opt/microchip/xc8/v2.32/pic/sources/c90/common/Umul32.c
15 4D8 0 CODE 0
119 4D8 0 CODE 0
121 4E0 0 CODE 0
122 4E4 0 CODE 0
122 4E7 0 CODE 0
122 4E8 0 CODE 0
122 4EA 0 CODE 0
122 4EE 0 CODE 0
122 4EF 0 CODE 0
122 4F1 0 CODE 0
122 4F5 0 CODE 0
122 4F6 0 CODE 0
122 4F8 0 CODE 0
123 4FB 0 CODE 0
123 4FD 0 CODE 0
124 504 0 CODE 0
124 505 0 CODE 0
124 50B 0 CODE 0
125 50D 0 CODE 0
125 511 0 CODE 0
128 515 0 CODE 0
129 51D 0 CODE 0
mainRc.c
60 474 0 CODE 0
61 475 0 CODE 0
62 478 0 CODE 0
63 482 0 CODE 0
63 484 0 CODE 0
63 48A 0 CODE 0
63 48E 0 CODE 0
64 492 0 CODE 0
52 3DB 0 CODE 0
53 3DB 0 CODE 0
55 3DB 0 CODE 0
53 3DB 0 CODE 0
56 3E1 0 CODE 0
57 3E5 0 CODE 0
58 3E6 0 CODE 0
./dispMux.c
62 636 0 CODE 0
64 636 0 CODE 0
64 65E 0 CODE 0
64 664 0 CODE 0
64 66A 0 CODE 0
65 682 0 CODE 0
66 69D 0 CODE 0
67 6A5 0 CODE 0
68 6AA 0 CODE 0
45 493 0 CODE 0
46 493 0 CODE 0
47 496 0 CODE 0
49 497 0 CODE 0
50 49F 0 CODE 0
50 4A5 0 CODE 0
50 4A7 0 CODE 0
51 4A9 0 CODE 0
53 4B5 0 CODE 0
54 4B8 0 CODE 0
56 4B9 0 CODE 0
57 4C1 0 CODE 0
57 4C7 0 CODE 0
57 4C9 0 CODE 0
58 4CB 0 CODE 0
60 4D7 0 CODE 0
/opt/microchip/xc8/v2.32/pic/sources/c90/common/llmod.c
5 51E 0 CODE 0
12 51E 0 CODE 0
12 522 0 CODE 0
13 526 0 CODE 0
14 528 0 CODE 0
15 529 0 CODE 0
15 52B 0 CODE 0
16 532 0 CODE 0
14 536 0 CODE 0
19 53A 0 CODE 0
19 53C 0 CODE 0
19 540 0 CODE 0
19 544 0 CODE 0
19 548 0 CODE 0
20 54C 0 CODE 0
20 54F 0 CODE 0
20 553 0 CODE 0
20 557 0 CODE 0
21 55A 0 CODE 0
21 55B 0 CODE 0
21 561 0 CODE 0
22 563 0 CODE 0
24 569 0 CODE 0
25 571 0 CODE 0
/opt/microchip/xc8/v2.32/pic/sources/c90/common/__lldiv.c
5 5CE 0 CODE 0
13 5CE 0 CODE 0
14 5D8 0 CODE 0
14 5DC 0 CODE 0
15 5E0 0 CODE 0
16 5E2 0 CODE 0
17 5E3 0 CODE 0
17 5E5 0 CODE 0
18 5EC 0 CODE 0
16 5F0 0 CODE 0
21 5F4 0 CODE 0
21 5F6 0 CODE 0
22 5FD 0 CODE 0
22 5FF 0 CODE 0
22 603 0 CODE 0
22 607 0 CODE 0
22 60B 0 CODE 0
23 60F 0 CODE 0
23 612 0 CODE 0
23 616 0 CODE 0
23 61A 0 CODE 0
24 61D 0 CODE 0
26 61E 0 CODE 0
26 61F 0 CODE 0
26 625 0 CODE 0
27 627 0 CODE 0
29 62D 0 CODE 0
30 635 0 CODE 0
./dispMux.c
39 3D1 0 CODE 0
40 3D1 0 CODE 0
41 3D4 0 CODE 0
42 3D6 0 CODE 0
43 3DA 0 CODE 0
mainRc.c
36 3E7 0 CODE 0
37 3E7 0 CODE 0
38 3EA 0 CODE 0
40 3EB 0 CODE 0
41 3ED 0 CODE 0
43 3EE 0 CODE 0
44 3EF 0 CODE 0
46 3F2 0 CODE 0
47 3F3 0 CODE 0
48 3F4 0 CODE 0
49 3F5 0 CODE 0
50 3F8 0 CODE 0
31 3C1 0 CODE 0
32 3C1 0 CODE 0
33 3C4 0 CODE 0
34 3C8 0 CODE 0
