_BackLight_State 7D 0 COMRAM 1
_RS 7F 0 COMRAM 1
___fldiv@rem D 0 COMRAM 1
_PR2 FCB 0 ABS 0
__S0 4000 0 ABS 0
__S1 80 0 ABS 0
__S4 0 0 ABS 0
__S5 0 0 ABS 0
_PEN 7E2A 0 ABS 0
_SEN 7E28 0 ABS 0
__Hintentry 0 0 ABS 0
__Lintentry 0 0 ABS 0
___fladd@signs 3F 0 COMRAM 1
_RCEN 7E2B 0 ABS 0
_RSEN 7E29 0 ABS 0
setPWM@freq_osc 55 0 COMRAM 1
_main 2D7C 0 CODE 0
_mask 7B 0 COMRAM 1
___sp 0 0 STACK 2
?___fladd 33 0 COMRAM 1
start 2 0 CODE 0
___fltol@f1 43 0 COMRAM 1
_SSPIF 7CF3 0 ABS 0
_ACKEN 7E2C 0 ABS 0
__end_of___flmul 3A56 0 CODE 0
__Hirdata 0 0 CODE 0
__Lirdata 0 0 CODE 0
__HRAM 0 0 ABS 0
__LRAM 1 0 ABS 0
_T2CON FCA 0 ABS 0
_ACKDT 7E2D 0 ABS 0
__Hconfig 30000E 0 CONFIG 4
__Lconfig 0 0 CONFIG 4
_frec_osc 73 0 COMRAM 1
__Hbigram 0 0 ABS 0
__Lbigram 0 0 ABS 0
__Hrparam 0 0 COMRAM 1
__Lrparam 0 0 COMRAM 1
__Hram 0 0 ABS 0
__Lram 0 0 ABS 0
__Hcomram 0 0 ABS 0
__Lcomram 0 0 ABS 0
_pwm_p 77 0 COMRAM 1
__Hsfr 0 0 ABS 0
__Lsfr 0 0 ABS 0
__Hbss 0 0 RAM 1
__Lbss 0 0 RAM 1
___param_bank 0 0 ABS 0
__Hnvrram 0 0 COMRAM 1
__Lnvrram 0 0 COMRAM 1
__cntErrataNOP_dist/default/production/PRUEBA_FUNCIONA.X.production.o 10E 0 ABS 0
_TRISC3 7CA3 0 ABS 0
_TRISC4 7CA4 0 ABS 0
?___fltol 43 0 COMRAM 1
__Hbigsfr 0 0 ABS 0
__Lbigsfr 0 0 ABS 0
__Heeprom_data 0 0 EEDATA 0
__Leeprom_data 0 0 EEDATA 0
?___flmul 1A 0 COMRAM 1
_LATBbits F8A 0 ABS 0
__Hintsave_regs 0 0 BIGRAM 1
_SSPADD FC8 0 ABS 0
__Lintsave_regs 0 0 BIGRAM 1
_CCPR1L FBE 0 ABS 0
?___fldiv 1 0 COMRAM 1
__Hbigbss 0 0 BIGRAM 1
__Lbigbss 0 0 BIGRAM 1
__Hintret 0 0 ABS 0
__Lintret 0 0 ABS 0
__Hramtop 600 0 RAM 0
__Lramtop 600 0 RAM 0
__Hstruct 0 0 COMRAM 1
__Lstruct 0 0 COMRAM 1
__Hbigdata 0 0 BIGRAM 1
__Lbigdata 0 0 BIGRAM 1
__Hmediumconst 0 0 MEDIUMCONST 0
__Lmediumconst 0 0 MEDIUMCONST 0
__Hfarbss 0 0 FARRAM 0
__Lfarbss 0 0 FARRAM 0
__Hintcode 2 0 CODE 0
_SSPBUF FC9 0 ABS 0
__Lintcode 2 0 CODE 0
__Hfardata 0 0 FARRAM 0
__Lfardata 0 0 FARRAM 0
__Habs1 0 0 ABS 0
__Labs1 0 0 ABS 0
isa$xinst 0 0 ABS 0
__HnvFARRAM 0 0 FARRAM 0
__LnvFARRAM 0 0 FARRAM 0
__HnvCOMRAM 0 0 ABS 0
__LnvCOMRAM 0 0 ABS 0
_setPWM 2F3A 0 CODE 0
___heap_hi 0 0 ABS 0
__pnvCOMRAM 6F 0 COMRAM 1
__end_of___fltol 2F3A 0 CODE 0
__Hdata 0 0 ABS 0
__Ldata 0 0 ABS 0
isa$std 1 0 ABS 0
stackhi 0 0 ABS 0
__Hheap 0 0 HEAP 7
__Lheap 0 0 HEAP 7
___fldiv@new_exp 12 0 COMRAM 1
setPWM@pwm_duty 51 0 COMRAM 1
__Htemp 0 0 COMRAM 1
__Ltemp 0 0 COMRAM 1
stacklo 0 0 ABS 0
__Hrbit 0 0 COMRAM 1
__Lrbit 0 0 COMRAM 1
__Hinit 6 0 CODE 0
__Linit 2 0 CODE 0
__Hintcodelo 2 0 CODE 0
__Lintcodelo 2 0 CODE 0
__Hrbss 0 0 COMRAM 1
__end_of_main 2E04 0 CODE 0
setPWM@valor_prueba_debug2 60 0 COMRAM 1
__Lrbss 0 0 COMRAM 1
__Htext 0 0 ABS 0
__Ltext 0 0 ABS 0
__end_of___fldiv 35B2 0 CODE 0
___heap_lo 0 0 ABS 0
___flmul@sign 26 0 COMRAM 1
end_of_initialization 2D72 0 CODE 0
___fldiv@sign 11 0 COMRAM 1
_SSPCON1 FC6 0 ABS 0
_SSPCON2 FC5 0 ABS 0
_setPWM$946 69 0 COMRAM 1
_setPWM$947 61 0 COMRAM 1
_TRISBbits F93 0 ABS 0
_TRISCbits F94 0 ABS 0
___fladd@grs 42 0 COMRAM 1
__Hibigdata 0 0 CODE 0
__Libigdata 0 0 CODE 0
_CCP1CON FBD 0 ABS 0
__Hifardata 0 0 CODE 0
__Lifardata 0 0 CODE 0
__Hbank0 0 0 ABS 0
__Lbank0 0 0 ABS 0
__Hbank1 0 0 ABS 0
__Lbank1 0 0 ABS 0
__Hbank2 0 0 ABS 0
__Lbank2 0 0 ABS 0
__Hbank3 0 0 ABS 0
__Lbank3 0 0 ABS 0
__Hbank4 0 0 ABS 0
__Lbank4 0 0 ABS 0
_ACKSTAT 7E2E 0 ABS 0
__Hbank5 0 0 ABS 0
__Lbank5 0 0 ABS 0
__Hpowerup 2 0 CODE 0
_SSPSTAT FC7 0 ABS 0
__Lpowerup 2 0 CODE 0
__Htext0 0 0 ABS 0
__Ltext0 0 0 ABS 0
__Htext1 0 0 ABS 0
__Ltext1 0 0 ABS 0
__ptext0 2D7C 0 CODE 0
___flmul@grs 27 0 COMRAM 1
__Htext2 0 0 ABS 0
__Ltext2 0 0 ABS 0
__ptext1 2F3A 0 CODE 0
__Htext3 0 0 ABS 0
__Ltext3 0 0 ABS 0
__ptext2 2E04 0 CODE 0
___fldiv@grs 14 0 COMRAM 1
__cntErrataNOP_/tmp/xcXlGJmcB.o 1 0 ABS 0
__Htext4 0 0 ABS 0
__Ltext4 0 0 ABS 0
__ptext3 35B2 0 CODE 0
__Htext5 0 0 ABS 0
__Ltext5 0 0 ABS 0
__ptext4 3180 0 CODE 0
__ptext5 3A56 0 CODE 0
__HbssCOMRAM 0 0 ABS 0
__LbssCOMRAM 0 0 ABS 0
__pbssCOMRAM 7E 0 COMRAM 1
__Hclrtext 0 0 ABS 0
__Lclrtext 0 0 ABS 0
_tmr2_presc 6F 0 COMRAM 1
__end_of__initialization 2D72 0 CODE 0
___rparam_used 1 0 ABS 0
_i2c_add 7E 0 COMRAM 1
___fladd 3A56 0 CODE 0
__Hidata 0 0 CODE 0
__Lidata 0 0 CODE 0
__Hrdata 0 0 COMRAM 1
__Lrdata 0 0 COMRAM 1
__Hidloc 200008 0 IDLOC 5
__Lidloc 0 0 IDLOC 5
__Hstack 0 0 STACK 2
__Lstack 0 0 STACK 2
__Hparam 0 0 COMRAM 1
__Lparam 0 0 COMRAM 1
__Hspace_0 4000 0 ABS 0
__HcstackCOMRAM 0 0 ABS 0
__Lspace_0 0 0 ABS 0
__LcstackCOMRAM 0 0 ABS 0
__pcstackCOMRAM 1 0 COMRAM 1
__Hspace_1 80 0 ABS 0
__Lspace_1 0 0 ABS 0
__Hsmallconst 0 0 SMALLCONST 0
__Lsmallconst 0 0 SMALLCONST 0
___fltol 2E04 0 CODE 0
__Hspace_2 0 0 ABS 0
__Lspace_2 0 0 ABS 0
___flmul 35B2 0 CODE 0
__Hnvbit 0 0 COMRAM 1
__Lnvbit 0 0 COMRAM 1
__Hcinit 0 0 ABS 0
__Lcinit 0 0 ABS 0
___fldiv 3180 0 CODE 0
__pcinit 2D50 0 CODE 0
__ramtop 600 0 RAM 0
__mediumconst 0 0 MEDIUMCONST 0
__Hconst 0 0 CONST 0
__Lconst 0 0 CONST 0
__Hspace_4 60000E 0 ABS 0
__Lspace_4 0 0 ABS 0
___fltol@exp1 4C 0 COMRAM 1
setPWM@period_pwm 4D 0 COMRAM 1
___flmul@temp 31 0 COMRAM 1
__end_of___fladd 3FFE 0 CODE 0
___inthi_sp 0 0 STACK 2
___fltol@sign1 4B 0 COMRAM 1
___intlo_sp 0 0 STACK 2
setPWM@valor_prueba_debug 5F 0 COMRAM 1
__HidataCOMRAM 0 0 ABS 0
__LidataCOMRAM 0 0 ABS 0
__pidataCOMRAM 2D4D 0 CODE 0
__smallconst 0 0 SMALLCONST 0
__end_of_setPWM 3180 0 CODE 0
__Hreset_vec 2 0 CODE 0
__Lreset_vec 0 0 CODE 0
__accesstop 80 0 ABS 0
__Hintcode_body 0 0 ABS 0
__Lintcode_body 0 0 ABS 0
intlevel0 2D4A 0 CODE 0
intlevel1 2D4A 0 CODE 0
intlevel2 2D4A 0 CODE 0
intlevel3 2D4A 0 CODE 0
__HdataCOMRAM 0 0 ABS 0
__LdataCOMRAM 0 0 ABS 0
__pdataCOMRAM 7B 0 COMRAM 1
___fladd@aexp 40 0 COMRAM 1
___fladd@bexp 41 0 COMRAM 1
start_initialization 2D50 0 CODE 0
___fladd@a 37 0 COMRAM 1
setPWM@duty_temp 67 0 COMRAM 1
setPWM@presc 59 0 COMRAM 1
___fladd@b 33 0 COMRAM 1
___flmul@aexp 2B 0 COMRAM 1
___fldiv@aexp 19 0 COMRAM 1
__initialization 2D50 0 CODE 0
___flmul@bexp 2C 0 COMRAM 1
___fldiv@bexp 18 0 COMRAM 1
___flmul@prod 2D 0 COMRAM 1
__activetblptr 2 0 ABS 0
___flmul@a 1E 0 COMRAM 1
___fldiv@a 5 0 COMRAM 1
___flmul@b 1A 0 COMRAM 1
setPWM@periodo 65 0 COMRAM 1
___fldiv@b 1 0 COMRAM 1
%segments
reset_vec 0 5 CODE 0 0
cstackCOMRAM 1 7F COMRAM 1 1
text5 3A56 3FFF CODE 3A56 0
text3 35B2 3A55 CODE 35B2 0
text4 3180 35B1 CODE 3180 0
text1 2F3A 317F CODE 2F3A 0
text2 2E04 2F39 CODE 2E04 0
text0 2D7C 2E03 CODE 2D7C 0
cinit 2D50 2D7B CODE 2D50 0
idataCOMRAM 2D4D 2D4F CODE 2D4D 0
text 2D4A 2D4B CODE 2D4A 0
%locals
dist/default/production/PRUEBA_FUNCIONA.X.production.o
/opt/microchip/mplabx/v6.00/packs/Microchip/PIC18Fxxxx_DFP/1.3.36/xc8/pic/include/proc/pic18f452.h
/tmp/xcXfpIeMO.s
714 2D50 0 CODE 0
716 2D50 0 CODE 0
719 2D50 0 CODE 0
749 2D50 0 CODE 0
750 2D52 0 CODE 0
751 2D54 0 CODE 0
752 2D56 0 CODE 0
753 2D58 0 CODE 0
754 2D5A 0 CODE 0
755 2D5C 0 CODE 0
756 2D5E 0 CODE 0
757 2D62 0 CODE 0
758 2D64 0 CODE 0
759 2D68 0 CODE 0
760 2D6A 0 CODE 0
764 2D6E 0 CODE 0
765 2D70 0 CODE 0
771 2D72 0 CODE 0
774 2D72 0 CODE 0
775 2D74 0 CODE 0
776 2D76 0 CODE 0
777 2D78 0 CODE 0
main.c
95 2D7C 0 CODE 0
99 2D7C 0 CODE 0
104 2D80 0 CODE 0
105 2D82 0 CODE 0
108 2DC6 0 CODE 0
112 2DC6 0 CODE 0
113 2DCA 0 CODE 0
114 2DE2 0 CODE 0
115 2DE4 0 CODE 0
main.c
30 2F3A 0 CODE 0
50 2F3C 0 CODE 0
51 2F4C 0 CODE 0
52 2F5C 0 CODE 0
55 2F6C 0 CODE 0
56 3028 0 CODE 0
62 302C 0 CODE 0
63 311C 0 CODE 0
64 3124 0 CODE 0
65 3146 0 CODE 0
67 314A 0 CODE 0
69 3162 0 CODE 0
70 3166 0 CODE 0
72 316A 0 CODE 0
73 316E 0 CODE 0
76 3172 0 CODE 0
81 3174 0 CODE 0
84 3178 0 CODE 0
85 317C 0 CODE 0
/opt/microchip/xc8/v2.36/pic/sources/c99/common/fltol.c
43 2E04 0 CODE 0
47 2E06 0 CODE 0
48 2E20 0 CODE 0
49 2E36 0 CODE 0
50 2E66 0 CODE 0
51 2E68 0 CODE 0
52 2E78 0 CODE 0
53 2E7C 0 CODE 0
54 2E8E 0 CODE 0
57 2EAA 0 CODE 0
60 2EC0 0 CODE 0
63 2EDA 0 CODE 0
64 2EE6 0 CODE 0
62 2EE8 0 CODE 0
67 2EFC 0 CODE 0
68 2F12 0 CODE 0
69 2F22 0 CODE 0
70 2F34 0 CODE 0
/opt/microchip/xc8/v2.36/pic/sources/c99/common/sprcmul.c
8 35B2 0 CODE 0
17 35B4 0 CODE 0
18 35BA 0 CODE 0
19 35C0 0 CODE 0
20 35D2 0 CODE 0
24 35D4 0 CODE 0
26 35EA 0 CODE 0
28 35FE 0 CODE 0
31 360E 0 CODE 0
33 3612 0 CODE 0
36 3616 0 CODE 0
39 3628 0 CODE 0
40 3630 0 CODE 0
41 3636 0 CODE 0
42 3648 0 CODE 0
45 364A 0 CODE 0
48 3660 0 CODE 0
50 3674 0 CODE 0
53 3684 0 CODE 0
54 3688 0 CODE 0
57 368C 0 CODE 0
58 369E 0 CODE 0
65 36A0 0 CODE 0
66 36C6 0 CODE 0
95 36DC 0 CODE 0
96 36EA 0 CODE 0
97 36F4 0 CODE 0
98 36FE 0 CODE 0
99 370A 0 CODE 0
100 3716 0 CODE 0
101 3722 0 CODE 0
102 372E 0 CODE 0
103 373A 0 CODE 0
104 3746 0 CODE 0
105 3754 0 CODE 0
106 3760 0 CODE 0
107 3770 0 CODE 0
108 377C 0 CODE 0
109 378C 0 CODE 0
110 379A 0 CODE 0
111 37A6 0 CODE 0
112 37B6 0 CODE 0
113 37C2 0 CODE 0
114 37D2 0 CODE 0
115 37DE 0 CODE 0
116 37EE 0 CODE 0
117 37FA 0 CODE 0
145 3824 0 CODE 0
146 385E 0 CODE 0
149 386C 0 CODE 0
152 3886 0 CODE 0
153 388A 0 CODE 0
154 3896 0 CODE 0
155 38A8 0 CODE 0
156 38AA 0 CODE 0
157 38AC 0 CODE 0
158 38B6 0 CODE 0
152 38BC 0 CODE 0
163 38D0 0 CODE 0
164 38D4 0 CODE 0
165 38E6 0 CODE 0
166 3918 0 CODE 0
167 391E 0 CODE 0
168 3922 0 CODE 0
169 3924 0 CODE 0
173 393A 0 CODE 0
174 393C 0 CODE 0
175 3950 0 CODE 0
176 395C 0 CODE 0
177 396E 0 CODE 0
178 3998 0 CODE 0
183 399C 0 CODE 0
184 39BC 0 CODE 0
185 39CC 0 CODE 0
187 39D0 0 CODE 0
188 39F0 0 CODE 0
190 3A00 0 CODE 0
191 3A04 0 CODE 0
192 3A08 0 CODE 0
194 3A0A 0 CODE 0
195 3A0E 0 CODE 0
196 3A1E 0 CODE 0
197 3A30 0 CODE 0
199 3A32 0 CODE 0
201 3A3A 0 CODE 0
203 3A40 0 CODE 0
205 3A50 0 CODE 0
/opt/microchip/xc8/v2.36/pic/sources/c99/common/sprcdiv.c
11 3180 0 CODE 0
26 3182 0 CODE 0
27 3188 0 CODE 0
28 318E 0 CODE 0
29 31A0 0 CODE 0
33 31A2 0 CODE 0
35 31B8 0 CODE 0
37 31CC 0 CODE 0
40 31DC 0 CODE 0
42 31E0 0 CODE 0
43 31E4 0 CODE 0
46 31E8 0 CODE 0
49 31FA 0 CODE 0
50 3202 0 CODE 0
51 3208 0 CODE 0
52 321A 0 CODE 0
56 321C 0 CODE 0
58 3232 0 CODE 0
60 3246 0 CODE 0
63 3256 0 CODE 0
65 325A 0 CODE 0
66 325E 0 CODE 0
69 3262 0 CODE 0
75 3274 0 CODE 0
76 3290 0 CODE 0
77 32A0 0 CODE 0
78 32A8 0 CODE 0
79 32AE 0 CODE 0
83 32C2 0 CODE 0
84 32D8 0 CODE 0
85 32D8 0 CODE 0
89 32EC 0 CODE 0
92 3308 0 CODE 0
93 3318 0 CODE 0
94 3328 0 CODE 0
96 3338 0 CODE 0
97 333C 0 CODE 0
100 3340 0 CODE 0
101 3356 0 CODE 0
102 3360 0 CODE 0
103 336A 0 CODE 0
104 337C 0 CODE 0
105 337E 0 CODE 0
106 3380 0 CODE 0
112 338A 0 CODE 0
115 33AE 0 CODE 0
116 33B0 0 CODE 0
118 33C0 0 CODE 0
119 33C4 0 CODE 0
97 33C6 0 CODE 0
122 33DA 0 CODE 0
123 33F4 0 CODE 0
128 33FA 0 CODE 0
129 3406 0 CODE 0
130 3418 0 CODE 0
131 341A 0 CODE 0
132 341C 0 CODE 0
133 3426 0 CODE 0
127 342C 0 CODE 0
139 3440 0 CODE 0
140 3444 0 CODE 0
141 3456 0 CODE 0
142 3488 0 CODE 0
143 348E 0 CODE 0
144 3492 0 CODE 0
145 3494 0 CODE 0
149 34AA 0 CODE 0
150 34AC 0 CODE 0
151 34C0 0 CODE 0
152 34CC 0 CODE 0
153 34DE 0 CODE 0
154 3508 0 CODE 0
159 350C 0 CODE 0
160 352C 0 CODE 0
161 3532 0 CODE 0
165 3542 0 CODE 0
166 3562 0 CODE 0
167 356A 0 CODE 0
169 357A 0 CODE 0
173 357E 0 CODE 0
175 3584 0 CODE 0
176 3596 0 CODE 0
177 3598 0 CODE 0
180 359C 0 CODE 0
182 35A0 0 CODE 0
185 35AC 0 CODE 0
/opt/microchip/xc8/v2.36/pic/sources/c99/common/sprcadd.c
10 3A56 0 CODE 0
21 3A58 0 CODE 0
22 3A5E 0 CODE 0
23 3A64 0 CODE 0
24 3A76 0 CODE 0
28 3A78 0 CODE 0
30 3A8E 0 CODE 0
32 3AA2 0 CODE 0
35 3AB2 0 CODE 0
37 3AB6 0 CODE 0
38 3ABA 0 CODE 0
41 3ABE 0 CODE 0
44 3AD0 0 CODE 0
46 3AD8 0 CODE 0
47 3AEE 0 CODE 0
49 3AF0 0 CODE 0
50 3AF8 0 CODE 0
51 3B0A 0 CODE 0
55 3B0C 0 CODE 0
57 3B22 0 CODE 0
59 3B36 0 CODE 0
62 3B46 0 CODE 0
64 3B4A 0 CODE 0
65 3B4E 0 CODE 0
68 3B52 0 CODE 0
75 3B64 0 CODE 0
77 3B7C 0 CODE 0
78 3B8E 0 CODE 0
81 3B92 0 CODE 0
82 3B98 0 CODE 0
83 3B9C 0 CODE 0
84 3BA0 0 CODE 0
85 3BA4 0 CODE 0
86 3BA8 0 CODE 0
87 3BAC 0 CODE 0
88 3BB0 0 CODE 0
89 3BB4 0 CODE 0
90 3BB8 0 CODE 0
91 3BBC 0 CODE 0
92 3BC0 0 CODE 0
93 3BC4 0 CODE 0
94 3BC8 0 CODE 0
95 3BCC 0 CODE 0
98 3BD0 0 CODE 0
100 3BD6 0 CODE 0
101 3C04 0 CODE 0
102 3C26 0 CODE 0
103 3C36 0 CODE 0
104 3C3A 0 CODE 0
106 3C3E 0 CODE 0
109 3C40 0 CODE 0
110 3C52 0 CODE 0
111 3C5A 0 CODE 0
113 3C5E 0 CODE 0
115 3C64 0 CODE 0
116 3C78 0 CODE 0
118 3C7A 0 CODE 0
119 3C86 0 CODE 0
120 3C88 0 CODE 0
106 3C8A 0 CODE 0
121 3C9E 0 CODE 0
124 3CA0 0 CODE 0
127 3CB2 0 CODE 0
128 3CC6 0 CODE 0
132 3CDA 0 CODE 0
134 3CEC 0 CODE 0
135 3CFE 0 CODE 0
136 3D10 0 CODE 0
137 3D18 0 CODE 0
139 3D1C 0 CODE 0
141 3D22 0 CODE 0
142 3D36 0 CODE 0
144 3D38 0 CODE 0
145 3D44 0 CODE 0
153 3D4A 0 CODE 0
154 3D76 0 CODE 0
155 3DA6 0 CODE 0
156 3DAA 0 CODE 0
157 3DAC 0 CODE 0
158 3DC0 0 CODE 0
162 3DD0 0 CODE 0
163 3DE2 0 CODE 0
166 3DE4 0 CODE 0
167 3E12 0 CODE 0
172 3E26 0 CODE 0
173 3E32 0 CODE 0
174 3E44 0 CODE 0
176 3E46 0 CODE 0
177 3E5A 0 CODE 0
178 3E5E 0 CODE 0
180 3E62 0 CODE 0
182 3E68 0 CODE 0
183 3E7E 0 CODE 0
171 3E80 0 CODE 0
192 3E92 0 CODE 0
193 3E98 0 CODE 0
194 3EAA 0 CODE 0
195 3EC4 0 CODE 0
196 3ECA 0 CODE 0
197 3ECE 0 CODE 0
198 3ED0 0 CODE 0
202 3EE6 0 CODE 0
203 3EE8 0 CODE 0
204 3EFC 0 CODE 0
205 3F08 0 CODE 0
206 3F1A 0 CODE 0
207 3F44 0 CODE 0
208 3F58 0 CODE 0
215 3F5A 0 CODE 0
216 3F82 0 CODE 0
218 3F94 0 CODE 0
219 3FA8 0 CODE 0
225 3FAC 0 CODE 0
226 3FC0 0 CODE 0
227 3FC2 0 CODE 0
230 3FC6 0 CODE 0
232 3FCA 0 CODE 0
233 3FD2 0 CODE 0
234 3FE4 0 CODE 0
236 3FE6 0 CODE 0
237 3FF8 0 CODE 0
