pamelinaking,pamelinakingspassword,3,pamelina.king@fakecompany.com,1
cookieryland,cookierylandspassword,3,cookie.ryland@fakecompany.com,2
kerstinfroment,kerstinfromentspassword,2,kerstin.froment@fakecompany.com,3
yuriandrick,yuriandrickspassword,2,yuri.andrick@fakecompany.com,4
scotshellum,scotshellumspassword,1,scot.shellum@fakecompany.com,5
franstubbeley,franstubbeleyspassword,1,fran.stubbeley@fakecompany.com,6
angekoene,angekoenespassword,1,ange.koene@fakecompany.com,7
mirandale surf,mirandale surfspassword,1,miranda.le surf@fakecompany.com,8
quintavalasek,quintavalasekspassword,1,quinta.valasek@fakecompany.com,9
earlekid,earlekidspassword,1,earle.kid@fakecompany.com,10
jeremiasroddam,jeremiasroddamspassword,1,jeremias.roddam@fakecompany.com,11
deankidner,deankidnerspassword,1,dean.kidner@fakecompany.com,12
jodimerriday,jodimerridayspassword,1,jodi.merriday@fakecompany.com,13
paviawhilde,paviawhildespassword,1,pavia.whilde@fakecompany.com,14
allenearne,allenearnespassword,1,allene.arne@fakecompany.com,15
hewhempel,hewhempelspassword,1,hew.hempel@fakecompany.com,16
michealhellens,michealhellensspassword,1,micheal.hellens@fakecompany.com,17
rossycalverley,rossycalverleyspassword,1,rossy.calverley@fakecompany.com,18
frankygaunter,frankygaunterspassword,1,franky.gaunter@fakecompany.com,19
elenimckiddin,elenimckiddinspassword,1,eleni.mckiddin@fakecompany.com,20
dillonleneve,dillonlenevespassword,1,dillon.leneve@fakecompany.com,21
dotsell,dotsellspassword,1,dot.sell@fakecompany.com,22
daunemcmeanma,daunemcmeanmaspassword,1,daune.mcmeanma@fakecompany.com,23
drucycattellion,drucycattellionspassword,1,drucy.cattellion@fakecompany.com,24
sloandarth,sloandarthspassword,1,sloan.darth@fakecompany.com,25
abeninotti,abeninottispassword,1,abe.ninotti@fakecompany.com,26
webbraunroth,webbraunrothspassword,1,web.braunroth@fakecompany.com,27
coopfenny,coopfennyspassword,1,coop.fenny@fakecompany.com,28
danedeeks,danedeeksspassword,1,dane.deeks@fakecompany.com,29
fernandojackman,fernandojackmanspassword,1,fernando.jackman@fakecompany.com,30
brandyngrinvalds,brandyngrinvaldsspassword,1,brandyn.grinvalds@fakecompany.com,31
loiscrus,loiscrusspassword,1,lois.crus@fakecompany.com,32
morganicabrigg,morganicabriggspassword,1,morganica.brigg@fakecompany.com,33
susimacmaykin,susimacmaykinspassword,1,susi.macmaykin@fakecompany.com,34
shirleypleaden,shirleypleadenspassword,1,shirley.pleaden@fakecompany.com,35
barbettesimchenko,barbettesimchenkospassword,1,barbette.simchenko@fakecompany.com,36
morrismatura,morrismaturaspassword,1,morris.matura@fakecompany.com,37
frediornils,frediornilsspassword,1,fredi.ornils@fakecompany.com,38
samshipp,samshippspassword,1,sam.shipp@fakecompany.com,39
readelen,readelenspassword,1,read.elen@fakecompany.com,40
piercovendon,piercovendonspassword,1,pier.covendon@fakecompany.com,41
elianoragilbank,elianoragilbankspassword,1,elianora.gilbank@fakecompany.com,42
evadeknevet,evadeknevetspassword,1,eva.deknevet@fakecompany.com,43
valenkawoodroof,valenkawoodroofspassword,1,valenka.woodroof@fakecompany.com,44
fanechkaellyatt,fanechkaellyattspassword,1,fanechka.ellyatt@fakecompany.com,45
deloreskoubek,deloreskoubekspassword,1,delores.koubek@fakecompany.com,46
crystalkent,crystalkentspassword,1,crystal.kent@fakecompany.com,47
carlynnmcronald,carlynnmcronaldspassword,1,carlynn.mcronald@fakecompany.com,48
kimbraerasmus,kimbraerasmusspassword,1,kimbra.erasmus@fakecompany.com,49
rebeccamaccleay,rebeccamaccleayspassword,1,rebecca.maccleay@fakecompany.com,50