pe\edu\uni\jrodriguezb\interfaces\Apple.class
pe\edu\uni\jrodriguezb\interfaces\Fruit.class
pe\edu\uni\jrodriguezb\interfaces\Edible.class
pe\edu\uni\jrodriguezb\interfaces\Tiger.class
pe\edu\uni\jrodriguezb\interfaces\Animal.class
pe\edu\uni\jrodriguezb\interfaces\Orange.class
pe\edu\uni\jrodriguezb\interfaces\TestInterfaces.class
pe\edu\uni\jrodriguezb\interfaces\Chicken.class
