{
  "project_info": {
    "project_number": "204794777136",
    "firebase_url": "https://mbsal-57b9e.firebaseio.com",
    "project_id": "mbsal-57b9e",
    "storage_bucket": "mbsal-57b9e.appspot.com"
  },
  "client": [
    {
      "client_info": {
        "mobilesdk_app_id": "1:204794777136:android:3881cc7a118197d6d4e7f5",
        "android_client_info": {
          "package_name": "com.rahasak.rahasakapp"
        }
      },
      "oauth_client": [
        {
          "client_id": "204794777136-f5cf7uhjhn3sjveq74pu9grjbcot6jv3.apps.googleusercontent.com",
          "client_type": 3
        }
      ],
      "api_key": [
        {
          "current_key": "AIzaSyDSJ9H_xqlKd-yKCtLWncvO2GVxiFy0sZA"
        }
      ],
      "services": {
        "appinvite_service": {
          "other_platform_oauth_client": [
            {
              "client_id": "204794777136-f5cf7uhjhn3sjveq74pu9grjbcot6jv3.apps.googleusercontent.com",
              "client_type": 3
            },
            {
              "client_id": "204794777136-q7toeg687cm4f9813jovg0jblb6b1kgv.apps.googleusercontent.com",
              "client_type": 2,
              "ios_info": {
                "bundle_id": "com.rahasak.promize.mbsl"
              }
            }
          ]
        }
      }
    },
    {
      "client_info": {
        "mobilesdk_app_id": "1:204794777136:android:3e03cc6f830ef16c",
        "android_client_info": {
          "package_name": "com.rahasak.lekana"
        }
      },
      "oauth_client": [
        {
          "client_id": "204794777136-f5cf7uhjhn3sjveq74pu9grjbcot6jv3.apps.googleusercontent.com",
          "client_type": 3
        }
      ],
      "api_key": [
        {
          "current_key": "AIzaSyDSJ9H_xqlKd-yKCtLWncvO2GVxiFy0sZA"
        }
      ],
      "services": {
        "appinvite_service": {
          "other_platform_oauth_client": [
            {
              "client_id": "204794777136-f5cf7uhjhn3sjveq74pu9grjbcot6jv3.apps.googleusercontent.com",
              "client_type": 3
            },
            {
              "client_id": "204794777136-q7toeg687cm4f9813jovg0jblb6b1kgv.apps.googleusercontent.com",
              "client_type": 2,
              "ios_info": {
                "bundle_id": "com.rahasak.promize.mbsl"
              }
            }
          ]
        }
      }
    },
    {
      "client_info": {
        "mobilesdk_app_id": "1:204794777136:android:8cbf9af82dc87eb5",
        "android_client_info": {
          "package_name": "com.rahasak.promize"
        }
      },
      "oauth_client": [
        {
          "client_id": "204794777136-f5cf7uhjhn3sjveq74pu9grjbcot6jv3.apps.googleusercontent.com",
          "client_type": 3
        }
      ],
      "api_key": [
        {
          "current_key": "AIzaSyDSJ9H_xqlKd-yKCtLWncvO2GVxiFy0sZA"
        }
      ],
      "services": {
        "appinvite_service": {
          "other_platform_oauth_client": [
            {
              "client_id": "204794777136-f5cf7uhjhn3sjveq74pu9grjbcot6jv3.apps.googleusercontent.com",
              "client_type": 3
            },
            {
              "client_id": "204794777136-q7toeg687cm4f9813jovg0jblb6b1kgv.apps.googleusercontent.com",
              "client_type": 2,
              "ios_info": {
                "bundle_id": "com.rahasak.promize.mbsl"
              }
            }
          ]
        }
      }
    },
    {
      "client_info": {
        "mobilesdk_app_id": "1:204794777136:android:5da8c8cc5ebe0701",
        "android_client_info": {
          "package_name": "com.score.lekana"
        }
      },
      "oauth_client": [
        {
          "client_id": "204794777136-f5cf7uhjhn3sjveq74pu9grjbcot6jv3.apps.googleusercontent.com",
          "client_type": 3
        }
      ],
      "api_key": [
        {
          "current_key": "AIzaSyDSJ9H_xqlKd-yKCtLWncvO2GVxiFy0sZA"
        }
      ],
      "services": {
        "appinvite_service": {
          "other_platform_oauth_client": [
            {
              "client_id": "204794777136-f5cf7uhjhn3sjveq74pu9grjbcot6jv3.apps.googleusercontent.com",
              "client_type": 3
            },
            {
              "client_id": "204794777136-q7toeg687cm4f9813jovg0jblb6b1kgv.apps.googleusercontent.com",
              "client_type": 2,
              "ios_info": {
                "bundle_id": "com.rahasak.promize.mbsl"
              }
            }
          ]
        }
      }
    },
    {
      "client_info": {
        "mobilesdk_app_id": "1:204794777136:android:c980d754a6510d7b",
        "android_client_info": {
          "package_name": "com.score.promize"
        }
      },
      "oauth_client": [
        {
          "client_id": "204794777136-f5cf7uhjhn3sjveq74pu9grjbcot6jv3.apps.googleusercontent.com",
          "client_type": 3
        }
      ],
      "api_key": [
        {
          "current_key": "AIzaSyDSJ9H_xqlKd-yKCtLWncvO2GVxiFy0sZA"
        }
      ],
      "services": {
        "appinvite_service": {
          "other_platform_oauth_client": [
            {
              "client_id": "204794777136-f5cf7uhjhn3sjveq74pu9grjbcot6jv3.apps.googleusercontent.com",
              "client_type": 3
            },
            {
              "client_id": "204794777136-q7toeg687cm4f9813jovg0jblb6b1kgv.apps.googleusercontent.com",
              "client_type": 2,
              "ios_info": {
                "bundle_id": "com.rahasak.promize.mbsl"
              }
            }
          ]
        }
      }
    }
  ],
  "configuration_version": "1"
}
