{
	"__version__": "0.1.6",
	"__description__": "Sample settings file",
	"width": 500,
	"height": 585,
	"rowHeight": 25,
	"labelColumnX": 10,
	"fieldColumnX": 150,
	"rowY": 90,
	"textBoxSize": 320,
	"title": "Build Prompt",
	"header": "",
	"footer": "Warning: This system is about to be rebuilt resulting in the loss of all data. If you DO NOT wish to proceed, immediately power off and remove any thumb drives.",
	"errorColor": "#FFFF77",
	"headerColor": "#0160aa",
	"fields": [{
			"type": "info",
			"name": "infIpAddress",
			"label": "IP Address",
			"query": "SELECT IPAddress FROM Win32_NetworkAdapterConfiguration WHERE IPEnabled = True AND DHCPEnabled = True"
		},
		{
			"type": "info",
			"name": "InfMacAddress",
			"label": "MAC Address",
			"query": "SELECT MACAddress FROM Win32_NetworkAdapterConfiguration WHERE IPEnabled = True AND DHCPEnabled = True"
		},
		{
			"type": "text",
			"name": "OSDComputerName",
			"label": "Computer Name",
			"default": "SELECT SerialNumber FROM Win32_BIOS",
			"required": true,
			"maxLength": 15
		},
		{
			"type": "select",
			"name": "BUILD",
			"label": "Build",
			"options": {
				"standard": "Standard",
				"marketing": "Marketing",
				"it": "IT"
			}
		},
		{
			"type": "select",
			"name": "adapter",
			"label": "Adapter",
			"default": "select Name,Index from Win32_NetworkAdapter where NetConnectionStatus = 2 AND AdapterTypeID = 0",
			"wmiLabel": "Name",
			"wmiValue": "Index"
		},
		{
			"type": "password",
			"name": "PASSWORD",
			"label": "Password",
			"required": true
		},
		{
			"type": "check",
			"name": "OPTION1",
			"label": "Option 1?",
			"checked": true
		},
		{
			"type": "radio",
			"name": "radioEx",
			"label": "Radio Example",
			"default": "standard",
			"options": {
				"standard": "Standard",
				"marketing": "Marketing",
				"it": "IT"
			
			}
		},
		{
			"type": "radio",
			"name": "radioEx2",
			"label": "Radio Example 2",
			"default": "rexO1",
			"options": {
				"rexO1": "Rex Opt 3",
				"rexO2": "Rex Opt 2",
				"rexO3": "Rex Opt 1"
			
			}
		},
		{
			"type": "cascade",
			"name": "cascadeEx",
			"label": "Cascade Example",
			"dependsOn": "BUILD",
			"options": {
				"standard": {
					"std1": "Standard 1",
					"std2": "Standard 2",
					"std3": "Standard 3"
				},
				"marketing": {
					"m1": "Marketing 1",
					"m2": "Marketing 2",
					"m3": "Marketing 3"
				},
				"it": {
					"it1": "IT 1",
					"it2": "IT 2",
					"it3": "IT 3"
				}
			}
		}
	]
}