<?xml version="1.0" encoding="utf-8"?>
<!-- Generator: Adobe Illustrator 23.0.2, SVG Export Plug-In . SVG Version: 6.00 Build 0)  -->
<svg version="1.1" id="Слой_1" xmlns="http://www.w3.org/2000/svg" xmlns:xlink="http://www.w3.org/1999/xlink" x="0px" y="0px"
	 viewBox="0 0 23.8 23.8" style="enable-background:new 0 0 23.8 23.8;" xml:space="preserve">
<path class="st0" d="M19.8,7.9c-1.3,0-2.4,0.6-3.1,1.5L7.8,4.8C7.9,4.6,7.9,4.3,7.9,4c0-2.2-1.8-4-4-4C1.8,0,0,1.8,0,4
	c0,2.2,1.8,4,4,4c1.2,0,2.2-0.5,2.9-1.3l9,4.7c0,0.2-0.1,0.4-0.1,0.6c0,0.4,0.1,0.8,0.2,1.2l-8.8,4.5c-0.7-1-1.9-1.7-3.3-1.7
	c-2.2,0-4,1.8-4,4c0,2.2,1.8,4,4,4c2.2,0,4-1.8,4-4c0-0.1,0-0.2,0-0.3l9.2-4.7c0.7,0.7,1.7,1.1,2.7,1.1c2.2,0,4-1.8,4-4
	C23.8,9.7,22,7.9,19.8,7.9z"/>
</svg>
