<?xml version="1.0" encoding="utf-8"?>
<!-- Generator: Adobe Illustrator 23.0.2, SVG Export Plug-In . SVG Version: 6.00 Build 0)  -->
<svg version="1.1" id="Слой_1" xmlns="http://www.w3.org/2000/svg" xmlns:xlink="http://www.w3.org/1999/xlink" x="0px" y="0px"
	 viewBox="0 0 30.9 24" style="enable-background:new 0 0 30.9 24;" xml:space="preserve">
<style type="text/css">
	.st0{fill:#FFFFFF;}
</style>
<rect x="27.9" y="0" class="st0" width="3" height="24"/>
<polygon class="st0" points="9.7,4 16.2,10.5 0,10.5 0,13.5 16.2,13.5 9.7,20 11.9,22.1 22,12 11.9,1.9 "/>
</svg>
