
  <svg xmlns="http://www.w3.org/2000/svg" viewBox="0 0 97.5 104">
    <path
      d="M74.5,47.4c-0.5-1.2-1.7-1.9-3-1.9h-13V3.2C58.5,1.5,57,0,55.3,0h-13C40.5,0,39,1.5,39,3.2v42.2H26
            c-1.8,0-3.2,1.5-3.2,3.2c0,0.8,0.3,1.5,0.8,2.1l22.8,26c1.2,1.3,3.2,1.5,4.6,0.3c0.1-0.1,0.2-0.2,0.3-0.3l22.8-26
            C74.8,49.9,75,48.6,74.5,47.4z"
    />
    <path
      d="M84.5,71.5V91H13V71.5H0v26c0,3.6,2.9,6.5,6.5,6.5H91c3.6,0,6.5-2.9,6.5-6.5c0,0,0,0,0,0v-26H84.5z"
    />
  </svg>