
  <svg xmlns="http://www.w3.org/2000/svg" viewBox="0 0 64 64">
    <path
      d="M50.6,32.1c-4.1,0-7.5,3.4-7.5,7.5s3.4,7.5,7.5,7.5h10.6c0,0,0.1,0,0.1,0s0.1,0,0.1,0c1.4,0,2.5-1.1,2.5-2.5V25
            c0-3.2-1.5-6.2-4.1-8.1l-8.5-14c-0.7-1.2-2.3-1.6-3.4-0.8c0,0,0,0,0,0L41.6,6l-2.8-4.8c-0.7-1.2-2.2-1.6-3.4-0.9c0,0,0,0,0,0
            L11.3,15H7.5C6.1,15,5,13.9,5,12.6c0-1.4,1.1-2.4,2.5-2.4h4.6c1.4,0,2.5-1.1,2.5-2.5s-1.1-2.5-2.5-2.5H7.5C4,5.1,1,7.5,0.2,10.9
            c-0.1,0.3-0.2,0.6-0.2,1V54c0,5.5,4.5,10,10,10h44c4.3,0,8.1-2.7,9.5-6.8c0.4-1.3-0.3-2.7-1.6-3.2c-1.3-0.4-2.7,0.3-3.1,1.6
            c-0.7,2-2.6,3.4-4.7,3.4H10c-2.8,0-5-2.2-5-5V19.6C5.8,19.9,6.6,20,7.5,20H54c2.8,0,5,2.2,5,5v7.1H50.6z M59,42.1h-8.4
            c-1.4,0-2.5-1.1-2.5-2.5s1.1-2.5,2.5-2.5H59V42.1z M20.9,15l14.9-9l2.7,4.5c0.1,0.1,0.1,0.2,0.2,0.4c0.1,0.1,0.1,0.2,0.2,0.2
            l2.3,3.9H20.9z M46.9,15l-2.8-4.7l4.2-2.6l4.4,7.3H46.9z"
    />
  </svg>