<?xml version="1.0" encoding="utf-8"?>
<!-- Generator: Adobe Illustrator 23.0.2, SVG Export Plug-In . SVG Version: 6.00 Build 0)  -->
<svg version="1.1" id="Layer_1" xmlns="http://www.w3.org/2000/svg" xmlns:xlink="http://www.w3.org/1999/xlink" x="0px" y="0px"
	 viewBox="0 0 381.1 494.1" style="enable-background:new 0 0 381.1 494.1;" xml:space="preserve">
<g>
	<g>
		<path d="M30.9,293l274.5,187.9c12.7,8.7,25.4,13.3,36.1,13.3c20.5,0,33.2-16.5,33.2-44V44c0-27.5-12.7-44-33.2-44
			c-10.6,0-23.2,4.6-35.9,13.3L31,201.2c-17.7,12.1-27.4,28.4-27.4,45.9C3.5,264.6,13.2,280.9,30.9,293z"/>
	</g>
</g>
</svg>
