
  <svg xmlns="http://www.w3.org/2000/svg" viewBox="0 0 94.1 89.4">
    <path
      d="M47.1,0C21.1,0,0,19,0,42.3c0,8.2,2.6,16.2,7.5,22.9c-0.9,10.3-3.4,17.9-7,21.5c-0.6,0.6-0.6,1.6,0,2.2
	c0.3,0.3,0.7,0.5,1.1,0.5c0.1,0,0.1,0,0.2,0c0.6-0.1,15.4-2.2,26.1-8.4c6.1,2.5,12.6,3.7,19.2,3.7c25.9,0,47.1-19,47.1-42.3
	S73,0,47.1,0z M25.1,48.6c-3.5,0-6.3-2.8-6.3-6.3c0-3.5,2.8-6.3,6.3-6.3s6.3,2.8,6.3,6.3C31.4,45.8,28.6,48.6,25.1,48.6z M47.1,48.6
	c-3.5,0-6.3-2.8-6.3-6.3s2.8-6.3,6.3-6.3s6.3,2.8,6.3,6.3C53.3,45.8,50.5,48.6,47.1,48.6L47.1,48.6z M69,48.6
	c-3.5,0-6.3-2.8-6.3-6.3s2.8-6.3,6.3-6.3s6.3,2.8,6.3,6.3C75.3,45.8,72.5,48.6,69,48.6L69,48.6z"
    />
  </svg>