<?xml version="1.0" encoding="utf-8"?>
<!-- Generator: Adobe Illustrator 23.0.2, SVG Export Plug-In . SVG Version: 6.00 Build 0)  -->
<svg version="1.1" id="Слой_1" xmlns="http://www.w3.org/2000/svg" xmlns:xlink="http://www.w3.org/1999/xlink" x="0px" y="0px"
	 viewBox="0 0 96 96" style="enable-background:new 0 0 96 96;" xml:space="preserve">
<style type="text/css">
	.st0{fill:url(#SVGID_1_);}
	.st1{fill:none;}
	.st2{fill:none;stroke:#252D45;stroke-width:5;}
	.st3{fill:none;stroke:#252D45;stroke-width:3;}
	.st4{fill:none;stroke:#252D45;stroke-width:4;}
	.st5{fill:#2C344D;}
</style>
<linearGradient id="SVGID_1_" gradientUnits="userSpaceOnUse" x1="-7.2541" y1="147.6671" x2="-7.8301" y2="146.7361" gradientTransform="matrix(96 0 0 -96 760 14198.8193)">
	<stop  offset="0" style="stop-color:#00FFB3"/>
	<stop  offset="1" style="stop-color:#0065FF"/>
</linearGradient>
<path class="st0" d="M19,0h58c10.5,0,19,8.5,19,19v58c0,10.5-8.5,19-19,19H19C8.5,96,0,87.5,0,77V19C0,8.5,8.5,0,19,0z"/>
<g transform="translate(1591 701)">
	<circle class="st1" cx="-1543" cy="-653" r="21"/>
	<circle class="st2" cx="-1543" cy="-653" r="18.5"/>
</g>
<g transform="translate(1602 712)">
	<circle class="st1" cx="-1554" cy="-664" r="10"/>
	<circle class="st3" cx="-1554" cy="-664" r="8.5"/>
</g>
<g transform="translate(1580 690)">
	<circle class="st1" cx="-1532" cy="-642" r="32"/>
	<circle class="st4" cx="-1532" cy="-642" r="30"/>
</g>
<path class="st3" d="M38.1,19.6c0,0,25,11.6,24.5,17.4"/>
<circle class="st5" cx="48" cy="48" r="2"/>
</svg>
