<?xml version="1.0" encoding="utf-8"?>
<!-- Generator: Adobe Illustrator 25.0.1, SVG Export Plug-In . SVG Version: 6.00 Build 0)  -->
<svg version="1.1" id="Слой_1" xmlns="http://www.w3.org/2000/svg" xmlns:xlink="http://www.w3.org/1999/xlink" x="0px" y="0px"
	 viewBox="0 0 37.1 37.2" style="enable-background:new 0 0 37.1 37.2;" xml:space="preserve">
<g>
	<path d="M32.5,36.5h-28c-2.2,0-4-1.8-4-4v-28c0-2.2,1.8-4,4-4h14v4h-14v28h28v-14h4v14C36.5,34.7,34.7,36.5,32.5,36.5z M13.9,26
		l-2.8-2.8L29.7,4.5h-7.2v-4h14v14h-4V7.4L13.9,26z"/>
</g>
</svg>
