
  <svg xmlns="http://www.w3.org/2000/svg" viewBox="0 0 51.84 51.84">
    <style>
    .a {
      fill: #00ffb3;
    }
    .b {
      fill: none;
    }
  </style>
    <circle
      class="a"
      cx="6.912"
      cy="6.912"
      r="6.912"
      transform="translate(19.008 19.008)"
    />
    <path
      class="a"
      d="M17.12,2,13.167,6.32H6.32A4.333,4.333,0,0,0,2,10.64V36.56a4.333,4.333,0,0,0,4.32,4.32H40.88a4.333,4.333,0,0,0,4.32-4.32V10.64a4.333,4.333,0,0,0-4.32-4.32H34.033L30.08,2ZM23.6,34.4A10.8,10.8,0,1,1,34.4,23.6,10.8,10.8,0,0,1,23.6,34.4Z"
      transform="translate(2.32 2.32)"
    />
    <path class="b" d="M0,0H51.84V51.84H0Z" />
  </svg>
