<svg xmlns="http://www.w3.org/2000/svg" width="17" height="3" viewBox="0 0 17 3">
  <g id="Group_2398" data-name="Group 2398" transform="translate(0 0.455)">
    <rect id="Rectangle_1224" data-name="Rectangle 1224" width="17" height="3" transform="translate(0 -0.455)" fill="#fff"/>
  </g>
</svg>
