[
 {
  "matchDate": "13 de octubre de 2007",
  "matchRival": "Argentina",
  "matchScore": "2-0",
  "matchStadium": "Estadio Monumental, Buenos Aires"
 },
 {
  "matchDate": "17 de octubre de 2007",
  "matchRival": "Perú",
  "matchScore": "2-0",
  "matchStadium": "Estadio Nacional, Santiago"
 },
 {
  "matchDate": "18 de noviembre de 2007",
  "matchRival": "Uruguay",
  "matchScore": "2-2",
  "matchStadium": "Estadio Centenario, Montevideo"
 },
 {
  "matchDate": "21 de noviembre de 2007",
  "matchRival": "Paraguay",
  "matchScore": "0-3",
  "matchStadium": "Estadio Nacional, Santiago"
 },
 {
  "matchDate": "15 de junio de 2008",
  "matchRival": "Bolivia",
  "matchScore": "0-2",
  "matchStadium": "Estadio Hernando Siles, La Paz"
 },
 {
  "matchDate": "19 de junio de 2008",
  "matchRival": "Venezuela",
  "matchScore": "2-3",
  "matchStadium": "Estadio José Antonio Anzoátegui, Puerto La Cruz"
 },
 {
  "matchDate": "7 de septiembre de 2008",
  "matchRival": "Brasil",
  "matchScore": "0-3",
  "matchStadium": "Estadio Nacional, Santiago"
 },
 {
  "matchDate": "10 de septiembre de 2008",
  "matchRival": "Colombia",
  "matchScore": "4-0",
  "matchStadium": "Estadio Nacional, Santiago"
 },
 {
  "matchDate": "12 de octubre de 2008",
  "matchRival": "Ecuador",
  "matchScore": "1-0",
  "matchStadium": "Estadio Olímpico Atahualpa, Quito"
 },
 {
  "matchDate": "15 de octubre de 2008",
  "matchRival": "Argentina",
  "matchScore": "1-0",
  "matchStadium": "Estadio Nacional, Santiago"
 },
 {
  "matchDate": "29 de marzo de 2009",
  "matchRival": "Perú",
  "matchScore": "1-3",
  "matchStadium": "Estadio Nacional, Lima"
 },
 {
  "matchDate": "1 de abril de 2009",
  "matchRival": "Uruguay",
  "matchScore": "0-0",
  "matchStadium": "Estadio Nacional, Santiago"
 },
 {
  "matchDate": "6 de junio de 2009",
  "matchRival": "Paraguay",
  "matchScore": "0-2",
  "matchStadium": "Defensores del Chaco, Asunción"
 },
 {
  "matchDate": "10 de junio de 2009",
  "matchRival": "Bolivia",
  "matchScore": "4-0",
  "matchStadium": "Estadio Nacional, Santiago"
 },
 {
  "matchDate": "5 de septiembre de 2009",
  "matchRival": "Venezuela",
  "matchScore": "2-2",
  "matchStadium": "Estadio Nacional, Santiago"
 },
 {
  "matchDate": "9 de septiembre de 2009",
  "matchRival": "Brasil",
  "matchScore": "4-2",
  "matchStadium": "Estadio de Pituaçu, Salvador de Bahía"
 },
 {
  "matchDate": "10 de octubre de 2009",
  "matchRival": "Colombia",
  "matchScore": "2-4",
  "matchStadium": "Estadio Atanasio Girardot, Medellín"
 },
 {
  "matchDate": "14 de octubre de 2009",
  "matchRival": "Ecuador",
  "matchScore": "1-0",
  "matchStadium": "Estadio Nacional, Santiago"
 }
]