%YAML 1.1
%TAG !u! tag:unity3d.com,2011:
--- !u!114 &11400000
MonoBehaviour:
  m_ObjectHideFlags: 0
  m_CorrespondingSourceObject: {fileID: 0}
  m_PrefabInstance: {fileID: 0}
  m_PrefabAsset: {fileID: 0}
  m_GameObject: {fileID: 0}
  m_Enabled: 1
  m_EditorHideFlags: 0
  m_Script: {fileID: 11500000, guid: 9005286f8a93d4a42b71aa3611b49c32, type: 3}
  m_Name: MinionExample_04
  m_EditorClassIdentifier: 
  Card: {fileID: 21300000, guid: 3bd7f8bc57cd86945a52919bdb82aa5a, type: 3}
  Effect: {fileID: 11400000, guid: 64b647413e7db06479b41af3eaf003ed, type: 2}
  m_Name: King Krush
  m_Mana: 9
  m_AttackPoint: 8
  m_HealthPoint: 8
