<svg width="12" height="12" viewBox="0 0 12 12" fill="none" xmlns="http://www.w3.org/2000/svg">
<path fill-rule="evenodd" clip-rule="evenodd" d="M1.0675 0.938269C0.717649 1.30919 0.717649 1.91057 1.06751 2.28149L4.86876 6.3116L1.06848 10.3407C0.718626 10.7116 0.718626 11.313 1.06848 11.6839C1.41834 12.0548 1.98557 12.0548 2.33542 11.6839L6.1357 7.65483L9.93609 11.684C10.2859 12.055 10.8532 12.055 11.203 11.684C11.5529 11.3131 11.5529 10.7117 11.203 10.3408L7.40264 6.31161L11.204 2.28136C11.5539 1.91044 11.5539 1.30906 11.204 0.938143C10.8542 0.567223 10.2869 0.567224 9.93707 0.938143L6.1357 4.96838L2.33445 0.938269C1.98459 0.567349 1.41736 0.567349 1.0675 0.938269Z" fill="#99A8CA"/>
</svg>
