<?xml version="1.0" encoding="utf-8"?>
<!-- Generator: Adobe Illustrator 21.1.0, SVG Export Plug-In . SVG Version: 6.00 Build 0)  -->
<svg version="1.1" id="Layer_1" xmlns="http://www.w3.org/2000/svg" xmlns:xlink="http://www.w3.org/1999/xlink" x="0px" y="0px"
	 viewBox="0 0 13.2 24" style="enable-background:new 0 0 13.2 24;" xml:space="preserve">
<style type="text/css">
	.st0{fill:#30367A;}
</style>
<path class="st0" d="M4.624,19.558V3.634H0V0h13.2v3.634H8.576v15.924H4.624z M3.559,24c-2.387,0-3.516-1.147-3.516-3.574V4.675
	h3.473v15.59c0,0.384,0.126,0.511,0.503,0.511h5.207c0.377,0,0.504-0.128,0.504-0.511V4.675h3.47v15.751
	C13.2,22.853,12.07,24,9.684,24H3.559z"/>
</svg>
