<svg width="1600" height="106" viewBox="0 0 1600 106" fill="none" xmlns="http://www.w3.org/2000/svg">
<path fill-rule="evenodd" clip-rule="evenodd" d="M1879.5 25C1879.5 8.43146 1866.07 -5 1849.5 -5H-71.5C-88.0685 -5 -101.5 8.43146 -101.5 25V31C-101.5 47.5685 -88.0685 61 -71.4999 61H785.634C799.309 61 811.257 70.2601 814.681 83.5C818.105 96.7399 830.053 106 843.728 106H1025.27C1038.95 106 1050.89 96.7399 1054.32 83.5C1057.74 70.2601 1069.69 61 1083.37 61H1849.5C1866.07 61 1879.5 47.5685 1879.5 31V25Z" fill="#152C63"/>
</svg>
