<?xml version="1.0" encoding="utf-8"?>
<!-- Generator: Adobe Illustrator 21.1.0, SVG Export Plug-In . SVG Version: 6.00 Build 0)  -->
<svg version="1.1" id="Layer_1" xmlns="http://www.w3.org/2000/svg" xmlns:xlink="http://www.w3.org/1999/xlink" x="0px" y="0px"
	 viewBox="0 0 22.3 24" style="enable-background:new 0 0 22.3 24;" xml:space="preserve">
<style type="text/css">
	.st0{fill:#00F7B5;}
</style>
<title>hedera--logo</title>
<path class="st0" d="M22.3,24h-3.5v-7.4H3.5V24H0V0h3.5v7.2h15.3V0h3.5V24z M3.6,13.8H19V10H3.6V13.8z"/>
</svg>
