<?xml version="1.0" encoding="utf-8"?>
<!-- Generator: Adobe Illustrator 21.1.0, SVG Export Plug-In . SVG Version: 6.00 Build 0)  -->
<svg version="1.1" id="Layer_1" xmlns="http://www.w3.org/2000/svg" xmlns:xlink="http://www.w3.org/1999/xlink" x="0px" y="0px"
	 viewBox="0 0 21.7 24" style="enable-background:new 0 0 21.7 24;" xml:space="preserve">
<style type="text/css">
	.st0{fill:#00E599;}
	.st1{fill:#00AF92;}
</style>
<title>neo-neo-logo</title>
<g id="Layer_2">
	<g id="Layer_1-2">
		<g id="Layer_2-2">
			<g id="Layer_1-2-2">
				<polygon class="st0" points="0,4.2 0,20.3 10.4,24 10.4,7.8 21.7,3.7 11.5,0 				"/>
				<polygon class="st1" points="11.3,8.3 11.3,17.1 21.7,20.8 21.7,4.4 				"/>
			</g>
		</g>
	</g>
</g>
</svg>
