<?xml version="1.0" encoding="utf-8"?>
<!-- Generator: Adobe Illustrator 21.1.0, SVG Export Plug-In . SVG Version: 6.00 Build 0)  -->
<svg version="1.1" id="Layer_1" xmlns="http://www.w3.org/2000/svg" xmlns:xlink="http://www.w3.org/1999/xlink" x="0px" y="0px"
	 viewBox="0 0 24 22.7" style="enable-background:new 0 0 24 22.7;" xml:space="preserve">
<style type="text/css">
	.st0{fill:url(#SVGID_1_);}
	.st1{opacity:0.1;fill:#FFFFFF;enable-background:new    ;}
</style>
<title>vechain-ven-logo</title>
<g id="Layer_2">
	<g id="Layer_1-2">
		
			<linearGradient id="SVGID_1_" gradientUnits="userSpaceOnUse" x1="0" y1="1285.3527" x2="24" y2="1285.3527" gradientTransform="matrix(1 0 0 -1 0 1296.6803)">
			<stop  offset="0" style="stop-color:#9D4ABE"/>
			<stop  offset="3.000000e-02" style="stop-color:#9055C4"/>
			<stop  offset="0.15" style="stop-color:#6B74D6"/>
			<stop  offset="0.26" style="stop-color:#4C8FE5"/>
			<stop  offset="0.39" style="stop-color:#34A3F0"/>
			<stop  offset="0.52" style="stop-color:#22B2F9"/>
			<stop  offset="0.66" style="stop-color:#18BAFD"/>
			<stop  offset="0.83" style="stop-color:#15BDFF"/>
			<stop  offset="1" style="stop-color:#28BAD5"/>
		</linearGradient>
		<path class="st0" d="M10.3,21.6L0.1,0.7C-0.1,0.4,0.1,0,0.5,0h3.6c0.2,0,0.4,0.1,0.5,0.3L12,15.4c0.7,1.4,2.6,1.4,3.3,0l7.5-15.2
			C22.8,0.1,23,0,23.2,0h0.4c0.3,0,0.4,0.3,0.3,0.5L13.6,21.6C12.9,23,11,23,10.3,21.6L10.3,21.6z"/>
		<path class="st1" d="M10.3,21.6L4.5,0.3C4.4,0.1,4.2,0,4.1,0H0.5C0.1,0-0.1,0.4,0.1,0.7L10.3,21.6z"/>
		<path class="st1" d="M12,15.5L0.1,0.7C-0.1,0.4,0.1,0,0.5,0h3.6c0.2,0,0.4,0.1,0.4,0.3L12,15.5z"/>
	</g>
</g>
</svg>
