<?xml version="1.0" encoding="utf-8"?>
<!-- Generator: Adobe Illustrator 21.1.0, SVG Export Plug-In . SVG Version: 6.00 Build 0)  -->
<svg version="1.1" id="Layer_1" xmlns="http://www.w3.org/2000/svg" xmlns:xlink="http://www.w3.org/1999/xlink" x="0px" y="0px"
	 viewBox="0 0 21.4 24.1" style="enable-background:new 0 0 21.4 24.1;" xml:space="preserve">
<style type="text/css">
	.st0{fill:#0900A2;}
	.st1{fill:#FFFFFF;}
</style>
<g>
	<path class="st0" d="M11.6,0.3l8.8,5.1C21,5.7,21.3,6.3,21.3,7v10.1c0,0.7-0.3,1.3-0.9,1.6l-8.8,5.1c-0.6,0.3-1.3,0.3-1.9,0L1,18.7
		c-0.6-0.3-0.9-0.9-0.9-1.6V7c0-0.7,0.3-1.3,0.9-1.6l8.8-5.1C10.4,0,11,0,11.6,0.3L11.6,0.3z"/>
</g>
<path class="st1" d="M11.7,18.8c2.6-0.3,4.2-1.7,4.2-4.1c0-2-1-3.4-3.5-4l-2.1-0.5C9.5,10,9.1,9.7,9.1,8.9c0-0.9,0.6-1.4,1.6-1.4
	c1.1,0,1.8,0.6,1.8,1.5h3.1c0-2.1-1.5-3.6-3.8-3.9V3.7h-2v1.5C7.3,5.5,5.8,7,5.8,9.2c0,1.8,1,3.2,3.4,3.9l2.2,0.6
	c0.9,0.2,1.2,0.6,1.2,1.3c0,0.9-0.7,1.4-1.9,1.4c-1.4,0-2.2-0.6-2.2-1.9H5.5c0,2.4,1.5,4,4.2,4.4v1.7h2V18.8z"/>
</svg>
