<svg width="33" height="33" viewBox="0 0 33 33" fill="none" xmlns="http://www.w3.org/2000/svg">
<circle cx="16.5" cy="16.5" r="16.5" fill="#00CDCD"/>
<path d="M22.9 9.875H10.1C9.2 9.875 8.5 10.575 8.5 11.475V25.875L11.7 22.675H22.9C23.8 22.675 24.5 21.975 24.5 21.075V11.475C24.5 10.575 23.8 9.875 22.9 9.875ZM14.1 17.075H12.5V15.475H14.1V17.075ZM17.3 17.075H15.7V15.475H17.3V17.075ZM20.5 17.075H18.9V15.475H20.5V17.075Z" fill="#152C63"/>
</svg>
