<svg width="19" height="20" viewBox="0 0 19 20" fill="none" xmlns="http://www.w3.org/2000/svg">
<path d="M15.1075 12.5919C15.4378 12.7213 15.5648 13.2252 15.5901 13.445C15.641 13.846 15.5269 14.0011 15.3999 14.0011C15.2728 14.0011 15.0948 13.846 14.9047 13.5358C14.7141 13.2252 14.6379 12.8764 14.7397 12.6952C14.8028 12.5787 14.9425 12.5272 15.1079 12.5919H15.1075ZM13.1779 14.053C13.3811 14.053 13.6096 14.1434 13.8128 14.3242C14.2062 14.6605 14.3207 15.0483 14.1174 15.3328C14.003 15.475 13.8128 15.5654 13.597 15.5654C13.3811 15.5654 13.1527 15.4879 13.0003 15.3456C12.6448 15.0354 12.5434 14.5179 12.7715 14.2338C12.8606 14.1173 13.0003 14.053 13.1779 14.053ZM8.73476 17.7891C3.91004 17.7891 0 13.807 0 8.89435C0 3.98167 3.91044 0 8.73437 0C13.5587 0 17.4691 3.98207 17.4691 8.89435C17.4691 10.5619 17.0122 12.1266 16.238 13.4583C16.2123 13.4968 16.1488 13.484 16.1362 13.4321C15.8316 11.2474 14.5239 10.0448 12.6196 9.68313C12.4542 9.65701 12.429 9.55375 12.6448 9.52803C13.2288 9.47619 14.0539 9.48905 14.4856 9.56661C14.5108 9.34681 14.5239 9.11415 14.5239 8.8815C14.5239 5.63637 11.9337 2.99881 8.74699 2.99881C5.56064 2.99881 2.97051 5.63637 2.97051 8.8815C2.97051 12.1266 5.56064 14.7642 8.74739 14.7642H9.01374C8.92325 14.2393 8.88491 13.7065 8.89931 13.1738C8.91233 12.8117 8.98849 12.7599 9.1408 13.0444C9.94065 14.4536 11.0834 15.7205 13.3176 16.2248C15.1458 16.6387 16.9739 17.1169 18.9418 19.6636C19.1193 19.8834 18.853 20.1161 18.6498 19.9352C16.644 18.125 14.8159 17.5303 13.1526 17.5303C11.2862 17.5436 10.0168 17.7891 8.73437 17.7891H8.73476Z" fill="#FF8C00"/>
</svg>
