<svg width="32" height="32" viewBox="0 0 32 32" fill="none" xmlns="http://www.w3.org/2000/svg">
<path d="M16 4.52942L10.7139 11.9165L8.5 22.8365L16 27.4706L23.5 22.8365L21.241 11.8706L16 4.52942ZM9.71988 22.3318L11.3916 14.0271L15.1867 25.7271L9.71988 22.3318ZM11.9337 12.1459L16 6.45648L20.0663 12.1459L16 24.6259L11.9337 12.1459ZM16.7681 25.7271L20.5633 14.0271L22.2349 22.3318L16.7681 25.7271Z" fill="#f2a314"/>
</svg>
