<svg width="22" height="22" viewBox="0 0 22 22" fill="none" xmlns="http://www.w3.org/2000/svg">
<g clip-path="url(#clip0)">
<path d="M3.87386 13.6701C4.04947 14.2722 4.29316 14.8527 4.60136 15.3974L3.72335 16.5048C3.43665 16.8668 3.4689 17.3828 3.79144 17.7089L5.30377 19.2213C5.62988 19.5474 6.14594 19.576 6.50789 19.2893L7.6081 18.4185C8.17432 18.7446 8.77639 18.999 9.40354 19.1782L9.56839 20.5938C9.62215 21.0525 10.0092 21.3965 10.4679 21.3965H12.6074C13.0661 21.3965 13.4531 21.0525 13.5069 20.5938L13.6646 19.2284C14.3383 19.0528 14.9834 18.7912 15.589 18.4507L16.6534 19.2929C17.0154 19.5796 17.5314 19.5473 17.8575 19.2248L19.3699 17.7125C19.696 17.3864 19.7246 16.8703 19.4379 16.5084L18.6101 15.4583C18.9541 14.8634 19.2229 14.2291 19.4021 13.5661L20.6779 13.4192C21.1367 13.3654 21.4807 12.9784 21.4807 12.5197V10.3802C21.4807 9.92149 21.1366 9.53445 20.6779 9.48069L19.42 9.33376C19.248 8.67794 18.99 8.05079 18.6603 7.46306L19.4344 6.4847C19.7211 6.12275 19.6888 5.60669 19.3663 5.28057L17.8576 3.77183C17.5314 3.44571 17.0154 3.41704 16.6534 3.70374L15.7037 4.45632C15.0873 4.09436 14.4279 3.81842 13.7363 3.63207L13.5929 2.40285C13.5392 1.94413 13.1521 1.6001 12.6934 1.6001H10.5539C10.0952 1.6001 9.70819 1.94413 9.65443 2.40285L9.51109 3.63207C8.80151 3.822 8.12419 4.1087 7.49345 4.48499L6.50793 3.70374C6.14598 3.41704 5.62992 3.4493 5.3038 3.77183L3.79147 5.28416C3.46536 5.61028 3.43669 6.12633 3.72338 6.48829L4.54764 7.53115C4.21794 8.12605 3.96708 8.76036 3.80222 9.41977L2.48342 9.57028C2.0247 9.62404 1.68066 10.0111 1.68066 10.4698V12.6093C1.68066 13.068 2.0247 13.455 2.48342 13.5088L3.87386 13.6701ZM11.6254 7.88239C13.575 7.88239 15.1626 9.46998 15.1626 11.4195C15.1626 13.3691 13.575 14.9566 11.6254 14.9566C9.67594 14.9566 8.08831 13.3691 8.08831 11.4195C8.08831 9.46998 9.6759 7.88239 11.6254 7.88239Z" fill="white"/>
</g>
<defs>
<clipPath id="clip0">
<rect width="21.12" height="21.12" fill="white" transform="translate(0.360352 0.280029)"/>
</clipPath>
</defs>
</svg>
