<svg width="2" height="49" viewBox="0 0 2 49" fill="none" xmlns="http://www.w3.org/2000/svg">
<path d="M0.999988 48.5L1 0.999882" stroke="#00CDCD" stroke-linecap="round" stroke-linejoin="round" stroke-dasharray="3 3"/>
</svg>
