<?xml version="1.0" encoding="utf-8"?>
<!-- Generator: Adobe Illustrator 21.1.0, SVG Export Plug-In . SVG Version: 6.00 Build 0)  -->
<svg version="1.1" id="Layer_1" xmlns="http://www.w3.org/2000/svg" xmlns:xlink="http://www.w3.org/1999/xlink" x="0px" y="0px"
	 viewBox="0 0 24 24" style="enable-background:new 0 0 24 24;" xml:space="preserve">
<style type="text/css">
	.st0{fill:#F7A800;}
	.st1{fill:#67B2E8;}
	.st2{fill:#00C4B3;}
</style>
<path d="M12,24l-0.1-0.1C6.5,20.8,2.5,15.6,0.8,9.4c-0.3-1-0.5-2-0.6-3c-0.1-1-0.2-2-0.2-3c0-0.2,0-0.1,0.1-0.2c2-1.1,4.1-2,6.4-2.5
	c0.8-0.2,1.7-0.3,2.5-0.4C10.2,0,11.4,0,12.6,0c0.7,0,1.3,0.1,2,0.1c3.3,0.4,6.4,1.3,9.3,3c0,0,0.1,0,0.1,0.1c0,0,0.1,0.1,0.1,0.1
	v0.2c0,0.6,0,1.2-0.1,1.8c-0.1,0.8-0.2,1.7-0.3,2.5c-0.3,1.8-0.9,3.5-1.6,5.2c-1.2,2.6-2.8,5-4.8,7.1c-1.5,1.5-3.1,2.8-4.9,3.8
	C12.1,23.9,12.1,23.9,12,24L12,24z"/>
<path class="st0" d="M1.1,3.9c1.5-0.8,3-1.5,4.6-2c2.2-0.7,4.4-1,6.7-0.9c1.1,0,2.8,0.2,3.1,0.3c0,0,0,0,0,0c-0.1,0-0.2,0.1-0.3,0.1
	C13.3,2.3,12,4,11.6,6c-0.1,0.3-0.1,0.7-0.1,1c0,0.5-0.1,1-0.2,1.5c-0.5,1.8-2,3.2-3.8,3.6c-2.4,0.5-4.7-0.6-5.8-2.8
	C1.7,9.1,1.7,9,1.6,8.8C1.5,8.1,1.3,7.4,1.2,6.6C1.1,5.8,1.1,4.9,1.1,4.1C1.1,4,1.1,4,1.1,3.9L1.1,3.9z"/>
<path class="st1" d="M18,17.7c0-0.2,0-0.4,0.1-0.6c0.1-1.1-0.2-2.2-0.7-3.2c-0.5-1-1.2-1.7-2.2-2.3c-0.1-0.1-0.2-0.1-0.3-0.2
	c-1.3-0.8-2.1-1.9-2.3-3.4c-0.5-2.7,1.2-5.2,3.8-5.9c0.9-0.2,1.8-0.2,2.7,0.1c0.7,0.2,1.5,0.5,2.2,0.9c0.5,0.2,1,0.5,1.4,0.7
	c0.1,0,0.1,0.1,0.2,0.1c0,0,0,0.1,0,0.1c0,0.6,0,1.2-0.1,1.8c-0.1,0.9-0.2,1.8-0.4,2.7c-0.6,2.6-1.6,5-3,7.2
	c-0.4,0.6-0.8,1.2-1.3,1.8C18.1,17.6,18.1,17.6,18,17.7z"/>
<path class="st2" d="M12,22.8c-0.2-0.1-0.7-0.4-1.3-0.8c-1.2-0.8-2.4-1.8-3.5-2.9s-2-2.3-2.8-3.5c-0.8-1.2-1.4-2.4-1.9-3.7
	c0,0,0-0.1,0-0.1c0.1,0,0.1,0,0.1,0.1c0.4,0.3,0.8,0.6,1.3,0.8c0.6,0.3,1.2,0.4,1.8,0.5c1.3,0.1,2.5-0.1,3.7-0.8
	c0.6-0.3,1.2-0.5,1.9-0.6c2.4-0.3,4.8,1.1,5.5,3.6c0.4,1.3,0.3,2.5-0.3,3.7c-0.1,0.2-0.1,0.3-0.2,0.5c0,0.1-0.1,0.2-0.2,0.3
	c-1.2,1.1-2.5,2.2-4,3C12.1,22.7,12.1,22.8,12,22.8L12,22.8z"/>
</svg>
