<?xml version="1.0" encoding="utf-8"?>
<!-- Generator: Adobe Illustrator 21.1.0, SVG Export Plug-In . SVG Version: 6.00 Build 0)  -->
<svg version="1.1" id="Calque_1" xmlns="http://www.w3.org/2000/svg" xmlns:xlink="http://www.w3.org/1999/xlink" x="0px" y="0px"
	 viewBox="0 0 22.8 24" style="enable-background:new 0 0 22.8 24;" xml:space="preserve">
<style type="text/css">
	.st0{fill:#FF060A;}
</style>
<title>tron</title>
<g id="tron">
	<path class="st0" d="M22.5,7.2c-1.1-1-2.7-2.6-3.9-3.7l-0.1-0.1c-0.1-0.1-0.3-0.2-0.4-0.2l0,0C15,2.6,0.8,0,0.5,0
		C0.4,0,0.4,0,0.3,0.1L0.2,0.1C0.1,0.2,0.1,0.3,0,0.5l0,0v0.3v0c1.6,4.5,7.9,19.1,9.2,22.5C9.2,23.5,9.4,24,9.7,24h0.1
		c0.1,0,0.7-0.8,0.7-0.8S21.3,10,22.4,8.6c0.1-0.2,0.3-0.4,0.4-0.6C22.9,7.8,22.7,7.4,22.5,7.2z M13.2,8.8l4.6-3.8l2.7,2.5L13.2,8.8
		z M11.4,8.5L3.5,2l12.9,2.4L11.4,8.5z M12.2,10.2l8.2-1.3L11,20.2L12.2,10.2z M2.4,2.6l8.4,7.1L9.6,20.2L2.4,2.6z"/>
</g>
</svg>
