<?xml version="1.0" encoding="utf-8"?>
<!-- Generator: Adobe Illustrator 21.1.0, SVG Export Plug-In . SVG Version: 6.00 Build 0)  -->
<svg version="1.1" id="Layer_1" xmlns="http://www.w3.org/2000/svg" xmlns:xlink="http://www.w3.org/1999/xlink" x="0px" y="0px"
	 viewBox="0 0 24 21.402" style="enable-background:new 0 0 24 21.402;" xml:space="preserve">
<style type="text/css">
	.st0{fill:#32C6F4;}
</style>
<path class="st0" d="M24,7.125L12,0L0,7.1l11.875,7.2L24,7.125z M12,1.151l10.05,5.975l-10.175,6l-9.95-6L12,1.151z M23.2,14.15
	l-1.325-0.8c-0.033-0.016-0.067-0.029-0.1-0.037c-0.033-0.009-0.067-0.013-0.1-0.013c-0.083,0-0.162,0.033-0.238,0.1
	c-0.075,0.067-0.113,0.15-0.112,0.25c0,0.067,0.017,0.125,0.05,0.175c0.033,0.05,0.075,0.091,0.125,0.125l0,0l0.8,0.5l-10.425,6.175
	L1.65,14.45l0.8-0.475c0.067-0.033,0.113-0.075,0.138-0.125c0.025-0.05,0.037-0.108,0.037-0.175c0-0.1-0.033-0.188-0.1-0.262
	c-0.067-0.075-0.15-0.112-0.25-0.112c-0.033,0-0.067,0.004-0.1,0.013c-0.033,0.009-0.058,0.021-0.075,0.037l0,0l-1.3,0.8
	c-0.05,0.033-0.091,0.075-0.125,0.125c-0.033,0.05-0.05,0.108-0.05,0.175c0,0.067,0.017,0.125,0.05,0.175
	c0.033,0.05,0.075,0.091,0.125,0.125l0,0l10.9,6.601c0.016,0.016,0.041,0.029,0.075,0.037c0.033,0.009,0.067,0.013,0.1,0.013
	c0.033,0,0.067-0.004,0.1-0.013c0.033-0.009,0.058-0.021,0.075-0.037l0,0l11.15-6.601c0.05-0.016,0.091-0.054,0.125-0.112
	c0.033-0.058,0.05-0.121,0.05-0.188c0-0.067-0.017-0.125-0.05-0.175c-0.033-0.05-0.075-0.091-0.125-0.125l0,0l0,0V14.15z
	 M23.2,10.526l-1.325-0.8c-0.033-0.016-0.067-0.029-0.1-0.037c-0.033-0.009-0.067-0.013-0.1-0.013c-0.083,0-0.162,0.033-0.238,0.1
	c-0.075,0.067-0.113,0.15-0.112,0.25c0,0.067,0.017,0.125,0.05,0.175s0.075,0.091,0.125,0.125l0,0l0.8,0.5l-10.425,6.175
	L1.65,10.826l0.8-0.475c0.067-0.033,0.113-0.079,0.138-0.138c0.025-0.058,0.037-0.112,0.037-0.162c0-0.1-0.033-0.188-0.1-0.262
	c-0.067-0.075-0.15-0.112-0.25-0.112c-0.033,0-0.067,0.004-0.1,0.013C2.142,9.698,2.117,9.711,2.1,9.727l0,0l-1.3,0.8
	c-0.05,0.033-0.091,0.075-0.125,0.125c-0.033,0.05-0.05,0.108-0.05,0.175c0,0.067,0.017,0.125,0.05,0.175
	c0.033,0.05,0.075,0.091,0.125,0.125l0,0l10.9,6.601c0.016,0.016,0.041,0.029,0.075,0.037c0.033,0.009,0.067,0.013,0.1,0.013
	c0.033,0,0.067-0.004,0.1-0.013c0.033-0.009,0.058-0.021,0.075-0.037l0,0l11.15-6.601c0.05-0.033,0.091-0.075,0.125-0.125
	c0.033-0.05,0.05-0.108,0.05-0.175c0-0.067-0.017-0.125-0.05-0.175c-0.033-0.05-0.075-0.091-0.125-0.125l0,0l0,0V10.526z"/>
</svg>
