<svg width="14" height="1" viewBox="0 0 14 1" fill="none" xmlns="http://www.w3.org/2000/svg">
<path d="M13.0801 0.5L1.20008 0.5" stroke="#00CDCD" stroke-linecap="round" stroke-linejoin="round" stroke-dasharray="3 3"/>
</svg>
