<?xml version="1.0" encoding="utf-8"?>
<!-- Generator: Adobe Illustrator 21.1.0, SVG Export Plug-In . SVG Version: 6.00 Build 0)  -->
<svg version="1.1" id="Layer_1" xmlns="http://www.w3.org/2000/svg" xmlns:xlink="http://www.w3.org/1999/xlink" x="0px" y="0px"
	 viewBox="0 0 24 24" style="enable-background:new 0 0 24 24;" xml:space="preserve">
<style type="text/css">
	.st0{fill:#BC87ED;}
</style>
<path class="st0" d="M12,24c6.6,0,12-5.4,12-12S18.6,0,12,0S0,5.4,0,12S5.4,24,12,24z M17.5,5.6c0.4,0.1,0.9,0.1,1.3,0.2
	c0.8,0.2,1.1,0.6,1,1.4c-0.1,0.3-0.3,0.6-0.6,0.6c-0.2,0-0.4,0-0.6,0c-2.8,0-5.5,0-8.3,0C9.8,7.9,9.4,7.9,9,8
	c-1.4,0.2-1.9,0.8-2,2.2c-0.1,0.6-0.1,0.6,0.6,0.6h11.4c0.2,0,0.4,0,0.5,0.1c0.5,0.3,0.4,0.8,0.4,1.3c0,0.4-0.2,0.6-0.6,0.7
	c-0.2,0-0.3,0-0.5,0H7.3c-0.4,0-0.4,0-0.4,0.4c0,0.4,0.1,0.8,0.1,1.1c0.2,0.7,0.6,1.1,1.3,1.3c0.8,0.2,1.5,0.3,2.3,0.3
	c2.7,0,5.4,0,8.1,0c0.3,0,0.7,0,0.9,0.4c0.4,0.6,0.1,1.5-0.6,1.7c-0.6,0.2-1.2,0.2-1.8,0.2c-2.5,0-5.1,0.1-7.6,0
	c-0.8,0-1.6-0.1-2.3-0.3c-1.8-0.4-2.7-1.3-3-3.1c-0.1-0.4-0.1-0.8-0.2-1.3v-3.3c0-0.3,0.1-0.7,0.1-1c0.2-2.1,1.2-3.1,3.2-3.5
	c0.7-0.2,1.5-0.2,2.2-0.3C12.2,5.6,14.9,5.6,17.5,5.6L17.5,5.6z"/>
</svg>
