<svg width="22" height="16" viewBox="0 0 22 16" fill="none" xmlns="http://www.w3.org/2000/svg">
<rect width="22" height="16" rx="2" fill="white"/>
<path d="M10.9244 3.20305C7.65206 3.20305 4.37969 3.20105 1.10802 3.20772C0.898269 3.20838 0.828585 3.17104 0.834857 2.95502C0.852975 2.35628 0.846703 1.7562 0.836947 1.15679C0.83416 0.996105 0.876667 0.946765 1.05018 0.950099C1.6418 0.960767 2.23342 0.9541 2.82573 0.9541C8.78722 0.9541 14.7487 0.955433 20.7102 0.949432C20.9381 0.949432 21.0182 0.990104 21.0098 1.2268C20.9889 1.80087 20.9924 2.37561 21.0084 2.94968C21.014 3.15571 20.9611 3.20838 20.7415 3.20772C17.4692 3.20038 14.1968 3.20305 10.9244 3.20305Z" fill="#1A1F71"/>
<path d="M10.8952 14.9459C7.63951 14.9459 4.38387 14.9432 1.12892 14.9519C0.884327 14.9525 0.829277 14.8859 0.835548 14.6645C0.851576 14.0904 0.849485 13.515 0.836245 12.941C0.832064 12.7489 0.88154 12.6923 1.09059 12.6929C3.18809 12.7009 5.28628 12.6976 7.38377 12.6976C11.8234 12.6976 16.2622 12.7003 20.7018 12.6916C20.9596 12.6909 21.0175 12.7556 21.0091 12.9923C20.9896 13.5577 20.9924 14.1251 21.0084 14.6905C21.014 14.8959 20.961 14.9519 20.7401 14.9512C17.458 14.9432 14.1766 14.9459 10.8952 14.9459Z" fill="#F6B500"/>
<path d="M14.4149 10.898C15.0539 9.12182 15.6748 7.37627 16.3124 5.63738C16.4218 5.33801 16.5473 5.17066 16.9863 5.19866C17.2462 5.21533 17.5103 5.22066 17.7688 5.19533C17.9514 5.17733 17.9988 5.28201 18.019 5.39469C18.1493 6.12278 18.2636 6.85353 18.3925 7.58162C18.5186 8.29238 18.6587 9.0018 18.7904 9.71189C18.851 10.0393 18.9096 10.3673 18.9646 10.696C18.9862 10.8247 18.9709 10.9154 18.7834 10.9027C18.5235 10.8847 18.2615 10.8894 18.0009 10.9014C17.8469 10.9087 17.7709 10.8447 17.7688 10.7133C17.7667 10.5807 17.7054 10.4613 17.7054 10.326C17.7054 10.1279 17.6155 10.0213 17.3612 10.0406C16.9633 10.0706 16.5612 10.0526 16.1612 10.0459C16.0511 10.0439 15.9974 10.0633 15.9703 10.1786C15.9215 10.382 15.8295 10.5767 15.787 10.7807C15.7661 10.8807 15.734 10.8994 15.6428 10.8987C15.2421 10.8967 14.8421 10.898 14.4149 10.898ZM17.0587 6.74019C16.842 7.43561 16.6427 8.09235 16.4302 8.74444C16.3856 8.88112 16.4267 8.90312 16.5514 8.90046C16.7953 8.89646 17.0392 8.89179 17.2824 8.90179C17.4434 8.90846 17.4664 8.85778 17.4371 8.71377C17.3061 8.06969 17.1884 7.42294 17.0587 6.74019Z" fill="#1A1F71"/>
<path d="M6.51835 9.0511C6.64239 8.70439 6.7497 8.42169 6.84587 8.13498C7.16433 7.18353 7.47721 6.23008 7.79706 5.27863C7.82214 5.20395 7.86674 5.14528 7.98172 5.14795C8.38101 5.15795 8.781 5.15195 9.19632 5.15195C8.94894 5.86137 8.71271 6.55612 8.46533 7.24687C8.0528 8.39768 7.62773 9.54449 7.22286 10.698C7.16851 10.8527 7.11206 10.9113 6.94552 10.9013C6.73716 10.8887 6.52811 10.8987 6.31906 10.8987C5.73301 10.8987 5.75183 10.8953 5.64312 10.3419C5.47657 9.49115 5.28216 8.64571 5.09749 7.79828C5.00411 7.37089 4.86823 6.94817 4.82154 6.51612C4.76092 5.95205 4.38741 5.71202 3.89614 5.55133C3.69684 5.48665 3.49894 5.41998 3.30034 5.35264C3.26968 5.34264 3.20069 5.36997 3.22299 5.3053C3.23553 5.26796 3.23553 5.19928 3.31149 5.20195C3.37211 5.20395 3.43343 5.20129 3.49406 5.20129C4.12052 5.20129 4.74768 5.20129 5.37414 5.20129C5.6689 5.20129 5.96924 5.44332 6.01105 5.72668C6.13579 6.57279 6.25495 7.42023 6.37968 8.26633C6.41383 8.50436 6.46261 8.73973 6.51835 9.0511Z" fill="#1A1F71"/>
<path d="M12.2394 11.0027C11.7864 11.0147 11.3593 10.9253 10.953 10.742C10.877 10.708 10.8443 10.664 10.8652 10.568C10.9335 10.2506 10.9802 9.92921 11.0436 9.61051C11.0652 9.50316 11.1021 9.44582 11.2499 9.52583C11.6011 9.71585 11.9864 9.80386 12.3955 9.80186C12.5732 9.8012 12.7355 9.74319 12.8826 9.67985C13.2352 9.52649 13.2644 9.0391 12.9467 8.81907C12.7557 8.68639 12.5599 8.56037 12.3613 8.43702C11.9439 8.17833 11.5753 7.87229 11.4422 7.37823C11.314 6.90217 11.4052 6.45478 11.6457 6.03939C11.9941 5.43598 12.562 5.18195 13.2644 5.08861C13.6986 5.03127 14.0895 5.12528 14.4902 5.21329C14.6686 5.25263 14.801 5.33864 14.702 5.582C14.6149 5.79669 14.6065 6.04273 14.5808 6.27609C14.5599 6.46011 14.5292 6.56679 14.2978 6.45078C13.9111 6.25742 13.493 6.23875 13.0805 6.34943C12.6784 6.45678 12.5906 6.81682 12.8749 7.09619C13.1209 7.33822 13.4338 7.49757 13.7195 7.6836C14.5417 8.21966 14.6484 9.11311 14.3104 9.84987C13.9188 10.704 13.1529 10.9873 12.2394 11.0027Z" fill="#1A1F71"/>
<path d="M11.0004 5.20199C10.8332 6.1461 10.6729 7.07955 10.5022 8.01167C10.353 8.82511 10.1851 9.63521 10.0423 10.4493C10.0172 10.5927 10.0402 10.8027 9.95166 10.862C9.83877 10.9374 9.63669 10.8947 9.47293 10.8974C9.282 10.9007 9.08967 10.8867 8.89943 10.9014C8.7301 10.9147 8.7078 10.8327 8.7294 10.71C8.80257 10.2946 8.87644 9.87924 8.95448 9.46385C9.06876 8.85844 9.19071 8.25437 9.30151 7.64829C9.44506 6.86619 9.58443 6.08276 9.71683 5.29867C9.73355 5.19999 9.78094 5.20065 9.85341 5.20065C10.2353 5.20199 10.6178 5.20199 11.0004 5.20199Z" fill="#1A1F71"/>
<path d="M17.0587 6.7402C17.1883 7.42296 17.3061 8.0697 17.4371 8.71378C17.4663 8.8578 17.4427 8.90847 17.2824 8.90181C17.0392 8.8918 16.7953 8.89647 16.5514 8.90047C16.426 8.90247 16.3855 8.88114 16.4301 8.74445C16.6427 8.09237 16.842 7.43629 17.0587 6.7402Z" fill="#FEFEFE"/>
</svg>
