<?xml version="1.0" encoding="UTF-8"?>
<!DOCTYPE svg PUBLIC "-//W3C//DTD SVG 1.1//EN" "http://www.w3.org/Graphics/SVG/1.1/DTD/svg11.dtd">
<!-- Creator: CorelDRAW X7 -->
<svg xmlns="http://www.w3.org/2000/svg" xml:space="preserve" width="2480px" height="3508px" version="1.1" style="shape-rendering:geometricPrecision; text-rendering:geometricPrecision; image-rendering:optimizeQuality; fill-rule:evenodd; clip-rule:evenodd"
viewBox="0 0 2480 3507"
 xmlns:xlink="http://www.w3.org/1999/xlink">
 <defs>
  <style type="text/css">
   <![CDATA[
    .fil0 {fill:black}
   ]]>
  </style>
 </defs>
 <g id="Слой_x0020_1">
  <metadata id="CorelCorpID_0Corel-Layer"/>
  <path class="fil0" d="M-5357 -9968l11 0c53,0 96,42 96,95l0 928 927 0c54,0 96,42 96,96l0 5c0,622 -503,1128 -1127,1128 -622,0 -1128,-504 -1128,-1128 -6,-618 501,-1124 1125,-1124z"/>
  <path class="fil0" d="M-4983 -10196c5,0 8,0 14,0l11 0c492,73 880,461 953,956l0 11c9,51 -28,98 -79,107 -5,0 -8,0 -14,0l-981 0 0 -96 0 -885c0,-54 42,-96 96,-93z"/>
 </g>
</svg>
