<?xml version="1.0" encoding="utf-8"?>
<!-- Generator: Adobe Illustrator 21.1.0, SVG Export Plug-In . SVG Version: 6.00 Build 0)  -->
<svg version="1.1" id="Layer_1" xmlns="http://www.w3.org/2000/svg" xmlns:xlink="http://www.w3.org/1999/xlink" x="0px" y="0px"
	 viewBox="0 0 24 24" style="enable-background:new 0 0 24 24;" xml:space="preserve">
<style type="text/css">
	.st0{fill:#199248;}
	.st1{fill:#FFFFFF;}
</style>
<g>
	<circle class="st0" cx="12" cy="12" r="12"/>
	<g>
		<path class="st1" d="M12,3c-4.97,0-9,4.03-9,9s4.03,9,9,9s9-4.03,9-9C21,7.029,16.971,3,12,3z M14.057,19.677
			c-4.241,1.13-8.595-1.392-9.725-5.633s1.392-8.595,5.633-9.725c0.213-0.057,0.429-0.105,0.646-0.144
			c4.322-0.764,8.446,2.121,9.209,6.444C20.537,14.676,18.035,18.608,14.057,19.677z"/>
		<path class="st1" d="M14.198,5.465c0,0.388,0,0.775,0.015,1.162c-0.519-0.201-1.059-0.343-1.609-0.422
			c-0.023-0.352,0.078-0.738-0.025-1.072c-0.392-0.028-0.786-0.033-1.179-0.014c-0.02,0.361-0.012,0.725,0,1.087
			c-0.551,0.082-1.091,0.227-1.61,0.431c0.011-0.391,0.015-0.782,0.01-1.174c-3.612,1.216-5.553,5.13-4.337,8.741
			c0.688,2.044,2.293,3.649,4.337,4.337c0-0.384-0.004-0.767-0.011-1.149c0.515,0.201,1.052,0.34,1.6,0.412
			c0,0.352,0,0.703-0.021,1.052c0.42,0.06,0.846,0.06,1.266,0c-0.019-0.346-0.029-0.693-0.03-1.04
			c0.548-0.077,1.086-0.214,1.605-0.408c-0.012,0.38-0.012,0.76,0,1.14c3.611-1.219,5.549-5.134,4.33-8.745
			c-0.69-2.043-2.295-3.646-4.339-4.333L14.198,5.465L14.198,5.465z M15.225,15.917c-0.906,0.821-2.193,1.015-3.375,0.998
			c-1.037,0-2.135-0.281-2.884-1.032c-0.398-0.384-0.622-0.897-0.824-1.406c0.725-0.188,1.472-0.25,2.202-0.406
			c0.092,0.449,0.418,0.814,0.853,0.958c0.662,0.207,1.483,0.236,2.035-0.236c0.391-0.325,0.403-1.035-0.083-1.278
			c-1.138-0.588-2.555-0.389-3.631-1.133c-1.481-0.934-1.591-3.41-0.141-4.418c1.108-0.778,2.59-0.875,3.876-0.563
			c1.162,0.294,1.991,1.28,2.39,2.371c-0.715,0.124-1.43,0.25-2.146,0.371c-0.188-1.136-1.779-1.406-2.569-0.744
			c-0.45,0.374-0.335,1.171,0.228,1.371c1.23,0.51,2.707,0.363,3.797,1.217C16.219,12.844,16.351,14.893,15.225,15.917
			L15.225,15.917z"/>
	</g>
</g>
</svg>
