<?xml version="1.0" encoding="utf-8"?>
<!-- Generator: Adobe Illustrator 21.1.0, SVG Export Plug-In . SVG Version: 6.00 Build 0)  -->
<svg version="1.1" id="Layer_1" xmlns="http://www.w3.org/2000/svg" xmlns:xlink="http://www.w3.org/1999/xlink" x="0px" y="0px"
	 viewBox="0 0 21.4 24.1" style="enable-background:new 0 0 21.4 24.1;" xml:space="preserve">
<style type="text/css">
	.st0{fill:#7B00D0;}
	.st1{fill:#FFFFFF;}
</style>
<path class="st0" d="M11.6,0.3l8.8,5.1C21,5.7,21.3,6.3,21.3,7v10.1c0,0.7-0.3,1.3-0.9,1.6l-8.8,5.1c-0.6,0.3-1.3,0.3-1.9,0L1,18.7
	c-0.6-0.3-0.9-0.9-0.9-1.6V7c0-0.7,0.3-1.3,0.9-1.6l8.8-5.1C10.4,0,11,0,11.6,0.3z"/>
<path class="st1" d="M11.7,4.6c1.3,0,2.6,0.3,3.9,0.8l-0.9,2.3c-0.5-0.2-1-0.3-1.4-0.5c-0.4-0.1-0.9-0.2-1.3-0.2
	c-0.5,0-0.9,0.1-1.2,0.4c-0.3,0.3-0.4,0.7-0.4,1.3V10h3.6v1.8h-3.6v1.2h3.6v1.8h-3.6c0,0.5-0.2,0.9-0.4,1.3
	c-0.2,0.4-0.6,0.7-1.1,0.9H16v2.6H5.4V17c0.7-0.3,1.1-0.6,1.4-1c0.3-0.4,0.4-0.8,0.4-1.4H5.5v-1.8h1.8v-1.2H5.5V10h1.8V8.8
	c0-1.4,0.4-2.4,1.1-3.1C9.2,5,10.3,4.6,11.7,4.6z"/>
</svg>
