<svg width="10" height="10" viewBox="0 0 10 10" fill="none" xmlns="http://www.w3.org/2000/svg">
<path d="M9.86009 5.00006L0.592511 10L0.591797 5.00006L0.592511 0L9.86009 5.00006Z" fill="white"/>
</svg>
