<?xml version="1.0" encoding="utf-8"?>
<!-- Generator: Adobe Illustrator 21.1.0, SVG Export Plug-In . SVG Version: 6.00 Build 0)  -->
<svg version="1.1" id="Layer_1" xmlns="http://www.w3.org/2000/svg" xmlns:xlink="http://www.w3.org/1999/xlink" x="0px" y="0px"
	 viewBox="0 0 24 24" style="enable-background:new 0 0 24 24;" xml:space="preserve">
<style type="text/css">
	.st0{fill:#F4D029;}
	.st1{fill:#FFFFFF;}
</style>
<g>
	<circle class="st0" cx="12" cy="12" r="12"/>
	<path class="st1" d="M9.375,8.25v2.25h-5.25V8.25H9.375z M10.125,8.25h1.5v7.5h-7.5v-4.5h6V8.25z M5.625,12.75v1.5h4.5v-1.5H5.625z
		 M19.875,9.75h-6v4.5h4.5v-1.5h-3v-1.5h4.5v4.5h-7.5v-7.5h7.5V9.75z"/>
</g>
</svg>
