<?xml version="1.0" encoding="utf-8"?>
<!-- Generator: Adobe Illustrator 21.1.0, SVG Export Plug-In . SVG Version: 6.00 Build 0)  -->
<svg version="1.1" id="Layer_1" xmlns="http://www.w3.org/2000/svg" xmlns:xlink="http://www.w3.org/1999/xlink" x="0px" y="0px"
	 viewBox="0 0 24 24" style="enable-background:new 0 0 24 24;" xml:space="preserve">
<style type="text/css">
	.st0{fill:#2775CA;}
	.st1{fill:#FFFFFF;}
</style>
<path class="st0" d="M12,24c6.7,0,12-5.3,12-12S18.7,0,12,0S0,5.3,0,12S5.3,24,12,24z"/>
<path class="st1" d="M15.3,13.9c0-1.7-1.1-2.3-3.2-2.6c-1.5-0.2-1.8-0.6-1.8-1.3c0-0.7,0.5-1.1,1.5-1.1c0.9,0,1.4,0.3,1.6,1.1
	c0.1,0.1,0.2,0.2,0.4,0.2h0.8c0.2,0,0.4-0.1,0.4-0.3V9.8c-0.2-1.1-1.1-1.9-2.3-2V6.5c0-0.2-0.2-0.4-0.4-0.4h-0.8
	c-0.2,0-0.4,0.1-0.4,0.4v1.1c-1.5,0.2-2.4,1.2-2.4,2.5c0,1.7,1,2.3,3.1,2.5c1.4,0.2,1.9,0.5,1.9,1.4s-0.7,1.4-1.6,1.4
	c-1.3,0-1.8-0.6-1.9-1.3c0-0.2-0.2-0.3-0.3-0.3H8.9c-0.2,0-0.3,0.1-0.3,0.4v0.1c0.2,1.2,1,2.1,2.6,2.4v1.2c0,0.2,0.1,0.3,0.4,0.4
	h0.8c0.2,0,0.4-0.1,0.4-0.4v-1.2C14.3,16.3,15.3,15.2,15.3,13.9L15.3,13.9z M9.4,19.1C5.6,17.8,3.5,13.4,5,9.5
	c0.8-2.1,2.4-3.7,4.4-4.4C9.7,5,9.8,4.9,9.8,4.6V3.9c0-0.2-0.1-0.4-0.3-0.4c-0.1,0-0.1,0-0.2,0C4.5,5,1.9,10.1,3.4,14.9
	c0.9,2.8,3.1,4.9,5.8,5.9c0.2,0.1,0.4,0,0.4-0.2c0.1,0,0.1-0.1,0.1-0.2v-0.7C9.8,19.4,9.6,19.3,9.4,19.1z M14.8,3.5
	c-0.2-0.1-0.4,0-0.4,0.2c-0.1,0.1-0.1,0.1-0.1,0.2v0.7c0,0.2,0.1,0.4,0.3,0.5c3.9,1.4,5.9,5.7,4.4,9.6c-0.8,2.1-2.4,3.7-4.4,4.4
	c-0.2,0.1-0.3,0.2-0.3,0.5v0.7c0,0.2,0.1,0.4,0.3,0.4c0.1,0,0.1,0,0.2,0c4.7-1.5,7.4-6.6,5.9-11.3C19.7,6.6,17.5,4.4,14.8,3.5
	L14.8,3.5z"/>
</svg>
