%YAML 1.1
%TAG !u! tag:unity3d.com,2011:
--- !u!1001 &7305646456234943761
PrefabInstance:
  m_ObjectHideFlags: 0
  serializedVersion: 2
  m_Modification:
    m_TransformParent: {fileID: 0}
    m_Modifications:
    - target: {fileID: -8679921383154817045, guid: 5a2a40ab414b0ed408ba3eb33fde7d91, type: 3}
      propertyPath: m_RootOrder
      value: 0
      objectReference: {fileID: 0}
    - target: {fileID: -8679921383154817045, guid: 5a2a40ab414b0ed408ba3eb33fde7d91, type: 3}
      propertyPath: m_LocalPosition.x
      value: 0
      objectReference: {fileID: 0}
    - target: {fileID: -8679921383154817045, guid: 5a2a40ab414b0ed408ba3eb33fde7d91, type: 3}
      propertyPath: m_LocalPosition.y
      value: 0
      objectReference: {fileID: 0}
    - target: {fileID: -8679921383154817045, guid: 5a2a40ab414b0ed408ba3eb33fde7d91, type: 3}
      propertyPath: m_LocalPosition.z
      value: 0
      objectReference: {fileID: 0}
    - target: {fileID: -8679921383154817045, guid: 5a2a40ab414b0ed408ba3eb33fde7d91, type: 3}
      propertyPath: m_LocalRotation.w
      value: 1
      objectReference: {fileID: 0}
    - target: {fileID: -8679921383154817045, guid: 5a2a40ab414b0ed408ba3eb33fde7d91, type: 3}
      propertyPath: m_LocalRotation.x
      value: -0.00000003774895
      objectReference: {fileID: 0}
    - target: {fileID: -8679921383154817045, guid: 5a2a40ab414b0ed408ba3eb33fde7d91, type: 3}
      propertyPath: m_LocalRotation.y
      value: 0
      objectReference: {fileID: 0}
    - target: {fileID: -8679921383154817045, guid: 5a2a40ab414b0ed408ba3eb33fde7d91, type: 3}
      propertyPath: m_LocalRotation.z
      value: -0
      objectReference: {fileID: 0}
    - target: {fileID: -8679921383154817045, guid: 5a2a40ab414b0ed408ba3eb33fde7d91, type: 3}
      propertyPath: m_LocalEulerAnglesHint.x
      value: 0
      objectReference: {fileID: 0}
    - target: {fileID: -8679921383154817045, guid: 5a2a40ab414b0ed408ba3eb33fde7d91, type: 3}
      propertyPath: m_LocalEulerAnglesHint.y
      value: 0
      objectReference: {fileID: 0}
    - target: {fileID: -8679921383154817045, guid: 5a2a40ab414b0ed408ba3eb33fde7d91, type: 3}
      propertyPath: m_LocalEulerAnglesHint.z
      value: 0
      objectReference: {fileID: 0}
    - target: {fileID: -7511558181221131132, guid: 5a2a40ab414b0ed408ba3eb33fde7d91, type: 3}
      propertyPath: m_Materials.Array.data[0]
      value: 
      objectReference: {fileID: 2100000, guid: 93943df86aa94164490d372d269ac63d, type: 2}
    - target: {fileID: -7511558181221131132, guid: 5a2a40ab414b0ed408ba3eb33fde7d91, type: 3}
      propertyPath: m_Materials.Array.data[1]
      value: 
      objectReference: {fileID: 2100000, guid: dbbf4093f70be124fa020a53fce9fe4d, type: 2}
    - target: {fileID: 919132149155446097, guid: 5a2a40ab414b0ed408ba3eb33fde7d91, type: 3}
      propertyPath: m_Name
      value: Dead_Plant_2
      objectReference: {fileID: 0}
    m_RemovedComponents: []
  m_SourcePrefab: {fileID: 100100000, guid: 5a2a40ab414b0ed408ba3eb33fde7d91, type: 3}
