<mxfile host="app.diagrams.net" modified="2023-09-05T12:25:29.654Z" agent="Mozilla/5.0 (Windows NT 10.0; Win64; x64) AppleWebKit/537.36 (KHTML, like Gecko) Chrome/116.0.0.0 Safari/537.36" etag="3O8jkBsw_OxSxA7Tglup" version="21.7.2" type="gitlab">
  <diagram name="Page-1" id="03018318-947c-dd8e-b7a3-06fadd420f32">
    <mxGraphModel dx="2433" dy="2123" grid="1" gridSize="10" guides="1" tooltips="1" connect="1" arrows="1" fold="1" page="1" pageScale="1" pageWidth="1100" pageHeight="850" background="none" math="0" shadow="0">
      <root>
        <mxCell id="0" />
        <mxCell id="1" parent="0" />
        <mxCell id="jhDFrkBdyW9tnRgV2zl8-17" value="" style="whiteSpace=wrap;html=1;rounded=0;shadow=0;labelBackgroundColor=none;strokeColor=#000000;strokeWidth=1;fillColor=none;fontFamily=Verdana;fontSize=12;fontColor=#000000;align=center;comic=1;" parent="1" vertex="1">
          <mxGeometry x="30" y="1134" width="1260" height="500" as="geometry" />
        </mxCell>
        <mxCell id="jhDFrkBdyW9tnRgV2zl8-18" value="ALL NEWS" style="whiteSpace=wrap;html=1;rounded=0;shadow=0;labelBackgroundColor=none;strokeWidth=1;fontFamily=Verdana;fontSize=28;align=center;comic=1;" parent="1" vertex="1">
          <mxGeometry x="50" y="1161" width="190" height="50" as="geometry" />
        </mxCell>
        <mxCell id="jhDFrkBdyW9tnRgV2zl8-19" value="" style="line;strokeWidth=1;html=1;rounded=0;shadow=0;labelBackgroundColor=none;fillColor=none;fontFamily=Verdana;fontSize=14;fontColor=#000000;align=center;comic=1;" parent="1" vertex="1">
          <mxGeometry x="30" y="1247" width="1260" height="10" as="geometry" />
        </mxCell>
        <mxCell id="jhDFrkBdyW9tnRgV2zl8-20" value="" style="whiteSpace=wrap;html=1;rounded=0;shadow=0;labelBackgroundColor=none;strokeWidth=1;fillColor=none;fontFamily=Verdana;fontSize=12;align=center;comic=1;" parent="1" vertex="1">
          <mxGeometry x="110" y="1316" width="310" height="270" as="geometry" />
        </mxCell>
        <mxCell id="jhDFrkBdyW9tnRgV2zl8-21" style="edgeStyle=orthogonalEdgeStyle;rounded=0;orthogonalLoop=1;jettySize=auto;html=1;exitX=0.5;exitY=1;exitDx=0;exitDy=0;" parent="1" source="jhDFrkBdyW9tnRgV2zl8-17" target="jhDFrkBdyW9tnRgV2zl8-17" edge="1">
          <mxGeometry relative="1" as="geometry" />
        </mxCell>
        <mxCell id="jhDFrkBdyW9tnRgV2zl8-22" value="LOGO" style="whiteSpace=wrap;html=1;rounded=0;shadow=0;labelBackgroundColor=none;strokeWidth=1;fontFamily=Verdana;fontSize=28;align=center;comic=1;" parent="1" vertex="1">
          <mxGeometry x="453" y="1162" width="190" height="50" as="geometry" />
        </mxCell>
        <mxCell id="jhDFrkBdyW9tnRgV2zl8-23" value="LOGIN" style="whiteSpace=wrap;html=1;rounded=0;shadow=0;labelBackgroundColor=none;strokeWidth=1;fontFamily=Verdana;fontSize=28;align=center;comic=1;" parent="1" vertex="1">
          <mxGeometry x="854" y="1166" width="190" height="50" as="geometry" />
        </mxCell>
        <mxCell id="jhDFrkBdyW9tnRgV2zl8-24" value="SIGNUP" style="whiteSpace=wrap;html=1;rounded=0;shadow=0;labelBackgroundColor=none;strokeWidth=1;fontFamily=Verdana;fontSize=28;align=center;comic=1;" parent="1" vertex="1">
          <mxGeometry x="1081" y="1168" width="190" height="50" as="geometry" />
        </mxCell>
        <mxCell id="jhDFrkBdyW9tnRgV2zl8-25" value="" style="whiteSpace=wrap;html=1;rounded=0;shadow=0;labelBackgroundColor=none;strokeWidth=1;fillColor=none;fontFamily=Verdana;fontSize=12;align=center;comic=1;" parent="1" vertex="1">
          <mxGeometry x="498" y="1314" width="310" height="270" as="geometry" />
        </mxCell>
        <mxCell id="jhDFrkBdyW9tnRgV2zl8-26" value="" style="whiteSpace=wrap;html=1;rounded=0;shadow=0;labelBackgroundColor=none;strokeWidth=1;fillColor=none;fontFamily=Verdana;fontSize=12;align=center;comic=1;" parent="1" vertex="1">
          <mxGeometry x="900" y="1314" width="310" height="270" as="geometry" />
        </mxCell>
        <mxCell id="jhDFrkBdyW9tnRgV2zl8-27" value="&amp;nbsp;NEWS" style="whiteSpace=wrap;html=1;rounded=0;shadow=0;labelBackgroundColor=none;strokeWidth=1;fontFamily=Verdana;fontSize=28;align=center;comic=1;" parent="1" vertex="1">
          <mxGeometry x="221" y="1374" width="190" height="50" as="geometry" />
        </mxCell>
        <mxCell id="jhDFrkBdyW9tnRgV2zl8-28" value="DETAILS" style="whiteSpace=wrap;html=1;rounded=0;shadow=0;labelBackgroundColor=none;strokeWidth=1;fontFamily=Verdana;fontSize=28;align=center;comic=1;" parent="1" vertex="1">
          <mxGeometry x="130" y="1502" width="190" height="50" as="geometry" />
        </mxCell>
        <mxCell id="jhDFrkBdyW9tnRgV2zl8-29" value="&amp;nbsp;NEWS" style="whiteSpace=wrap;html=1;rounded=0;shadow=0;labelBackgroundColor=none;strokeWidth=1;fontFamily=Verdana;fontSize=28;align=center;comic=1;" parent="1" vertex="1">
          <mxGeometry x="598" y="1370" width="190" height="50" as="geometry" />
        </mxCell>
        <mxCell id="jhDFrkBdyW9tnRgV2zl8-30" value="&amp;nbsp;NEWS" style="whiteSpace=wrap;html=1;rounded=0;shadow=0;labelBackgroundColor=none;strokeWidth=1;fontFamily=Verdana;fontSize=28;align=center;comic=1;" parent="1" vertex="1">
          <mxGeometry x="997" y="1373" width="190" height="50" as="geometry" />
        </mxCell>
        <mxCell id="jhDFrkBdyW9tnRgV2zl8-31" value="DETAILS" style="whiteSpace=wrap;html=1;rounded=0;shadow=0;labelBackgroundColor=none;strokeWidth=1;fontFamily=Verdana;fontSize=28;align=center;comic=1;" parent="1" vertex="1">
          <mxGeometry x="520" y="1502" width="190" height="50" as="geometry" />
        </mxCell>
        <mxCell id="jhDFrkBdyW9tnRgV2zl8-32" value="DETAILS" style="whiteSpace=wrap;html=1;rounded=0;shadow=0;labelBackgroundColor=none;strokeWidth=1;fontFamily=Verdana;fontSize=28;align=center;comic=1;" parent="1" vertex="1">
          <mxGeometry x="930" y="1502" width="190" height="50" as="geometry" />
        </mxCell>
        <mxCell id="_rJ5-Y76EPdLkxrL6b5Y-1" value="" style="whiteSpace=wrap;html=1;rounded=0;shadow=0;labelBackgroundColor=none;strokeColor=#000000;strokeWidth=1;fillColor=none;fontFamily=Verdana;fontSize=12;fontColor=#000000;align=center;comic=1;" vertex="1" parent="1">
          <mxGeometry x="30" y="1770" width="1320" height="980" as="geometry" />
        </mxCell>
        <mxCell id="_rJ5-Y76EPdLkxrL6b5Y-2" value="" style="line;strokeWidth=1;html=1;rounded=0;shadow=0;labelBackgroundColor=none;fillColor=none;fontFamily=Verdana;fontSize=14;fontColor=#000000;align=center;comic=1;" vertex="1" parent="1">
          <mxGeometry x="30" y="1910" width="1320" height="10" as="geometry" />
        </mxCell>
        <mxCell id="_rJ5-Y76EPdLkxrL6b5Y-3" value="ALL NEWS" style="whiteSpace=wrap;html=1;rounded=0;shadow=0;labelBackgroundColor=none;strokeWidth=1;fontFamily=Verdana;fontSize=28;align=center;comic=1;" vertex="1" parent="1">
          <mxGeometry x="60" y="1810" width="190" height="50" as="geometry" />
        </mxCell>
        <mxCell id="_rJ5-Y76EPdLkxrL6b5Y-4" value="" style="whiteSpace=wrap;html=1;rounded=0;shadow=0;labelBackgroundColor=none;strokeWidth=1;fillColor=none;fontFamily=Verdana;fontSize=12;align=center;comic=1;" vertex="1" parent="1">
          <mxGeometry x="274" y="2004" width="776" height="526" as="geometry" />
        </mxCell>
        <mxCell id="_rJ5-Y76EPdLkxrL6b5Y-5" value="LOG INTO YOUR ACCOUNT" style="text;html=1;strokeColor=none;fillColor=none;align=center;verticalAlign=middle;whiteSpace=wrap;rounded=0;strokeWidth=0;perimeterSpacing=0;fontSize=37;" vertex="1" parent="1">
          <mxGeometry x="406" y="2026" width="490" height="30" as="geometry" />
        </mxCell>
        <mxCell id="_rJ5-Y76EPdLkxrL6b5Y-6" value="" style="whiteSpace=wrap;html=1;rounded=0;shadow=0;labelBackgroundColor=none;strokeWidth=1;fontFamily=Verdana;fontSize=28;align=center;comic=1;" vertex="1" parent="1">
          <mxGeometry x="347" y="2137" width="563" height="50" as="geometry" />
        </mxCell>
        <mxCell id="_rJ5-Y76EPdLkxrL6b5Y-7" value="" style="whiteSpace=wrap;html=1;rounded=0;shadow=0;labelBackgroundColor=none;strokeWidth=1;fontFamily=Verdana;fontSize=28;align=center;comic=1;" vertex="1" parent="1">
          <mxGeometry x="357" y="2300" width="563" height="50" as="geometry" />
        </mxCell>
        <mxCell id="_rJ5-Y76EPdLkxrL6b5Y-8" value="Email address" style="text;html=1;strokeColor=none;fillColor=none;align=center;verticalAlign=middle;whiteSpace=wrap;rounded=0;strokeWidth=0;perimeterSpacing=0;fontSize=28;" vertex="1" parent="1">
          <mxGeometry x="344" y="2086" width="193" height="30" as="geometry" />
        </mxCell>
        <mxCell id="_rJ5-Y76EPdLkxrL6b5Y-9" value="Password" style="text;html=1;strokeColor=none;fillColor=none;align=center;verticalAlign=middle;whiteSpace=wrap;rounded=0;strokeWidth=0;perimeterSpacing=0;fontSize=28;" vertex="1" parent="1">
          <mxGeometry x="322" y="2247" width="193" height="30" as="geometry" />
        </mxCell>
        <mxCell id="_rJ5-Y76EPdLkxrL6b5Y-10" value="" style="line;strokeWidth=1;html=1;rounded=0;shadow=0;labelBackgroundColor=none;fillColor=none;fontFamily=Verdana;fontSize=14;fontColor=#000000;align=center;comic=1;" vertex="1" parent="1">
          <mxGeometry x="33" y="2593" width="1320" height="10" as="geometry" />
        </mxCell>
        <mxCell id="_rJ5-Y76EPdLkxrL6b5Y-11" value="LOGO" style="whiteSpace=wrap;html=1;rounded=0;shadow=0;labelBackgroundColor=none;strokeWidth=1;fontFamily=Verdana;fontSize=28;align=center;comic=1;" vertex="1" parent="1">
          <mxGeometry x="1120" y="1810" width="190" height="50" as="geometry" />
        </mxCell>
        <mxCell id="_rJ5-Y76EPdLkxrL6b5Y-12" value="LOGO" style="whiteSpace=wrap;html=1;rounded=0;shadow=0;labelBackgroundColor=none;strokeWidth=1;fontFamily=Verdana;fontSize=28;align=center;comic=1;" vertex="1" parent="1">
          <mxGeometry x="60" y="2629" width="190" height="50" as="geometry" />
        </mxCell>
        <mxCell id="_rJ5-Y76EPdLkxrL6b5Y-13" value="Agile Software Management System" style="text;html=1;strokeColor=none;fillColor=none;align=center;verticalAlign=middle;whiteSpace=wrap;rounded=0;" vertex="1" parent="1">
          <mxGeometry x="62" y="2710" width="220" height="30" as="geometry" />
        </mxCell>
        <mxCell id="_rJ5-Y76EPdLkxrL6b5Y-14" value="E-Pharmacist Autumn Semester 2023" style="text;html=1;strokeColor=none;fillColor=none;align=center;verticalAlign=middle;whiteSpace=wrap;rounded=0;" vertex="1" parent="1">
          <mxGeometry x="1117" y="2713" width="220" height="30" as="geometry" />
        </mxCell>
        <mxCell id="_rJ5-Y76EPdLkxrL6b5Y-15" value="LOGIN" style="whiteSpace=wrap;html=1;rounded=0;shadow=0;labelBackgroundColor=none;strokeWidth=1;fontFamily=Verdana;fontSize=28;align=center;comic=1;fillColor=#0050ef;fontColor=#ffffff;strokeColor=#001DBC;" vertex="1" parent="1">
          <mxGeometry x="390" y="2420" width="230" height="50" as="geometry" />
        </mxCell>
        <mxCell id="_rJ5-Y76EPdLkxrL6b5Y-16" value="" style="whiteSpace=wrap;html=1;rounded=0;shadow=0;labelBackgroundColor=none;strokeColor=#000000;strokeWidth=1;fillColor=none;fontFamily=Verdana;fontSize=12;fontColor=#000000;align=center;comic=1;" vertex="1" parent="1">
          <mxGeometry x="40" y="2860" width="1320" height="1270" as="geometry" />
        </mxCell>
        <mxCell id="_rJ5-Y76EPdLkxrL6b5Y-17" value="" style="line;strokeWidth=1;html=1;rounded=0;shadow=0;labelBackgroundColor=none;fillColor=none;fontFamily=Verdana;fontSize=14;fontColor=#000000;align=center;comic=1;" vertex="1" parent="1">
          <mxGeometry x="40" y="3000" width="1320" height="10" as="geometry" />
        </mxCell>
        <mxCell id="_rJ5-Y76EPdLkxrL6b5Y-18" value="ALL NEWS" style="whiteSpace=wrap;html=1;rounded=0;shadow=0;labelBackgroundColor=none;strokeWidth=1;fontFamily=Verdana;fontSize=28;align=center;comic=1;" vertex="1" parent="1">
          <mxGeometry x="70" y="2900" width="190" height="50" as="geometry" />
        </mxCell>
        <mxCell id="_rJ5-Y76EPdLkxrL6b5Y-19" value="" style="whiteSpace=wrap;html=1;rounded=0;shadow=0;labelBackgroundColor=none;strokeWidth=1;fillColor=none;fontFamily=Verdana;fontSize=12;align=center;comic=1;" vertex="1" parent="1">
          <mxGeometry x="284" y="3094" width="776" height="826" as="geometry" />
        </mxCell>
        <mxCell id="_rJ5-Y76EPdLkxrL6b5Y-20" value="CREATE A NEW ACCOUNT" style="text;html=1;strokeColor=none;fillColor=none;align=center;verticalAlign=middle;whiteSpace=wrap;rounded=0;strokeWidth=0;perimeterSpacing=0;fontSize=37;" vertex="1" parent="1">
          <mxGeometry x="416" y="3120" width="490" height="26" as="geometry" />
        </mxCell>
        <mxCell id="_rJ5-Y76EPdLkxrL6b5Y-21" value="" style="whiteSpace=wrap;html=1;rounded=0;shadow=0;labelBackgroundColor=none;strokeWidth=1;fontFamily=Verdana;fontSize=28;align=center;comic=1;" vertex="1" parent="1">
          <mxGeometry x="357" y="3220" width="563" height="50" as="geometry" />
        </mxCell>
        <mxCell id="_rJ5-Y76EPdLkxrL6b5Y-22" value="" style="whiteSpace=wrap;html=1;rounded=0;shadow=0;labelBackgroundColor=none;strokeWidth=1;fontFamily=Verdana;fontSize=28;align=center;comic=1;" vertex="1" parent="1">
          <mxGeometry x="359" y="3356" width="563" height="50" as="geometry" />
        </mxCell>
        <mxCell id="_rJ5-Y76EPdLkxrL6b5Y-23" value="Name" style="text;html=1;strokeColor=none;fillColor=none;align=center;verticalAlign=middle;whiteSpace=wrap;rounded=0;strokeWidth=0;perimeterSpacing=0;fontSize=28;" vertex="1" parent="1">
          <mxGeometry x="354" y="3176" width="96" height="30" as="geometry" />
        </mxCell>
        <mxCell id="_rJ5-Y76EPdLkxrL6b5Y-24" value="Email address" style="text;html=1;strokeColor=none;fillColor=none;align=center;verticalAlign=middle;whiteSpace=wrap;rounded=0;strokeWidth=0;perimeterSpacing=0;fontSize=28;" vertex="1" parent="1">
          <mxGeometry x="342" y="3302" width="193" height="30" as="geometry" />
        </mxCell>
        <mxCell id="_rJ5-Y76EPdLkxrL6b5Y-25" value="" style="line;strokeWidth=1;html=1;rounded=0;shadow=0;labelBackgroundColor=none;fillColor=none;fontFamily=Verdana;fontSize=14;fontColor=#000000;align=center;comic=1;" vertex="1" parent="1">
          <mxGeometry x="43" y="3959" width="1320" height="10" as="geometry" />
        </mxCell>
        <mxCell id="_rJ5-Y76EPdLkxrL6b5Y-26" value="LOGO" style="whiteSpace=wrap;html=1;rounded=0;shadow=0;labelBackgroundColor=none;strokeWidth=1;fontFamily=Verdana;fontSize=28;align=center;comic=1;" vertex="1" parent="1">
          <mxGeometry x="1130" y="2900" width="190" height="50" as="geometry" />
        </mxCell>
        <mxCell id="_rJ5-Y76EPdLkxrL6b5Y-27" value="LOGO" style="whiteSpace=wrap;html=1;rounded=0;shadow=0;labelBackgroundColor=none;strokeWidth=1;fontFamily=Verdana;fontSize=28;align=center;comic=1;" vertex="1" parent="1">
          <mxGeometry x="70" y="3995" width="190" height="50" as="geometry" />
        </mxCell>
        <mxCell id="_rJ5-Y76EPdLkxrL6b5Y-28" value="Agile Software Management System" style="text;html=1;strokeColor=none;fillColor=none;align=center;verticalAlign=middle;whiteSpace=wrap;rounded=0;" vertex="1" parent="1">
          <mxGeometry x="72" y="4082" width="220" height="30" as="geometry" />
        </mxCell>
        <mxCell id="_rJ5-Y76EPdLkxrL6b5Y-29" value="E-Pharmacist Autumn Semester 2023" style="text;html=1;strokeColor=none;fillColor=none;align=center;verticalAlign=middle;whiteSpace=wrap;rounded=0;" vertex="1" parent="1">
          <mxGeometry x="1127" y="4085" width="220" height="30" as="geometry" />
        </mxCell>
        <mxCell id="_rJ5-Y76EPdLkxrL6b5Y-30" value="SIGN UP" style="whiteSpace=wrap;html=1;rounded=0;shadow=0;labelBackgroundColor=none;strokeWidth=1;fontFamily=Verdana;fontSize=28;align=center;comic=1;fillColor=#0050ef;fontColor=#ffffff;strokeColor=#001DBC;" vertex="1" parent="1">
          <mxGeometry x="354" y="3824" width="230" height="50" as="geometry" />
        </mxCell>
        <mxCell id="_rJ5-Y76EPdLkxrL6b5Y-31" value="" style="whiteSpace=wrap;html=1;rounded=0;shadow=0;labelBackgroundColor=none;strokeWidth=1;fontFamily=Verdana;fontSize=28;align=center;comic=1;" vertex="1" parent="1">
          <mxGeometry x="357" y="3492" width="563" height="50" as="geometry" />
        </mxCell>
        <mxCell id="_rJ5-Y76EPdLkxrL6b5Y-32" value="Password" style="text;html=1;strokeColor=none;fillColor=none;align=center;verticalAlign=middle;whiteSpace=wrap;rounded=0;strokeWidth=0;perimeterSpacing=0;fontSize=28;" vertex="1" parent="1">
          <mxGeometry x="325" y="3438" width="193" height="30" as="geometry" />
        </mxCell>
        <mxCell id="_rJ5-Y76EPdLkxrL6b5Y-33" value="" style="whiteSpace=wrap;html=1;rounded=0;shadow=0;labelBackgroundColor=none;strokeWidth=1;fontFamily=Verdana;fontSize=28;align=center;comic=1;" vertex="1" parent="1">
          <mxGeometry x="359" y="3619" width="563" height="50" as="geometry" />
        </mxCell>
        <mxCell id="_rJ5-Y76EPdLkxrL6b5Y-34" value="Confirm Password" style="text;html=1;strokeColor=none;fillColor=none;align=center;verticalAlign=middle;whiteSpace=wrap;rounded=0;strokeWidth=0;perimeterSpacing=0;fontSize=28;" vertex="1" parent="1">
          <mxGeometry x="338" y="3565" width="258" height="30" as="geometry" />
        </mxCell>
        <mxCell id="_rJ5-Y76EPdLkxrL6b5Y-35" value="Role" style="text;html=1;strokeColor=none;fillColor=none;align=center;verticalAlign=middle;whiteSpace=wrap;rounded=0;strokeWidth=0;perimeterSpacing=0;fontSize=28;" vertex="1" parent="1">
          <mxGeometry x="333" y="3696" width="193" height="30" as="geometry" />
        </mxCell>
        <mxCell id="_rJ5-Y76EPdLkxrL6b5Y-36" value="" style="ellipse;whiteSpace=wrap;html=1;aspect=fixed;fillColor=#bac8d3;strokeColor=#23445d;" vertex="1" parent="1">
          <mxGeometry x="424" y="3750" width="20" height="20" as="geometry" />
        </mxCell>
        <mxCell id="_rJ5-Y76EPdLkxrL6b5Y-37" value="" style="ellipse;whiteSpace=wrap;html=1;aspect=fixed;fillColor=#bac8d3;strokeColor=#23445d;" vertex="1" parent="1">
          <mxGeometry x="535" y="3750" width="20" height="20" as="geometry" />
        </mxCell>
        <mxCell id="_rJ5-Y76EPdLkxrL6b5Y-38" value="" style="ellipse;whiteSpace=wrap;html=1;aspect=fixed;fillColor=#bac8d3;strokeColor=#23445d;" vertex="1" parent="1">
          <mxGeometry x="790" y="3750" width="20" height="20" as="geometry" />
        </mxCell>
        <mxCell id="_rJ5-Y76EPdLkxrL6b5Y-39" value="User" style="text;html=1;strokeColor=none;fillColor=none;align=center;verticalAlign=middle;whiteSpace=wrap;rounded=0;strokeWidth=0;perimeterSpacing=0;fontSize=20;" vertex="1" parent="1">
          <mxGeometry x="387" y="3746" width="163" height="30" as="geometry" />
        </mxCell>
        <mxCell id="_rJ5-Y76EPdLkxrL6b5Y-40" value="Subject Master Expert" style="text;html=1;strokeColor=none;fillColor=none;align=center;verticalAlign=middle;whiteSpace=wrap;rounded=0;strokeWidth=0;perimeterSpacing=0;fontSize=20;" vertex="1" parent="1">
          <mxGeometry x="564.5" y="3746" width="206.5" height="30" as="geometry" />
        </mxCell>
        <mxCell id="_rJ5-Y76EPdLkxrL6b5Y-41" value="Pharmacist" style="text;html=1;strokeColor=none;fillColor=none;align=center;verticalAlign=middle;whiteSpace=wrap;rounded=0;strokeWidth=0;perimeterSpacing=0;fontSize=20;" vertex="1" parent="1">
          <mxGeometry x="791" y="3745" width="163" height="30" as="geometry" />
        </mxCell>
      </root>
    </mxGraphModel>
  </diagram>
</mxfile>
