module myapp

go 1.20

require github.com/gorilla/mux v1.8.0

require github.com/lib/pq v1.10.8


// require github.com/rs/xid v1.5.0

// require (
// 	// github.com/gorilla/securecookie v1.1.1 // indirect
// 	// github.com/gorilla/sessions v1.2.1 // indirect
// )

// indirect

// indirect

// indirect
