<mxfile host="app.diagrams.net" modified="2023-03-31T04:34:30.801Z" agent="Mozilla/5.0 (Windows NT 10.0; Win64; x64) AppleWebKit/537.36 (KHTML, like Gecko) Chrome/111.0.0.0 Safari/537.36" etag="6CE08LJICfX1eGfZWUFi" version="21.1.1" type="gitlab">
  <diagram name="Page-1" id="03018318-947c-dd8e-b7a3-06fadd420f32">
    <mxGraphModel dx="1985" dy="1193" grid="1" gridSize="10" guides="1" tooltips="1" connect="1" arrows="1" fold="1" page="1" pageScale="1" pageWidth="1100" pageHeight="850" background="none" math="0" shadow="0">
      <root>
        <mxCell id="0" />
        <mxCell id="1" parent="0" />
        <mxCell id="677b7b8949515195-1" value="" style="whiteSpace=wrap;html=1;rounded=0;shadow=0;labelBackgroundColor=none;strokeColor=#000000;strokeWidth=1;fillColor=none;fontFamily=Verdana;fontSize=12;fontColor=#000000;align=center;comic=1;" parent="1" vertex="1">
          <mxGeometry x="20" y="20" width="1060" height="700" as="geometry" />
        </mxCell>
        <mxCell id="677b7b8949515195-2" value="LOGO" style="whiteSpace=wrap;html=1;rounded=0;shadow=0;labelBackgroundColor=none;strokeWidth=1;fontFamily=Verdana;fontSize=28;align=center;comic=1;" parent="1" vertex="1">
          <mxGeometry x="450" y="60" width="190" height="50" as="geometry" />
        </mxCell>
        <mxCell id="677b7b8949515195-9" value="" style="line;strokeWidth=1;html=1;rounded=0;shadow=0;labelBackgroundColor=none;fillColor=none;fontFamily=Verdana;fontSize=14;fontColor=#000000;align=center;comic=1;" parent="1" vertex="1">
          <mxGeometry x="20" y="140" width="1060" height="10" as="geometry" />
        </mxCell>
        <mxCell id="Gh_5zaut1YJ0rLrzu3FJ-3" value="&lt;font style=&quot;font-size: 30px;&quot;&gt;ALL NEWS&lt;/font&gt;" style="rounded=0;whiteSpace=wrap;html=1;" vertex="1" parent="1">
          <mxGeometry x="30" y="55" width="200" height="60" as="geometry" />
        </mxCell>
        <mxCell id="Gh_5zaut1YJ0rLrzu3FJ-7" value="LOGIN" style="whiteSpace=wrap;html=1;rounded=0;shadow=0;labelBackgroundColor=none;strokeWidth=1;fontFamily=Verdana;fontSize=28;align=center;comic=1;" vertex="1" parent="1">
          <mxGeometry x="800" y="60" width="130" height="50" as="geometry" />
        </mxCell>
        <mxCell id="Gh_5zaut1YJ0rLrzu3FJ-8" value="SIGN UP" style="whiteSpace=wrap;html=1;rounded=0;shadow=0;labelBackgroundColor=none;strokeWidth=1;fontFamily=Verdana;fontSize=28;align=center;comic=1;" vertex="1" parent="1">
          <mxGeometry x="940" y="60" width="130" height="50" as="geometry" />
        </mxCell>
        <mxCell id="Gh_5zaut1YJ0rLrzu3FJ-10" value="" style="line;strokeWidth=1;html=1;rounded=0;shadow=0;labelBackgroundColor=none;fillColor=none;fontFamily=Verdana;fontSize=14;fontColor=#000000;align=center;comic=1;" vertex="1" parent="1">
          <mxGeometry x="20" y="630" width="1060" height="10" as="geometry" />
        </mxCell>
        <mxCell id="Gh_5zaut1YJ0rLrzu3FJ-14" value="&lt;font style=&quot;font-size: 19px;&quot;&gt;LOGO&lt;/font&gt;" style="whiteSpace=wrap;html=1;rounded=0;shadow=0;labelBackgroundColor=none;strokeWidth=1;fontFamily=Verdana;fontSize=28;align=center;comic=1;" vertex="1" parent="1">
          <mxGeometry x="35" y="660" width="95" height="30" as="geometry" />
        </mxCell>
        <mxCell id="Gh_5zaut1YJ0rLrzu3FJ-15" value="&lt;font style=&quot;font-size: 23px;&quot;&gt;NEWS&lt;/font&gt;" style="rounded=0;whiteSpace=wrap;html=1;" vertex="1" parent="1">
          <mxGeometry x="170" y="355" width="170" height="30" as="geometry" />
        </mxCell>
        <mxCell id="Gh_5zaut1YJ0rLrzu3FJ-16" value="&lt;font style=&quot;font-size: 23px;&quot;&gt;DETAILS&lt;/font&gt;" style="rounded=0;whiteSpace=wrap;html=1;" vertex="1" parent="1">
          <mxGeometry x="110" y="490" width="170" height="30" as="geometry" />
        </mxCell>
        <mxCell id="Gh_5zaut1YJ0rLrzu3FJ-17" value="&lt;font style=&quot;font-size: 23px;&quot;&gt;NEWS&lt;/font&gt;" style="rounded=0;whiteSpace=wrap;html=1;" vertex="1" parent="1">
          <mxGeometry x="500" y="355" width="170" height="30" as="geometry" />
        </mxCell>
        <mxCell id="Gh_5zaut1YJ0rLrzu3FJ-18" value="&lt;font style=&quot;font-size: 23px;&quot;&gt;DETAILS&lt;/font&gt;" style="rounded=0;whiteSpace=wrap;html=1;" vertex="1" parent="1">
          <mxGeometry x="430" y="490" width="170" height="30" as="geometry" />
        </mxCell>
        <mxCell id="Gh_5zaut1YJ0rLrzu3FJ-19" value="&lt;font style=&quot;font-size: 23px;&quot;&gt;NEWS&lt;/font&gt;" style="rounded=0;whiteSpace=wrap;html=1;" vertex="1" parent="1">
          <mxGeometry x="830" y="355" width="170" height="30" as="geometry" />
        </mxCell>
        <mxCell id="Gh_5zaut1YJ0rLrzu3FJ-20" value="&lt;font style=&quot;font-size: 23px;&quot;&gt;DETAILS&lt;/font&gt;" style="rounded=0;whiteSpace=wrap;html=1;" vertex="1" parent="1">
          <mxGeometry x="760" y="490" width="170" height="30" as="geometry" />
        </mxCell>
        <mxCell id="Gh_5zaut1YJ0rLrzu3FJ-21" value="" style="whiteSpace=wrap;html=1;rounded=0;shadow=0;labelBackgroundColor=none;strokeColor=#000000;strokeWidth=1;fillColor=none;fontFamily=Verdana;fontSize=12;fontColor=#000000;align=center;comic=1;" vertex="1" parent="1">
          <mxGeometry x="20" y="770" width="1060" height="700" as="geometry" />
        </mxCell>
        <mxCell id="Gh_5zaut1YJ0rLrzu3FJ-22" value="" style="line;strokeWidth=1;html=1;rounded=0;shadow=0;labelBackgroundColor=none;fillColor=none;fontFamily=Verdana;fontSize=14;fontColor=#000000;align=center;comic=1;" vertex="1" parent="1">
          <mxGeometry x="20" y="850" width="1060" height="10" as="geometry" />
        </mxCell>
        <mxCell id="Gh_5zaut1YJ0rLrzu3FJ-23" value="" style="line;strokeWidth=1;html=1;rounded=0;shadow=0;labelBackgroundColor=none;fillColor=none;fontFamily=Verdana;fontSize=14;fontColor=#000000;align=center;comic=1;" vertex="1" parent="1">
          <mxGeometry x="20" y="1380" width="1060" height="10" as="geometry" />
        </mxCell>
        <mxCell id="Gh_5zaut1YJ0rLrzu3FJ-24" value="&lt;font style=&quot;font-size: 19px;&quot;&gt;LOGO&lt;/font&gt;" style="whiteSpace=wrap;html=1;rounded=0;shadow=0;labelBackgroundColor=none;strokeWidth=1;fontFamily=Verdana;fontSize=28;align=center;comic=1;" vertex="1" parent="1">
          <mxGeometry x="35" y="1410" width="95" height="30" as="geometry" />
        </mxCell>
        <mxCell id="Gh_5zaut1YJ0rLrzu3FJ-25" value="&lt;font style=&quot;font-size: 30px;&quot;&gt;ALL NEWS&lt;/font&gt;" style="rounded=0;whiteSpace=wrap;html=1;" vertex="1" parent="1">
          <mxGeometry x="35" y="780" width="200" height="60" as="geometry" />
        </mxCell>
        <mxCell id="Gh_5zaut1YJ0rLrzu3FJ-26" value="LOGO" style="whiteSpace=wrap;html=1;rounded=0;shadow=0;labelBackgroundColor=none;strokeWidth=1;fontFamily=Verdana;fontSize=28;align=center;comic=1;" vertex="1" parent="1">
          <mxGeometry x="870" y="790" width="190" height="50" as="geometry" />
        </mxCell>
        <mxCell id="Gh_5zaut1YJ0rLrzu3FJ-28" value="" style="swimlane;startSize=0;" vertex="1" parent="1">
          <mxGeometry x="90" y="280" width="260" height="260" as="geometry" />
        </mxCell>
        <mxCell id="Gh_5zaut1YJ0rLrzu3FJ-31" value="" style="swimlane;startSize=0;" vertex="1" parent="1">
          <mxGeometry x="420" y="280" width="260" height="260" as="geometry" />
        </mxCell>
        <mxCell id="Gh_5zaut1YJ0rLrzu3FJ-32" value="" style="swimlane;startSize=0;" vertex="1" parent="1">
          <mxGeometry x="750" y="280" width="260" height="260" as="geometry" />
        </mxCell>
        <mxCell id="Gh_5zaut1YJ0rLrzu3FJ-33" value="" style="swimlane;startSize=0;" vertex="1" parent="1">
          <mxGeometry x="260" y="935" width="560" height="395" as="geometry" />
        </mxCell>
        <mxCell id="Gh_5zaut1YJ0rLrzu3FJ-36" value="&lt;font style=&quot;font-size: 27px;&quot;&gt;LOG INTO YOUR ACCOUNT&lt;/font&gt;" style="text;html=1;strokeColor=none;fillColor=none;align=center;verticalAlign=middle;whiteSpace=wrap;rounded=0;" vertex="1" parent="Gh_5zaut1YJ0rLrzu3FJ-33">
          <mxGeometry x="90" y="25" width="400" height="30" as="geometry" />
        </mxCell>
        <mxCell id="Gh_5zaut1YJ0rLrzu3FJ-37" value="&lt;font style=&quot;font-size: 18px;&quot;&gt;Email address&lt;/font&gt;" style="text;html=1;strokeColor=none;fillColor=none;align=left;verticalAlign=middle;whiteSpace=wrap;rounded=0;" vertex="1" parent="Gh_5zaut1YJ0rLrzu3FJ-33">
          <mxGeometry x="20" y="115" width="230" height="30" as="geometry" />
        </mxCell>
        <mxCell id="Gh_5zaut1YJ0rLrzu3FJ-38" value="&lt;font style=&quot;font-size: 18px;&quot;&gt;Password&lt;/font&gt;" style="text;html=1;strokeColor=none;fillColor=none;align=left;verticalAlign=middle;whiteSpace=wrap;rounded=0;" vertex="1" parent="Gh_5zaut1YJ0rLrzu3FJ-33">
          <mxGeometry x="20" y="195" width="230" height="30" as="geometry" />
        </mxCell>
        <mxCell id="Gh_5zaut1YJ0rLrzu3FJ-34" value="" style="rounded=0;whiteSpace=wrap;html=1;" vertex="1" parent="1">
          <mxGeometry x="280" y="1080" width="410" height="40" as="geometry" />
        </mxCell>
        <mxCell id="Gh_5zaut1YJ0rLrzu3FJ-39" value="" style="rounded=0;whiteSpace=wrap;html=1;" vertex="1" parent="1">
          <mxGeometry x="280" y="1170" width="410" height="40" as="geometry" />
        </mxCell>
        <mxCell id="Gh_5zaut1YJ0rLrzu3FJ-42" value="Agile Software Management System" style="text;html=1;strokeColor=none;fillColor=none;align=left;verticalAlign=middle;whiteSpace=wrap;rounded=0;" vertex="1" parent="1">
          <mxGeometry x="30" y="690" width="260" height="30" as="geometry" />
        </mxCell>
        <mxCell id="Gh_5zaut1YJ0rLrzu3FJ-43" value="Agile Software Management System" style="text;html=1;strokeColor=none;fillColor=none;align=left;verticalAlign=middle;whiteSpace=wrap;rounded=0;" vertex="1" parent="1">
          <mxGeometry x="30" y="1440" width="260" height="30" as="geometry" />
        </mxCell>
        <mxCell id="Gh_5zaut1YJ0rLrzu3FJ-44" value="" style="whiteSpace=wrap;html=1;rounded=0;shadow=0;labelBackgroundColor=none;strokeColor=#000000;strokeWidth=1;fillColor=none;fontFamily=Verdana;fontSize=12;fontColor=#000000;align=center;comic=1;" vertex="1" parent="1">
          <mxGeometry x="20" y="1530" width="1060" height="770" as="geometry" />
        </mxCell>
        <mxCell id="Gh_5zaut1YJ0rLrzu3FJ-45" value="" style="line;strokeWidth=1;html=1;rounded=0;shadow=0;labelBackgroundColor=none;fillColor=none;fontFamily=Verdana;fontSize=14;fontColor=#000000;align=center;comic=1;" vertex="1" parent="1">
          <mxGeometry x="20" y="2220" width="1060" height="10" as="geometry" />
        </mxCell>
        <mxCell id="Gh_5zaut1YJ0rLrzu3FJ-46" value="&lt;font style=&quot;font-size: 19px;&quot;&gt;LOGO&lt;/font&gt;" style="whiteSpace=wrap;html=1;rounded=0;shadow=0;labelBackgroundColor=none;strokeWidth=1;fontFamily=Verdana;fontSize=28;align=center;comic=1;" vertex="1" parent="1">
          <mxGeometry x="30" y="2250" width="95" height="30" as="geometry" />
        </mxCell>
        <mxCell id="Gh_5zaut1YJ0rLrzu3FJ-47" value="&lt;font style=&quot;font-size: 30px;&quot;&gt;ALL NEWS&lt;/font&gt;" style="rounded=0;whiteSpace=wrap;html=1;" vertex="1" parent="1">
          <mxGeometry x="35" y="1550" width="200" height="60" as="geometry" />
        </mxCell>
        <mxCell id="Gh_5zaut1YJ0rLrzu3FJ-48" value="LOGO" style="whiteSpace=wrap;html=1;rounded=0;shadow=0;labelBackgroundColor=none;strokeWidth=1;fontFamily=Verdana;fontSize=28;align=center;comic=1;" vertex="1" parent="1">
          <mxGeometry x="870" y="1560" width="190" height="50" as="geometry" />
        </mxCell>
        <mxCell id="Gh_5zaut1YJ0rLrzu3FJ-49" value="" style="swimlane;startSize=0;" vertex="1" parent="1">
          <mxGeometry x="260" y="1650" width="560" height="510" as="geometry" />
        </mxCell>
        <mxCell id="Gh_5zaut1YJ0rLrzu3FJ-50" value="&lt;font style=&quot;font-size: 27px;&quot;&gt;CREATE NEW ACCOUNT&lt;/font&gt;" style="text;html=1;strokeColor=none;fillColor=none;align=center;verticalAlign=middle;whiteSpace=wrap;rounded=0;" vertex="1" parent="Gh_5zaut1YJ0rLrzu3FJ-49">
          <mxGeometry x="90" y="25" width="400" height="30" as="geometry" />
        </mxCell>
        <mxCell id="Gh_5zaut1YJ0rLrzu3FJ-51" value="&lt;font style=&quot;font-size: 18px;&quot;&gt;Email address&lt;/font&gt;" style="text;html=1;strokeColor=none;fillColor=none;align=left;verticalAlign=middle;whiteSpace=wrap;rounded=0;" vertex="1" parent="Gh_5zaut1YJ0rLrzu3FJ-49">
          <mxGeometry x="20" y="135" width="230" height="30" as="geometry" />
        </mxCell>
        <mxCell id="Gh_5zaut1YJ0rLrzu3FJ-52" value="&lt;font style=&quot;font-size: 18px;&quot;&gt;Password&lt;/font&gt;" style="text;html=1;strokeColor=none;fillColor=none;align=left;verticalAlign=middle;whiteSpace=wrap;rounded=0;" vertex="1" parent="Gh_5zaut1YJ0rLrzu3FJ-49">
          <mxGeometry x="20" y="205" width="230" height="30" as="geometry" />
        </mxCell>
        <mxCell id="Gh_5zaut1YJ0rLrzu3FJ-62" value="&lt;font style=&quot;font-size: 18px;&quot;&gt;Confirm Password&lt;/font&gt;" style="text;html=1;strokeColor=none;fillColor=none;align=left;verticalAlign=middle;whiteSpace=wrap;rounded=0;" vertex="1" parent="Gh_5zaut1YJ0rLrzu3FJ-49">
          <mxGeometry x="20" y="285" width="230" height="30" as="geometry" />
        </mxCell>
        <mxCell id="Gh_5zaut1YJ0rLrzu3FJ-63" value="" style="rounded=0;whiteSpace=wrap;html=1;" vertex="1" parent="Gh_5zaut1YJ0rLrzu3FJ-49">
          <mxGeometry x="20" y="325" width="410" height="40" as="geometry" />
        </mxCell>
        <mxCell id="Gh_5zaut1YJ0rLrzu3FJ-68" value="Subject Matter Expert" style="shape=ellipse;fillColor=#eeeeee;strokeColor=#999999;gradientColor=#cccccc;html=1;align=left;spacingLeft=4;fontSize=17;fontColor=#666666;labelPosition=right;shadow=0;" vertex="1" parent="Gh_5zaut1YJ0rLrzu3FJ-49">
          <mxGeometry x="120" y="410" width="15" height="15" as="geometry" />
        </mxCell>
        <mxCell id="Gh_5zaut1YJ0rLrzu3FJ-69" value="Pharmacist" style="shape=ellipse;fillColor=#eeeeee;strokeColor=#999999;gradientColor=#cccccc;html=1;align=left;spacingLeft=4;fontSize=17;fontColor=#666666;labelPosition=right;shadow=0;" vertex="1" parent="Gh_5zaut1YJ0rLrzu3FJ-49">
          <mxGeometry x="350" y="410" width="15" height="15" as="geometry" />
        </mxCell>
        <mxCell id="Gh_5zaut1YJ0rLrzu3FJ-66" value="User" style="shape=ellipse;fillColor=#eeeeee;strokeColor=#999999;gradientColor=#cccccc;html=1;align=left;spacingLeft=4;fontSize=17;fontColor=#666666;labelPosition=right;shadow=0;" vertex="1" parent="Gh_5zaut1YJ0rLrzu3FJ-49">
          <mxGeometry x="30" y="410" width="15" height="15" as="geometry" />
        </mxCell>
        <mxCell id="Gh_5zaut1YJ0rLrzu3FJ-55" value="" style="rounded=0;whiteSpace=wrap;html=1;" vertex="1" parent="1">
          <mxGeometry x="280" y="1815" width="410" height="40" as="geometry" />
        </mxCell>
        <mxCell id="Gh_5zaut1YJ0rLrzu3FJ-56" value="" style="rounded=0;whiteSpace=wrap;html=1;" vertex="1" parent="1">
          <mxGeometry x="280" y="1895" width="410" height="40" as="geometry" />
        </mxCell>
        <mxCell id="Gh_5zaut1YJ0rLrzu3FJ-58" value="Agile Software Management System" style="text;html=1;strokeColor=none;fillColor=none;align=left;verticalAlign=middle;whiteSpace=wrap;rounded=0;" vertex="1" parent="1">
          <mxGeometry x="25" y="2280" width="260" height="30" as="geometry" />
        </mxCell>
        <mxCell id="Gh_5zaut1YJ0rLrzu3FJ-59" value="" style="line;strokeWidth=1;html=1;rounded=0;shadow=0;labelBackgroundColor=none;fillColor=none;fontFamily=Verdana;fontSize=14;fontColor=#000000;align=center;comic=1;" vertex="1" parent="1">
          <mxGeometry x="20" y="1620" width="1060" height="10" as="geometry" />
        </mxCell>
        <mxCell id="Gh_5zaut1YJ0rLrzu3FJ-60" value="&lt;font style=&quot;font-size: 18px;&quot;&gt;Name&lt;/font&gt;" style="text;html=1;strokeColor=none;fillColor=none;align=left;verticalAlign=middle;whiteSpace=wrap;rounded=0;" vertex="1" parent="1">
          <mxGeometry x="280" y="1705" width="230" height="30" as="geometry" />
        </mxCell>
        <mxCell id="Gh_5zaut1YJ0rLrzu3FJ-61" value="" style="rounded=0;whiteSpace=wrap;html=1;" vertex="1" parent="1">
          <mxGeometry x="280" y="1735" width="410" height="40" as="geometry" />
        </mxCell>
        <mxCell id="Gh_5zaut1YJ0rLrzu3FJ-64" value="SIGNUP" style="strokeWidth=1;shadow=0;dashed=0;align=center;html=1;shape=mxgraph.mockup.buttons.button;strokeColor=#666666;fontColor=#ffffff;mainText=;buttonStyle=round;fontSize=17;fontStyle=1;fillColor=#008cff;whiteSpace=wrap;" vertex="1" parent="1">
          <mxGeometry x="280" y="2090" width="150" height="50" as="geometry" />
        </mxCell>
        <mxCell id="Gh_5zaut1YJ0rLrzu3FJ-65" value="LOGIN" style="strokeWidth=1;shadow=0;dashed=0;align=center;html=1;shape=mxgraph.mockup.buttons.button;strokeColor=#666666;fontColor=#ffffff;mainText=;buttonStyle=round;fontSize=17;fontStyle=1;fillColor=#008cff;whiteSpace=wrap;" vertex="1" parent="1">
          <mxGeometry x="280" y="1250" width="150" height="50" as="geometry" />
        </mxCell>
        <mxCell id="Gh_5zaut1YJ0rLrzu3FJ-70" value="&lt;font style=&quot;font-size: 15px;&quot;&gt;Role&lt;/font&gt;" style="text;html=1;strokeColor=none;fillColor=none;align=left;verticalAlign=middle;whiteSpace=wrap;rounded=0;" vertex="1" parent="1">
          <mxGeometry x="285" y="2030" width="60" height="30" as="geometry" />
        </mxCell>
      </root>
    </mxGraphModel>
  </diagram>
</mxfile>
