TypeName,Inches,ScreenResolution,Cpu,Ram,OpSys,Weight,TouchScreen,HDD,SSD,SSHD,FStorage,Laptop_Price
Ultrabook,13.3,2560x1600,Intel i5,8,macOS,1.37,No,0,128,0,0,71378.6832
Ultrabook,13.3,1440x900,Intel i5,8,macOS,1.34,No,0,0,0,128,47895.5232
Notebook,15.6,1920x1080,Intel i5,8,No OS,1.86,No,0,256,0,0,30636.0
Ultrabook,15.4,2880x1800,Intel i7,16,macOS,1.83,No,0,512,0,0,135195.33599999998
Ultrabook,13.3,2560x1600,Intel i5,8,macOS,1.37,No,0,256,0,0,96095.808
Notebook,15.6,1366x768,AMD A9,4,Windows 10,2.1,No,500,0,0,0,21312.0
Ultrabook,15.4,2880x1800,Intel i7,16,Mac OS X,2.04,No,0,0,0,256,114017.6016
Ultrabook,13.3,1440x900,Intel i5,8,macOS,1.34,No,0,0,0,256,61735.536
Ultrabook,14.0,1920x1080,Intel i7,16,Windows 10,1.3,No,0,512,0,0,79653.59999999999
Ultrabook,14.0,1920x1080,Intel i5,8,Windows 10,1.6,No,0,256,0,0,41025.6
Notebook,15.6,1366x768,Intel i5,4,No OS,1.86,No,500,0,0,0,20986.992
Notebook,15.6,1920x1080,Intel i3,4,No OS,1.86,No,500,0,0,0,18381.0672
Ultrabook,15.4,2880x1800,Intel i7,16,macOS,1.83,No,0,256,0,0,130001.6016
Notebook,15.6,1920x1080,Intel i3,4,Windows 10,2.2,No,0,256,0,0,26581.392
Ultrabook,12.0,2304x1440,Intel M ,8,macOS,0.92,No,0,256,0,0,67260.672
Ultrabook,13.3,2560x1600,Intel i5,8,macOS,1.37,No,0,256,0,0,80908.344
Notebook,15.6,1920x1080,Intel i7,8,Windows 10,2.2,No,0,256,0,0,39693.6
Ultrabook,15.4,2880x1800,Intel i7,16,macOS,1.83,No,0,512,0,0,152274.24
Notebook,15.6,1920x1080,Intel i3,8,No OS,2.2,No,1000,0,0,0,26586.72
Ultrabook,13.3,1920x1080,Intel i5,8,Windows 10,1.22,Yes,0,128,0,0,52161.12
Netbook,11.6,1366x768,Intel Atom,2,Windows 10,0.98,No,0,0,0,32,10224.432
Gaming,15.6,1920x1080,Intel i5,8,Windows 10,2.5,No,1000,128,0,0,53226.72
Notebook,15.6,1366x768,AMD E,4,No OS,1.86,No,500,0,0,0,13746.24
2 in 1 Convertible,13.3,1920x1080,Intel i5,8,Windows 10,1.62,Yes,0,256,0,0,43636.32
Ultrabook,15.6,1920x1080,Intel i7,8,Windows 10,1.91,No,0,256,0,0,35111.52
Notebook,15.6,1366x768,Intel i3,4,Windows 10,2.3,No,1000,0,0,0,22305.1392
Ultrabook,13.3,1440x900,Intel i5,8,Mac OS X,1.35,No,0,0,0,128,58554.72
Notebook,15.6,1920x1080,Intel i5,8,Windows 10,2.2,No,0,256,0,0,42624.0
Ultrabook,15.6,1920x1080,Intel i7,8,Windows 10,1.88,No,0,512,0,0,69157.44
Notebook,17.3,1920x1080,Intel i5,8,Windows 10,2.5,No,1000,0,0,0,47738.88
Notebook,15.6,1920x1080,Intel Atom,4,Windows 10,1.89,No,0,0,0,64,13053.0672
Notebook,14.0,1366x768,AMD E,2,Windows 10,1.65,No,0,0,0,32,10602.72
Notebook,17.3,1920x1080,AMD A6,4,Windows 10,2.71,No,500,0,0,0,23389.92
Ultrabook,13.3,3200x1800,Intel i7,16,Windows 10,1.2,Yes,0,512,0,0,99580.32
Ultrabook,13.3,1440x900,Intel i5,8,Mac OS X,1.35,No,0,0,0,256,53173.44
Notebook,14.0,1366x768,Intel Celeron,4,Windows 10,1.44,No,0,0,0,64,13266.72
Notebook,15.6,1366x768,Intel i3,4,Linux,2.1,No,1000,0,0,0,19553.76
Notebook,17.3,1920x1080,Intel i5,8,Windows 10,2.8,No,1000,128,0,0,52161.12
Notebook,15.6,1366x768,Intel i5,4,Windows 10,1.86,No,1000,0,0,0,26037.4032
Notebook,15.6,1920x1080,Intel i5,8,Windows 10,2.1,No,0,256,0,0,46833.12
Notebook,15.6,1920x1080,Intel i3,4,Linux,2.0,No,1000,0,0,0,20725.92
Gaming,15.6,1920x1080,Intel i7,16,Windows 10,2.65,No,1000,256,0,0,79866.72
Notebook,15.6,1366x768,Intel i5,8,Linux,2.3,No,1000,0,0,0,27864.9072
Notebook,15.6,1920x1080,Intel i5,4,Windows 10,2.2,No,0,256,0,0,36336.96
2 in 1 Convertible,17.3,1920x1080,Intel i5,12,Windows 10,2.77,Yes,1000,0,0,0,53226.72
Ultrabook,13.3,2560x1600,Intel i5,8,macOS,1.37,No,0,256,0,0,75604.31999999999
Notebook,15.6,1366x768,Intel i3,4,No OS,2.2,No,0,128,0,0,19660.32
Gaming,17.3,1920x1080,AMD Ryzen,8,Windows 10,3.2,No,1000,256,0,0,69210.72
Notebook,15.6,1920x1080,Intel i5,4,Windows 10,2.3,No,0,256,0,0,34045.92
Notebook,17.3,1366x768,Intel Pentium,4,Windows 10,2.8,No,1000,0,0,0,24828.48
2 in 1 Convertible,10.1,1920x1200,Intel Atom,4,Android,0.69,Yes,0,0,0,64,16996.32
Notebook,15.6,1920x1080,Intel i7,8,Windows 10,2.2,No,0,256,0,0,44808.48
Notebook,15.6,1920x1080,AMD A6,4,Windows 10,1.86,No,0,256,0,0,21231.5472
Notebook,13.3,1920x1080,Intel i7,8,Windows 10,1.49,No,0,512,0,0,58767.84
Notebook,15.6,1366x768,Intel i3,4,Windows 10,2.4,No,1000,0,0,0,20459.52
Notebook,15.6,1920x1080,Intel i7,8,Windows 10,2.13,No,0,256,0,0,40908.384
Notebook,15.6,1920x1080,Intel i3,4,Windows 10,1.91,No,0,128,0,0,23389.92
Notebook,15.6,1366x768,Intel i5,4,Windows 10,2.0,No,0,256,0,0,31232.203200000004
Gaming,17.3,1920x1080,Intel i7,16,Windows 10,2.43,No,2000,256,0,0,130482.72
Notebook,15.6,1920x1080,Intel i3,4,Linux,2.0,No,0,256,0,0,22111.2
Notebook,17.3,1920x1080,Intel i7,16,Windows 10,2.8,No,2000,256,0,0,69210.72
Ultrabook,14.0,1920x1080,Intel i5,8,Windows 10,1.7,No,0,256,0,0,46833.12
Notebook,14.0,1920x1080,Intel i3,8,No OS,1.7,No,0,256,0,0,31914.72
Notebook,14.0,1920x1080,Intel i5,8,Windows 10,1.4,No,0,256,0,0,50136.48
Notebook,15.6,1920x1080,Intel i5,8,Windows 10,1.86,No,0,256,0,0,36763.2
Ultrabook,15.6,1920x1080,Intel i7,16,Windows 10,1.8,No,0,512,0,0,105654.24
Notebook,15.6,1366x768,Intel i3,4,Windows 10,1.86,No,500,0,0,0,23373.4032
Notebook,14.0,1366x768,Intel Celeron,4,Windows 10,1.44,No,0,32,0,0,12201.12
Notebook,15.6,1920x1080,Intel i5,4,Windows 10,1.9,No,1000,0,0,0,29250.72
Gaming,17.3,1920x1080,Intel i7,12,Linux,3.0,No,1000,0,0,0,50562.72
Ultrabook,13.5,2256x1504,Intel i5,4,Windows 10 S,1.25,Yes,0,128,0,0,58021.92
Ultrabook,13.3,1920x1080,Intel i7,8,Windows 10,1.4,No,0,256,0,0,50882.4
Notebook,15.6,1920x1080,Intel i7,8,Windows 10,2.2,No,0,256,0,0,46353.6
Gaming,17.3,1920x1080,Intel i5,8,Windows 10,2.7,No,1000,128,0,0,58341.6
Notebook,14.0,1366x768,Intel i3,8,Windows 10,2.1,No,1000,0,0,0,20725.92
Gaming,15.6,1920x1080,Intel i7,8,Windows 10,2.2,No,1000,0,0,0,50562.72
Notebook,15.6,1920x1080,Intel i5,8,No OS,2.2,No,2000,0,0,0,27652.32
Notebook,15.6,1920x1080,Intel i7,8,Windows 10,2.02,No,1000,128,0,0,45554.4
Notebook,15.6,1920x1080,Intel i3,4,Windows 10,2.2,No,1000,0,0,0,28238.4
Notebook,17.3,1920x1080,Intel i5,8,Windows 10,2.5,No,1000,128,0,0,52054.56
Ultrabook,15.6,1920x1080,Intel i5,8,Windows 10,1.88,No,0,256,0,0,58403.4048
Ultrabook,12.0,2304x1440,Intel i5,8,macOS,0.92,No,0,512,0,0,80452.8
Notebook,14.0,1920x1080,Intel i5,8,Windows 10,1.63,No,0,256,0,0,45820.8
Notebook,15.6,1920x1080,AMD A6,4,Windows 10,2.2,No,0,128,0,0,21258.72
Notebook,15.6,1366x768,AMD A9,4,Windows 10,2.1,No,1000,0,0,0,21045.6
Gaming,15.6,1920x1080,Intel i7,16,Windows 10,2.65,No,1000,128,0,0,71874.72
Ultrabook,15.6,1920x1080,Intel i7,8,Windows 10,1.83,No,0,256,0,0,37242.72
Notebook,15.6,1920x1080,Intel i5,8,Windows 10,1.96,No,0,256,0,0,31914.1872
Gaming,15.6,1920x1080,Intel i7,16,Windows 10,2.2,No,1000,128,0,0,77202.72
Ultrabook,13.3,1920x1080,Intel i7,8,Windows 10,1.21,No,0,256,0,0,87858.72
Gaming,15.6,1920x1080,AMD FX,8,Windows 10,2.45,No,1000,0,0,0,37242.72
Notebook,15.6,1920x1080,Intel i7,8,Windows 10,2.2,No,1000,0,0,0,36709.92
Notebook,13.3,1920x1080,Intel i7,16,Windows 10,1.49,No,0,512,0,0,63776.16
Gaming,15.6,1920x1080,Intel i5,8,Windows 10,2.65,No,0,256,0,0,63669.6
Ultrabook,14.0,1920x1080,Intel i7,8,Windows 10,1.25,No,0,256,0,0,55890.72
2 in 1 Convertible,13.3,1920x1080,Intel i5,8,Windows 10,1.5,Yes,0,256,0,0,45128.16
Notebook,15.6,1920x1080,Intel i7,8,Linux,2.2,No,1000,0,0,0,31962.672
Notebook,15.6,1920x1080,Intel i3,4,Linux,2.2,No,0,256,0,0,25840.8
Notebook,15.6,1920x1080,Intel i3,6,Windows 10,2.0,No,0,256,0,0,30742.56
Gaming,15.6,1920x1080,Intel i7,12,Windows 10,2.62,No,1000,128,0,0,66546.72
Notebook,15.6,1920x1080,Intel i7,8,Windows 10,1.91,No,0,256,0,0,38308.32
Notebook,15.6,1920x1080,AMD E,4,Windows 10,2.1,No,500,0,0,0,18594.72
Notebook,15.6,1920x1080,Intel i5,8,Linux,2.2,No,1000,0,0,0,34472.16
Ultrabook,13.3,1920x1080,Intel i7,8,Windows 10,1.38,No,0,256,0,0,59620.32
Ultrabook,13.5,2256x1504,Intel i5,8,Windows 10 S,1.25,Yes,0,256,0,0,71395.2
Notebook,14.0,1920x1080,Intel i5,6,Windows 10,1.58,No,0,256,0,0,35111.52
Notebook,15.6,1920x1080,Intel i3,4,Windows 10,1.85,No,1000,0,0,0,22105.872
Ultrabook,14.0,1920x1080,Intel i7,8,Windows 10,1.3,No,0,256,0,0,63563.04
Gaming,15.6,1920x1080,Intel i7,16,Windows 10,2.2,No,1000,256,0,0,69210.72
Notebook,14.0,1920x1080,Intel i7,8,Windows 10,1.58,No,0,256,0,0,78854.4
Ultrabook,15.6,1920x1080,Intel i7,16,Windows 10,1.5,No,1000,256,0,0,67239.36
Ultrabook,13.3,3200x1800,Intel i7,8,Windows 10,1.23,Yes,0,256,0,0,73473.12
2 in 1 Convertible,13.3,1920x1080,Intel i5,8,Windows 10,1.37,Yes,0,256,0,0,74538.72
Notebook,14.0,1366x768,Intel i5,4,Windows 10,1.63,No,500,0,0,0,38468.16
Ultrabook,13.3,1920x1080,Intel i5,8,Windows 10,1.21,No,0,256,0,0,86793.12
2 in 1 Convertible,13.3,1920x1080,Intel i5,8,Windows 10,1.26,Yes,0,256,0,0,74538.1872
Notebook,14.0,1920x1080,Intel i7,8,Windows 10,1.63,No,0,512,0,0,57755.52
Notebook,15.6,1920x1080,Intel i7,8,Windows 10,2.16,No,1000,256,0,0,60223.98239999999
Notebook,17.3,1920x1080,Intel i3,4,Windows 10,2.0,No,1000,0,0,0,30049.92
Notebook,15.6,1920x1080,Intel i7,8,Windows 10,1.7,No,0,256,0,0,59567.04
Notebook,15.6,1920x1080,Intel i3,6,Windows 10,2.1,Yes,1000,0,0,0,25521.12
Gaming,15.6,1920x1080,Intel i7,16,Windows 10,1.8,No,2000,256,0,0,119427.12
Notebook,15.6,1920x1080,Intel i5,8,No OS,2.2,No,0,256,0,0,33513.119999999995
Notebook,17.3,1920x1080,Intel i7,16,Windows 10,2.5,No,0,512,0,0,67718.88
Notebook,15.6,1366x768,AMD A9,4,Windows 10,2.1,No,0,256,0,0,24029.28
Notebook,15.6,1366x768,Intel Celeron,4,No OS,1.86,No,500,0,0,0,13799.52
Notebook,14.0,1920x1080,Intel i5,8,Windows 10,1.63,No,1000,0,0,0,43263.36
Notebook,14.0,1366x768,AMD E,4,Windows 10 S,1.65,No,0,64,0,0,14811.3072
Notebook,17.3,1920x1080,Intel i7,16,Windows 10,2.8,No,2000,256,0,0,74378.87999999999
Notebook,17.3,1920x1080,Intel i5,8,Windows 10,2.5,No,0,256,0,0,49443.84
Notebook,15.6,1366x768,Intel i5,8,Windows 10,2.36,No,1000,0,0,0,34045.3872
Notebook,15.6,1920x1080,Intel i3,4,Windows 10,2.2,No,1000,0,0,0,23922.72
Ultrabook,14.0,1920x1080,Intel i7,8,Windows 10,1.6,No,0,256,0,0,47099.52
Notebook,15.6,1920x1080,Intel i3,4,Windows 10,2.2,No,0,256,0,0,30476.16
Notebook,15.6,1366x768,Intel i7,8,Windows 10,2.05,No,1000,0,0,0,31861.44
Notebook,14.0,1920x1080,Intel i7,8,Windows 10,1.63,No,0,256,0,0,52640.64
Notebook,15.6,1366x768,Intel Celeron,4,No OS,1.9,No,1000,0,0,0,13445.7408
Gaming,17.3,1920x1080,Intel i5,8,Windows 10,3.0,No,1000,128,0,0,49976.64
Notebook,15.6,1920x1080,Intel i5,4,No OS,2.2,No,1000,0,0,0,26586.72
Notebook,13.3,1920x1080,Intel i5,4,Windows 10,1.32,No,0,256,0,0,37242.72
Notebook,17.3,1920x1080,Intel i3,4,Windows 10,3.0,No,1000,0,0,0,34898.4
Notebook,14.0,1920x1080,Intel i5,8,Windows 10,1.75,No,0,256,0,0,59461.5456
Gaming,15.6,1920x1080,Intel i7,8,No OS,2.4,No,0,256,0,0,46300.32
Notebook,15.6,1366x768,Intel i5,4,Windows 10,2.1,No,500,0,0,0,32074.56
Notebook,15.6,1366x768,AMD A6,4,Windows 10,1.86,No,0,256,0,0,19660.32
Ultrabook,14.0,1920x1080,Intel i7,8,Windows 10,1.25,No,0,256,0,0,58554.72
Ultrabook,12.5,3840x2160,Intel M ,8,Windows 10,0.97,Yes,0,512,0,0,107305.92
Notebook,15.6,1920x1080,Intel Celeron,4,Windows 10,2.0,No,1000,0,0,0,18328.32
Gaming,17.3,1920x1080,Intel i7,16,Windows 10,2.9,No,1000,256,0,0,108105.12
Notebook,15.6,1366x768,Intel i3,4,Windows 10,2.1,No,1000,0,0,0,23816.16
Gaming,15.6,1920x1080,Intel i7,16,Windows 10,2.56,No,0,512,0,0,66560.5728
Gaming,15.6,1920x1080,Intel i7,8,Windows 10,2.62,No,0,0,1000,0,47898.72
Notebook,15.6,1366x768,Intel i5,4,Windows 10,1.9,No,0,128,0,0,26533.44
Gaming,17.3,1920x1080,Intel i7,16,Windows 10,2.8,No,1000,256,0,0,100699.2
Ultrabook,14.0,1920x1080,Intel i5,4,Windows 10,1.48,No,0,256,0,0,57648.96
Notebook,15.6,1920x1080,Intel i5,6,Windows 10,1.91,No,0,256,0,0,32980.32
2 in 1 Convertible,14.0,1920x1080,Intel i3,4,Windows 10,1.74,Yes,0,256,0,0,33513.119999999995
2 in 1 Convertible,13.3,1920x1080,Intel i5,8,Windows 10,1.1,Yes,0,256,0,0,70063.2
2 in 1 Convertible,15.6,1920x1080,Intel i7,8,Windows 10,1.56,Yes,0,256,0,0,55890.72
Notebook,15.6,1366x768,Intel i3,4,Windows 10,2.1,No,500,0,0,0,23816.16
Notebook,15.6,1366x768,AMD A9,4,Windows 10,2.03,No,1000,0,0,0,21471.84
Notebook,17.3,1920x1080,Intel i5,4,Windows 10,3.0,No,0,256,0,0,42890.4
Notebook,15.6,1920x1080,Intel i5,8,Windows 10,2.13,No,0,256,0,0,38787.84
Gaming,15.6,1920x1080,Intel i7,16,Windows 10,2.5,No,0,256,0,0,57489.12
Notebook,15.6,1366x768,Intel Celeron,4,Windows 10,2.1,No,1000,0,0,0,18541.44
Gaming,15.6,1920x1080,Intel i7,16,Windows 10,2.4,No,1000,256,0,0,95850.72
Notebook,15.6,1366x768,Intel Pentium,4,Windows 10,2.1,No,1000,0,0,0,19367.8128
Gaming,15.6,1920x1080,Intel i7,8,Windows 10,2.56,No,1000,128,0,0,56502.9072
Notebook,17.3,1920x1080,Intel i5,8,Windows 10,3.0,No,0,256,0,0,45501.12
Notebook,13.3,1920x1080,Intel i5,4,Windows 10,1.49,No,500,0,0,0,40173.12
Ultrabook,13.0,2160x1440,Intel i5,8,Windows 10,1.05,No,0,256,0,0,71874.72
Notebook,17.3,1920x1080,Intel i5,6,Windows 10,2.71,No,2000,0,0,0,37242.72
Notebook,15.6,1366x768,AMD A6,4,No OS,2.2,No,500,0,0,0,16463.52
Notebook,15.6,1366x768,Intel i3,4,Windows 10,2.0,No,500,0,0,0,26053.92
Notebook,17.3,1920x1080,Intel i5,8,Windows 10,2.5,No,0,256,0,0,49177.44
Notebook,15.6,1366x768,Intel i3,8,Windows 10,2.3,No,1000,0,0,0,24455.52
Notebook,15.6,1366x768,Intel i3,4,Windows 10,2.1,No,0,128,0,0,23922.72
Gaming,18.4,1920x1080,Intel i7,32,Windows 10,4.4,No,1000,512,0,0,149130.72
Notebook,15.6,1920x1080,Intel i5,8,Windows 10,1.9,No,1000,128,0,0,43316.64
2 in 1 Convertible,13.3,3840x2160,Intel i5,8,Windows 10,1.29,Yes,0,256,0,0,79866.72
Notebook,15.6,1920x1080,Intel i7,16,Linux,2.02,No,2000,256,0,0,55890.72
Ultrabook,13.3,1920x1080,Intel i5,8,Windows 10,1.23,No,0,256,0,0,74538.72
2 in 1 Convertible,13.9,3840x2160,Intel i7,16,Windows 10,1.4,Yes,0,512,0,0,98514.72
Notebook,15.6,1366x768,Intel i5,8,Windows 10,2.0,No,0,128,0,0,42251.04
Notebook,15.6,1920x1080,Intel i5,8,No OS,1.95,No,0,256,0,0,63882.72
Notebook,17.3,1920x1080,Intel i7,16,Windows 10,2.77,Yes,0,512,0,0,82530.72
Notebook,15.6,3840x2160,Intel i7,16,Windows 10,2.06,Yes,0,512,0,0,127712.16
Gaming,15.6,1920x1080,Intel i5,8,No OS,2.4,No,0,256,0,0,41505.12
Ultrabook,13.3,1920x1080,Intel i5,8,Windows 10,1.12,No,0,256,0,0,52693.92
Notebook,17.3,1920x1080,Intel i7,8,Windows 10,2.8,No,1000,128,0,0,57808.8
2 in 1 Convertible,14.0,2560x1440,Intel i7,16,Windows 10,1.42,Yes,0,1000,0,0,150462.72
Notebook,14.0,1920x1080,Intel Celeron,4,Windows 10,1.3,No,0,0,0,32,13852.8
Ultrabook,13.3,1920x1080,Intel i5,8,No OS,1.3,No,0,256,0,0,53274.67199999999
Notebook,17.3,1600x900,Intel i5,8,No OS,2.8,No,0,256,0,0,37189.44
2 in 1 Convertible,13.3,1920x1080,Intel i7,8,Windows 10,1.62,Yes,1000,0,0,0,44701.92
Notebook,17.3,1920x1080,Intel i5,8,Windows 10,2.5,No,1000,0,0,0,48697.92
Gaming,17.3,3840x2160,Intel i7,32,Windows 10,3.49,Yes,0,1000,0,0,324954.72
Notebook,13.3,1920x1080,Intel i5,8,Windows 10,1.49,No,0,512,0,0,51095.52
Gaming,17.3,1920x1080,Intel i7,16,Windows 10,3.35,No,1000,256,0,0,73473.12
Notebook,17.3,1920x1080,Intel i7,8,Windows 10,2.5,No,0,256,0,0,55677.6
Gaming,15.6,3840x2160,Intel i7,16,Windows 10,2.65,No,1000,512,0,0,98301.6
Notebook,15.6,1366x768,Intel i5,4,Windows 10,2.1,No,0,128,0,0,26267.04
Notebook,15.6,1920x1080,Intel i7,8,Windows 10,2.23,No,1000,0,0,0,39533.76
Gaming,15.6,1920x1080,Intel i7,16,Windows 10,3.2,No,1000,512,0,0,93186.72
Workstation,15.6,3840x2160,Intel Xeon,16,Windows 10,2.8,No,1000,256,0,0,162770.4
Gaming,15.6,1920x1080,Intel i7,16,No OS,2.4,No,0,512,0,0,74485.44
Notebook,15.6,1366x768,Intel i3,6,Windows 10,2.3,Yes,1000,0,0,0,23389.92
Ultrabook,13.3,3840x2160,Intel i7,8,Windows 10,1.21,Yes,0,256,0,0,103842.72
Ultrabook,13.3,1920x1080,Intel i7,8,Windows 10,1.2,No,0,256,0,0,77202.72
Notebook,15.6,1366x768,Intel i5,8,Windows 10,2.2,No,0,256,0,0,31808.16
Notebook,15.6,1920x1080,Intel i7,8,Linux,2.4,No,1000,0,0,0,41505.12
Gaming,17.3,1920x1080,Intel i7,16,Windows 10,2.9,No,1000,256,0,0,74964.95999999999
Notebook,15.6,1920x1080,Intel i3,4,No OS,2.1,No,500,0,0,0,18594.72
Notebook,15.6,1920x1080,Intel i5,8,No OS,2.2,No,0,256,0,0,29250.72
Ultrabook,13.0,2160x1440,Intel i7,8,Windows 10,1.05,No,0,512,0,0,79866.72
Ultrabook,13.3,1920x1080,Intel i7,8,Windows 10,1.4,No,0,256,0,0,49650.5664
Notebook,17.3,1600x900,Intel i5,8,No OS,2.8,No,1000,0,0,0,31381.92
Notebook,14.0,1920x1080,Intel i7,8,Windows 10,1.63,No,0,256,0,0,54931.68
Ultrabook,14.0,1920x1080,Intel i5,8,Windows 10,1.6,No,0,256,0,0,61218.72
2 in 1 Convertible,13.3,1920x1080,Intel i7,16,Windows 10,1.62,Yes,0,512,0,0,68145.12
Notebook,15.6,1920x1080,Intel i5,8,Linux,2.2,No,0,256,0,0,36089.208
2 in 1 Convertible,14.0,1920x1080,Intel i5,8,Windows 10,1.74,No,0,256,0,0,47898.72
Ultrabook,13.3,1920x1080,Intel i7,8,Windows 10,1.2,No,0,256,0,0,72620.64
Notebook,15.6,1920x1080,Intel i5,8,Windows 10,2.1,No,1000,0,0,0,42304.32
Gaming,17.3,1920x1080,Intel i7,16,Windows 10,4.42,No,1000,256,0,0,130873.7952
Notebook,15.6,1920x1080,Intel i7,8,Windows 10,2.2,No,0,256,0,0,44328.96
Notebook,15.6,1920x1080,Intel i7,16,Windows 10,2.3,Yes,1000,0,0,0,45768.0528
Notebook,15.6,1920x1080,Intel i5,8,Windows 10,2.0,No,0,256,0,0,40972.32
Notebook,17.3,1920x1080,Intel i5,8,Windows 10,2.69,No,500,256,0,0,47472.48
Notebook,15.6,1920x1080,Intel i7,8,Windows 10,1.9,No,1000,0,0,0,67612.31999999999
Notebook,15.6,1366x768,Intel i3,4,Windows 10,2.37,No,1000,0,0,0,21258.1872
Notebook,15.6,1366x768,AMD E,4,Windows 10,2.1,No,500,0,0,0,17582.399999999998
Gaming,15.6,1920x1080,Intel i7,16,Windows 10,3.2,No,1000,256,0,0,79866.72
Notebook,14.0,1920x1080,Intel i5,8,Windows 10,1.6,No,0,256,0,0,45767.52
2 in 1 Convertible,13.3,1920x1080,Intel i5,8,Windows 10,1.6,Yes,0,256,0,0,36709.92
Notebook,15.6,1920x1080,Intel i7,16,Linux,2.36,No,0,256,0,0,47898.72
Notebook,15.6,1366x768,Intel i3,4,Linux,2.1,No,1000,0,0,0,20779.2
Notebook,15.6,1920x1080,AMD A10,4,Windows 10,2.2,No,1000,128,0,0,30636.0
Gaming,17.3,1920x1080,Intel i7,32,Windows 10,4.7,No,1000,512,0,0,207259.2
Gaming,15.6,1920x1080,Intel i5,8,Windows 10,2.5,No,0,256,0,0,45074.88
Notebook,15.6,1366x768,Intel i3,8,Windows 10,2.2,No,0,128,0,0,31381.92
Notebook,17.3,1920x1080,Intel i7,8,Windows 10,2.1,No,1000,128,0,0,61005.6
Notebook,17.3,1920x1080,Intel i7,8,No OS,2.69,No,1000,128,0,0,47365.92
Gaming,15.6,1920x1080,Intel i5,8,Windows 10,2.56,No,0,256,0,0,46833.12
2 in 1 Convertible,13.9,1920x1080,Intel i7,8,Windows 10,1.38,Yes,0,256,0,0,57489.12
Notebook,15.6,1920x1080,Intel i7,8,Windows 10,2.2,No,2000,128,0,0,52480.8
Notebook,15.6,1366x768,Intel i5,8,Windows 10,2.04,Yes,1000,0,0,0,29783.52
Gaming,17.3,1920x1080,Intel i7,16,Windows 10,3.6,No,0,256,0,0,159786.72
Notebook,13.3,1920x1080,Intel i5,4,Windows 10,1.49,No,500,0,0,0,35964.0
Ultrabook,13.3,2560x1600,Intel i5,8,macOS,1.37,No,0,512,0,0,108691.2
2 in 1 Convertible,15.6,1920x1080,Intel i7,8,Windows 10,2.08,Yes,1000,0,0,0,43636.32
Gaming,17.3,1920x1080,Intel i7,16,Windows 10,4.3,No,1000,256,0,0,95850.72
Notebook,15.6,1366x768,AMD A9,4,Windows 10,1.68,No,1000,0,0,0,24988.32
2 in 1 Convertible,13.9,1920x1080,Intel i7,8,Windows 10,1.37,Yes,0,512,0,0,98514.72
Notebook,17.3,1920x1080,Intel i3,4,Windows 10,3.0,No,0,256,0,0,37402.56
Ultrabook,13.3,1920x1080,Intel i5,8,Windows 10,1.41,No,0,256,0,0,50562.72
Notebook,15.6,1366x768,AMD A6,8,Windows 10,1.91,No,0,128,0,0,23757.552
Notebook,17.3,1920x1080,Intel i7,16,Windows 10,2.9,No,1000,0,0,0,56423.52
Gaming,17.3,1920x1080,Intel i7,16,Windows 10,4.14,No,1000,512,0,0,133146.72
2 in 1 Convertible,15.6,1920x1080,Intel i7,8,Windows 10,2.0,Yes,0,512,0,0,90522.72
Notebook,17.3,1920x1080,Intel i7,8,Windows 10,2.8,No,1000,128,0,0,60845.76
Notebook,15.6,1920x1080,Intel i3,4,No OS,2.2,No,0,256,0,0,23656.32
Notebook,15.6,1920x1080,Intel i5,4,Windows 10,2.1,No,500,0,0,0,38468.16
Notebook,15.6,1920x1080,Intel i5,4,Windows 10,2.18,No,1000,0,0,0,35004.96
Notebook,15.6,1920x1080,Intel i5,8,Windows 10,2.24,No,1000,0,0,0,30103.2
2 in 1 Convertible,15.6,1920x1080,Intel i5,8,Windows 10,2.67,Yes,0,256,0,0,42570.72
2 in 1 Convertible,13.3,1920x1080,Intel i7,8,Windows 10,1.1,Yes,0,1000,0,0,79866.72
Notebook,15.6,1920x1080,Intel i5,4,No OS,2.2,No,1000,0,0,0,24881.76
Notebook,17.3,1920x1080,Intel i7,8,Windows 10,2.5,No,1000,0,0,0,54239.04
Notebook,15.6,1920x1080,Intel i7,8,Windows 10,2.05,No,0,256,0,0,46886.4
Ultrabook,13.3,2560x1600,Intel i5,8,macOS,1.37,No,0,512,0,0,104370.192
Gaming,17.3,1920x1080,AMD Ryzen,16,Windows 10,3.2,No,1000,256,0,0,82530.72
Notebook,15.6,1920x1080,Intel i7,8,Linux,2.14,No,0,256,0,0,39164.5296
2 in 1 Convertible,14.0,2560x1440,Intel i7,16,Windows 10,1.36,Yes,0,512,0,0,133146.72
Notebook,15.6,1366x768,Intel i7,8,Windows 10,2.2,No,500,0,0,0,43263.36
Notebook,15.6,1366x768,Intel i7,12,Windows 10,2.3,No,1000,0,0,0,37992.3696
Notebook,17.3,1920x1080,Intel i7,8,Linux,2.8,No,1000,128,0,0,58554.72
Notebook,15.6,1920x1080,Intel i7,8,Windows 10,2.2,No,1000,0,0,0,39693.6
Notebook,17.3,1600x900,Intel i3,4,Windows 10,2.8,No,1000,0,0,0,26053.92
Notebook,17.3,1920x1080,Intel i7,8,No OS,2.8,No,2000,0,0,0,45234.72
Notebook,17.3,1600x900,Intel i7,6,Windows 10,2.8,No,1000,128,0,0,45767.52
Notebook,15.6,1920x1080,Intel i3,4,Linux,2.25,No,1000,0,0,0,22803.84
Gaming,15.6,1920x1080,Intel i5,8,Windows 10,2.5,No,0,256,0,0,44169.12
Notebook,15.6,1920x1080,Intel i5,6,Windows 10,2.2,No,0,256,0,0,30849.12
Notebook,15.6,1920x1080,Intel i7,8,Windows 10,3.0,No,0,256,0,0,50669.28
Notebook,15.6,1920x1080,Intel i7,12,Windows 10,2.15,Yes,1000,0,0,0,35111.52
Notebook,15.6,1920x1080,Intel i7,8,Windows 10,1.95,No,0,256,0,0,58448.16
Ultrabook,15.6,1920x1080,Intel i5,8,Windows 10,1.7,No,0,256,0,0,52054.56
Gaming,15.6,1920x1080,Intel i7,16,Windows 10,2.5,No,1000,256,0,0,62817.12
Notebook,15.6,1920x1080,Intel i7,8,No OS,2.2,No,1000,0,0,0,35112.0528
Notebook,15.6,1366x768,Intel Celeron,2,Chrome OS,2.19,No,0,16,0,0,10602.72
Gaming,17.3,1920x1080,Intel i7,8,Windows 10,3.0,No,1000,0,0,0,63243.36
Notebook,17.3,1600x900,Intel i3,8,Windows 10,2.54,No,1000,0,0,0,26053.92
Notebook,15.6,1920x1080,Intel i7,8,Windows 10,2.0,No,0,256,0,0,97449.12
Notebook,15.6,1920x1080,Intel i5,8,Windows 10,2.05,No,0,256,0,0,39373.92
Gaming,15.6,1920x1080,Intel i7,8,Windows 10,3.2,No,1000,0,0,0,69210.72
Notebook,15.6,1920x1080,Intel i7,8,Linux,2.5,No,0,256,0,0,52161.12
Workstation,17.3,1920x1080,Intel i7,16,Windows 10,3.42,No,0,256,0,0,153705.3408
Notebook,15.6,1920x1080,AMD A10,6,Windows 10,2.4,No,1000,0,0,0,26586.72
Ultrabook,15.6,1920x1080,Intel i7,16,Windows 10,1.63,No,0,512,0,0,78215.04
Notebook,14.0,1366x768,Intel i3,4,Windows 10,1.3,No,0,128,0,0,27119.52
Gaming,17.3,1920x1080,Intel i7,16,Windows 10,2.9,No,1000,256,0,0,113060.16
Notebook,17.3,1600x900,Intel i5,6,Windows 10,2.8,No,1000,0,0,0,34578.72
Notebook,15.6,1366x768,Intel i5,8,No OS,2.2,No,2000,0,0,0,29250.72
Gaming,15.6,1920x1080,Intel i7,8,Windows 10,2.5,No,1000,128,0,0,67399.2
Notebook,15.6,1366x768,Intel Pentium,4,No OS,2.2,No,1000,0,0,0,19180.2672
2 in 1 Convertible,13.3,1920x1080,Intel i7,16,Windows 10,1.28,Yes,0,256,0,0,105228.0
Notebook,15.6,1920x1080,Intel i7,8,Windows 10,2.2,No,0,256,0,0,55571.04
Notebook,15.6,1920x1080,Intel i5,8,Windows 10,2.3,No,1000,128,0,0,43636.32
Notebook,15.6,1920x1080,Intel i3,4,Windows 10,1.86,No,1000,0,0,0,24988.32
Notebook,13.3,1920x1080,Intel i5,8,Windows 10,1.1,No,0,256,0,0,53226.72
Ultrabook,13.3,3840x2160,Intel i7,16,Windows 10,1.21,Yes,0,1000,0,0,133146.72
Gaming,15.6,1920x1080,Intel i7,16,Windows 10,2.8,No,1000,256,0,0,111834.72
Notebook,15.6,1920x1080,AMD A8,8,Windows 10,2.23,No,0,256,0,0,24988.32
2 in 1 Convertible,11.6,1366x768,Intel Celeron,2,Windows 10,1.1,Yes,0,0,0,32,14652.0
Notebook,15.6,1920x1080,Intel i5,8,Windows 10,2.33,No,1000,128,0,0,44968.32
2 in 1 Convertible,13.3,3840x2160,Intel i7,16,Windows 10,1.29,Yes,0,1000,0,0,130482.72
Notebook,13.3,1366x768,Intel Celeron,4,Chrome OS,1.45,No,0,0,0,16,24503.472
Notebook,14.0,1920x1080,Intel i5,8,Windows 10,1.95,No,0,256,0,0,52214.4
Notebook,11.6,1366x768,Intel Pentium,4,Windows 10,1.4,No,0,0,0,128,25840.8
Notebook,14.0,1920x1080,Intel i7,8,Windows 10,1.48,No,0,256,0,0,68837.76
Notebook,17.3,1600x900,Intel i5,4,Windows 10,2.79,No,1000,0,0,0,31381.92
Notebook,14.0,1920x1080,Intel i7,8,Windows 10,2.0,No,0,256,0,0,58288.32
Notebook,15.6,1366x768,Intel i7,8,Windows 10,2.1,No,1000,0,0,0,48058.56
Notebook,15.6,1366x768,AMD A12,8,Windows 10,2.2,No,0,256,0,0,35111.52
Notebook,14.0,1366x768,Intel Celeron,4,Windows 10,1.44,No,0,0,0,32,15557.76
Notebook,15.6,1366x768,Intel i5,6,Windows 10,2.23,No,1000,0,0,0,29250.72
Ultrabook,15.6,1920x1080,Intel i7,8,Windows 10,1.7,No,0,256,0,0,55938.672
Ultrabook,12.5,1920x1080,Intel i7,8,Windows 10,1.26,No,0,256,0,0,71128.8
Notebook,15.6,3840x2160,Intel i7,32,Windows 10,2.06,Yes,0,1000,0,0,140605.91999999998
Gaming,17.3,1920x1080,Intel i7,8,Windows 10,2.7,No,1000,256,0,0,63882.72
Notebook,15.6,1920x1080,Intel i5,8,Windows 10,2.0,No,0,256,0,0,50243.04
Notebook,14.0,1920x1080,Intel i7,8,Windows 10,2.0,No,1000,256,0,0,71075.52
Notebook,15.6,1920x1080,Intel i3,4,Windows 10,1.85,No,1000,0,0,0,23922.72
Gaming,15.6,1920x1080,Intel i7,8,Windows 10,2.5,No,0,256,0,0,53226.72
Notebook,14.0,1920x1080,Intel i5,8,Windows 10,1.48,No,0,256,0,0,67559.04
Ultrabook,15.6,1920x1080,Intel i5,8,Windows 10,1.9,No,1000,128,0,0,55890.72
Notebook,15.6,1920x1080,Intel i5,8,Windows 10,1.84,No,0,256,0,0,60952.32
Notebook,15.6,1366x768,Intel Celeron,4,Linux,2.0,No,1000,0,0,0,14651.4672
Notebook,15.6,1920x1080,Intel i5,8,Windows 10,2.0,No,0,256,0,0,60885.72
Notebook,15.6,1366x768,Intel Celeron,4,Linux,2.2,No,500,0,0,0,14646.672
Notebook,15.6,1920x1080,AMD A12,12,Windows 10,2.2,No,2000,0,0,0,47898.72
Notebook,15.6,1920x1080,Intel i3,8,Windows 10,2.1,No,1000,0,0,0,38148.48
2 in 1 Convertible,13.9,3840x2160,Intel i7,16,Windows 10,1.4,Yes,0,512,0,0,111834.72
Ultrabook,13.3,1920x1080,Intel i7,8,Windows 10,1.2,No,0,256,0,0,84129.12
Gaming,15.6,1920x1080,Intel i7,16,Windows 10,2.4,No,2000,256,0,0,60153.12
Notebook,14.0,1366x768,Intel Celeron,2,Windows 10,1.44,No,0,0,0,32,14865.12
Ultrabook,15.6,1920x1080,Intel i7,16,Windows 10,1.88,No,0,768,0,0,85672.1088
2 in 1 Convertible,11.6,1366x768,Intel Celeron,4,Windows 10,1.5,Yes,0,0,0,32,19980.0
Ultrabook,15.6,1920x1080,Intel i5,8,Windows 10,1.9,No,1000,0,0,0,35324.64
Notebook,15.6,3840x2160,Intel i7,16,Windows 10,2.06,Yes,0,512,0,0,108020.9376
Notebook,15.6,1920x1080,Intel i7,8,Windows 10,1.84,No,0,256,0,0,69477.12
Gaming,17.3,1920x1080,Intel i7,8,Windows 10,2.7,No,1000,128,0,0,75071.52
Workstation,15.6,1920x1080,Intel i7,8,Windows 10,2.6,No,0,256,0,0,92615.0256
Notebook,15.6,1920x1080,Intel i7,16,Windows 10,2.4,No,0,512,0,0,74751.84
Notebook,15.6,1920x1080,Intel i7,8,Windows 10,2.02,No,2000,128,0,0,51729.55199999999
Notebook,15.6,1366x768,Intel Celeron,4,No OS,2.2,No,1000,0,0,0,17155.627200000003
Gaming,15.6,1920x1080,Intel i5,8,Windows 10,2.65,No,1000,0,0,0,53226.72
Notebook,15.6,1366x768,Intel i5,8,Windows 10,2.36,Yes,2000,0,0,0,29696.6736
Notebook,14.0,1920x1080,Intel i5,8,Windows 10,1.36,No,0,256,0,0,76030.56
Notebook,15.6,1366x768,Intel i3,4,Windows 10,1.86,No,500,0,0,0,23389.92
Notebook,14.0,1920x1080,Intel i5,8,Windows 10,2.0,No,0,256,0,0,50349.6
Notebook,17.3,1600x900,Intel i5,6,Windows 10,2.8,No,1000,128,0,0,38308.32
Notebook,15.6,1920x1080,Intel i5,8,Windows 10,1.86,No,1000,0,0,0,34045.92
Notebook,15.6,1366x768,Intel i3,8,No OS,2.2,No,0,256,0,0,26586.72
Notebook,15.6,1366x768,Intel Pentium,8,Windows 10,2.04,No,2000,0,0,0,20725.92
Notebook,17.3,1920x1080,Intel i5,8,Windows 10,2.8,No,1000,128,0,0,57808.8
Gaming,15.6,1920x1080,Intel i5,8,No OS,2.4,No,1000,128,0,0,43103.52
Notebook,15.6,1920x1080,Intel i7,8,Windows 10,2.33,No,0,256,0,0,47898.72
Ultrabook,14.0,1920x1080,Intel i7,8,Windows 10,1.36,No,0,256,0,0,93240.0
2 in 1 Convertible,15.6,1920x1080,Intel i7,12,Windows 10,2.26,Yes,2000,512,0,0,58554.72
Notebook,15.6,1366x768,AMD A9,4,Windows 10,2.1,No,0,128,0,0,22697.28
Gaming,17.3,1920x1080,AMD Ryzen,16,Windows 10,3.25,No,1000,256,0,0,117162.72
Notebook,17.3,1600x900,AMD A8,4,Windows 10,2.6,No,0,128,0,0,26053.92
2 in 1 Convertible,13.3,1920x1080,Intel i7,8,Windows 10,1.62,Yes,0,256,0,0,46300.85279999999
Notebook,15.6,1920x1080,AMD A9,4,Windows 10,1.91,No,0,256,0,0,26053.3872
Netbook,11.6,1366x768,Intel Celeron,4,Windows 10,1.59,No,0,128,0,0,29463.84
Notebook,15.6,1366x768,Intel Celeron,4,Windows 10,1.8,No,500,0,0,0,16463.52
Notebook,14.0,1366x768,Intel Celeron,4,Windows 10,1.5,No,0,0,0,32,15238.08
Notebook,15.6,1920x1080,Intel i7,8,Linux,2.4,No,1000,0,0,0,45074.88
Gaming,17.3,1920x1080,Intel i7,8,Windows 10,3.35,No,1000,128,0,0,63456.48
Notebook,15.6,1920x1080,Intel i3,4,No OS,1.85,No,0,128,0,0,21498.48
Gaming,15.6,1920x1080,Intel i7,8,Windows 10,2.3,No,1000,128,0,0,88178.4
Notebook,14.0,1920x1080,Intel i5,8,Windows 10,1.5,No,0,256,0,0,58554.72
Ultrabook,13.3,1920x1080,Intel i7,16,Windows 10,1.1,Yes,0,512,0,0,93181.392
Ultrabook,14.0,2560x1440,Intel i7,8,Windows 10,1.13,No,0,512,0,0,121584.96
Notebook,13.3,1920x1080,Intel i3,4,Windows 10,1.5,No,0,128,0,0,29250.72
Workstation,15.6,1920x1080,Intel i5,8,Windows 10,2.23,No,500,0,0,0,72940.31999999999
Workstation,15.6,1920x1080,Intel i7,8,Windows 10,2.0,No,0,256,0,0,113752.8
2 in 1 Convertible,14.0,2560x1440,Intel i7,16,Windows 10,1.42,Yes,0,512,0,0,133679.52
Gaming,17.3,1920x1080,Intel i7,8,Windows 10,3.0,No,1000,0,0,0,55357.92
Gaming,17.3,1920x1080,Intel i7,16,Windows 10,3.0,No,1000,256,0,0,84768.48
Notebook,15.6,1366x768,Intel i5,12,Windows 10,2.2,No,1000,0,0,0,36975.7872
Gaming,17.3,1920x1080,Intel i7,8,Windows 10,2.7,No,0,256,0,0,71874.72
Notebook,15.6,1920x1080,Intel i7,8,Linux,2.33,No,0,256,0,0,41498.1936
Ultrabook,15.6,1920x1080,AMD A9,4,Windows 10,1.91,No,0,256,0,0,26586.72
Notebook,15.6,1920x1080,Intel i7,8,Windows 10,2.1,No,0,256,0,0,65510.9568
Notebook,14.0,1920x1080,Intel i5,8,Windows 10,1.9,No,0,256,0,0,49976.64
Workstation,15.6,3840x2160,Intel i7,8,Windows 10,1.78,Yes,0,256,0,0,144495.36
Ultrabook,14.0,2560x1440,Intel i7,16,Windows 10,1.13,No,0,1000,0,0,139860.0
Notebook,15.6,1366x768,Intel Celeron,4,Windows 10,2.2,No,1000,0,0,0,16303.68
Gaming,17.3,1920x1080,Intel i7,16,Windows 10,2.9,No,1000,256,0,0,81465.12
Notebook,15.6,1920x1080,Intel i5,8,Windows 10,2.1,No,1000,256,0,0,60978.96
Notebook,15.6,1920x1080,Intel i7,8,Linux,2.5,No,0,256,0,0,46833.12
Gaming,17.3,1920x1080,Intel i7,16,Windows 10,2.8,No,1000,256,0,0,119826.72
Ultrabook,14.0,1920x1080,Intel i7,8,Windows 10,1.1,No,0,512,0,0,99793.44
Ultrabook,13.3,1920x1080,Intel i7,16,Windows 10,1.2,No,0,512,0,0,93080.16
Ultrabook,14.0,1920x1080,Intel i7,8,Windows 10,1.36,No,0,512,0,0,89510.4
Notebook,15.6,1920x1080,Intel i3,4,Windows 10,2.2,No,500,0,0,0,21791.52
Notebook,11.6,1366x768,Intel Celeron,2,Windows 10,1.15,No,0,0,0,32,16221.096
Workstation,15.6,1920x1080,Intel i7,8,Windows 10,2.67,No,0,512,0,0,102564.0
Ultrabook,14.0,2560x1440,Intel i7,8,Windows 10,1.7,No,0,512,0,0,103523.04
Notebook,15.6,1920x1080,Intel i3,4,Windows 10,2.1,No,1000,0,0,0,24988.32
2 in 1 Convertible,13.3,1920x1080,Intel i7,8,Windows 10,1.6,Yes,0,256,0,0,42038.4528
2 in 1 Convertible,13.3,1920x1080,Intel i5,8,Windows 10,1.27,Yes,0,256,0,0,49443.84
Notebook,15.6,1920x1080,Intel i5,4,Linux,2.3,No,0,256,0,0,31909.392
Notebook,13.3,1366x768,Intel i3,4,Windows 10,1.65,No,0,128,0,0,36709.92
Ultrabook,14.0,1920x1080,Intel i7,8,Windows 10,1.43,No,0,256,0,0,79920.0
Notebook,15.6,1366x768,Intel i5,8,Windows 10,2.14,No,1000,0,0,0,28768.536
Ultrabook,14.0,1920x1080,Intel i7,8,Windows 10,1.75,No,0,256,0,0,64755.44640000001
2 in 1 Convertible,15.6,3840x2160,Intel i7,16,Windows 10,2.0,Yes,0,512,0,0,101178.72
Notebook,15.6,1920x1080,Intel i7,8,Windows 10,2.31,No,0,256,0,0,76030.56
Notebook,15.6,1920x1080,Intel i3,8,Linux,2.3,No,1000,0,0,0,31808.16
Gaming,17.3,2560x1440,Intel i7,16,Windows 10,4.42,No,1000,256,0,0,149130.72
Gaming,15.6,1920x1080,Intel i7,8,Windows 10,2.62,No,1000,128,0,0,61751.52
Notebook,15.6,1920x1080,Intel i7,8,Windows 10,2.02,No,2000,256,0,0,60867.072
Ultrabook,14.0,1920x1080,Intel i7,8,Linux,1.6,No,0,256,0,0,58554.72
Gaming,17.3,1920x1080,Intel i7,12,Windows 10,3.35,No,1000,256,0,0,106506.72
2 in 1 Convertible,11.6,1920x1080,Intel Celeron,4,Windows 10,1.16,Yes,0,32,0,0,15930.72
Netbook,11.6,1366x768,Intel Celeron,4,Chrome OS,1.15,No,0,0,0,16,14332.32
Notebook,13.3,1920x1080,Intel i7,8,Windows 10,1.4,No,0,256,0,0,53812.8
Notebook,14.0,1920x1080,Intel i3,4,Windows 10,1.7,No,0,128,0,0,31914.72
Workstation,15.6,3840x2160,Intel i7,16,Windows 10,2.3,No,0,512,0,0,130269.6
Notebook,15.6,1920x1080,Intel i7,16,Windows 10,2.5,No,0,512,0,0,130482.72
Gaming,17.3,1920x1080,AMD Ryzen,8,Windows 10,3.2,No,1000,256,0,0,90309.6
Notebook,15.6,1366x768,Intel Celeron,4,Windows 10,2.1,No,500,0,0,0,18488.16
Ultrabook,12.3,2400x1600,Intel i7,16,Chrome OS,1.1,Yes,0,512,0,0,117162.72
Ultrabook,14.0,2560x1440,Intel i7,24,Windows 10,1.32,No,0,512,0,0,126912.96
Notebook,15.6,1920x1080,Intel i5,4,Linux,2.0,No,0,256,0,0,29783.52
Notebook,17.3,1600x900,AMD A6,8,Windows 10,2.8,No,1000,0,0,0,27652.32
Notebook,15.6,1920x1080,Intel i5,4,Windows 10,2.2,No,0,256,0,0,39906.72
Ultrabook,12.5,1920x1080,Intel i5,8,Windows 10,1.36,No,0,256,0,0,76137.12
Notebook,15.6,1920x1080,Intel Pentium,4,Windows 10,2.2,No,0,128,0,0,18594.72
Gaming,15.6,1920x1080,Intel i7,8,Windows 10,2.2,No,1000,128,0,0,58554.72
Notebook,14.0,1920x1080,Intel i5,8,Windows 10,1.64,No,0,256,0,0,62817.12
Notebook,15.6,1366x768,Intel i5,4,Linux,2.4,No,500,0,0,0,23539.104
Workstation,15.6,1920x1080,Intel Xeon,8,Windows 10,2.23,No,1000,0,0,64,106187.04
Gaming,15.6,1920x1080,Intel i5,8,Windows 10,2.2,No,0,256,0,0,54757.9872
Ultrabook,13.5,2256x1504,Intel i7,16,Windows 10 S,1.25,Yes,0,512,0,0,137941.91999999998
Notebook,15.6,1366x768,Intel i5,8,Windows 10,1.91,No,0,128,0,0,31381.92
Workstation,15.6,1920x1080,Intel i7,16,Windows 10,2.17,No,0,256,0,0,105228.0
Workstation,15.6,1920x1080,Intel i7,8,Windows 10,2.31,No,0,512,0,0,81731.52
Notebook,14.0,1920x1080,Intel i5,8,Windows 10,1.65,No,0,256,0,0,71661.59999999999
Notebook,15.6,1920x1080,Intel i7,8,Windows 10,2.36,No,1000,128,0,0,52161.12
2 in 1 Convertible,11.6,1366x768,Intel Pentium,4,Windows 10,1.47,Yes,500,0,0,0,25521.12
Notebook,17.3,1920x1080,Intel i7,8,Windows 10,4.42,No,1000,0,0,0,109010.88
Ultrabook,13.5,2256x1504,Intel M ,4,Windows 10 S,1.25,Yes,0,128,0,0,52693.92
Ultrabook,13.5,2256x1504,Intel i7,8,Windows 10 S,1.25,Yes,0,256,0,0,95850.72
Notebook,17.3,1600x900,Intel i3,8,Windows 10,2.5,No,0,256,0,0,34093.872
Notebook,15.6,1920x1080,Intel i3,4,Windows 10,2.23,No,1000,0,0,0,28984.32
Netbook,11.6,1366x768,Intel Celeron,4,Windows 10,1.4,No,0,128,0,0,23176.8
Notebook,15.6,1920x1080,Intel i5,8,Windows 10,2.37,No,1000,0,0,0,39906.72
Notebook,14.0,1920x1080,Intel i7,8,No OS,1.5,No,0,512,0,0,42570.72
Notebook,15.6,1920x1080,Intel i7,8,Windows 10,2.67,No,0,256,0,0,111355.2
Notebook,15.6,1366x768,Intel Pentium,4,Windows 10,2.0,No,500,0,0,0,16197.12
Notebook,15.6,1366x768,Intel i3,4,Windows 10,2.2,No,500,0,0,0,24988.32
Notebook,15.6,1920x1080,Intel i5,8,Windows 10,2.02,No,2000,0,0,0,40439.52
Gaming,17.3,1920x1080,Intel i7,12,Windows 10,3.78,No,1000,0,0,0,90522.72
Ultrabook,14.0,2560x1440,Intel i7,12,Windows 10,1.4,No,0,256,0,0,98994.24
2 in 1 Convertible,13.3,3840x2160,Intel i7,8,Windows 10,1.29,Yes,0,512,0,0,106506.72
Notebook,15.6,1920x1080,Intel i5,8,Windows 10,1.9,No,500,0,0,0,61485.12
Ultrabook,12.3,2400x1600,Intel i5,8,Chrome OS,1.1,Yes,0,128,0,0,67932.0
Ultrabook,13.3,1920x1080,Intel i5,8,Windows 10,1.42,Yes,0,256,0,0,98133.768
Notebook,15.6,3840x2160,Intel i7,12,Windows 10,2.06,No,1000,128,0,0,69210.72
Notebook,14.0,1366x768,Intel i3,8,Windows 10,1.79,No,0,128,0,0,39427.2
Workstation,15.6,1920x1080,Intel i7,8,Windows 10,1.78,No,0,256,0,0,128298.24
Notebook,14.0,1920x1080,Intel i5,8,Windows 10,1.7,No,0,180,0,0,72673.92
Notebook,15.6,1920x1080,Intel i5,8,Windows 10,2.2,No,1000,0,0,0,35964.0
Notebook,13.3,1920x1080,Intel i5,8,Windows 10,1.05,No,0,256,0,0,89084.16
Notebook,15.6,1920x1080,Intel i7,8,Windows 10,2.16,No,0,512,0,0,67239.36
Notebook,15.6,1366x768,Intel i3,4,Windows 10,2.18,No,1000,0,0,0,31254.048
Notebook,13.3,1920x1080,Intel i5,4,Windows 10,1.49,No,0,128,0,0,38681.28
Notebook,15.6,1920x1080,Intel Atom,4,Windows 10,1.89,No,0,0,0,64,13261.392000000002
Notebook,15.6,1366x768,Intel i3,4,Windows 10,2.3,No,0,128,0,0,30103.2
Notebook,14.0,1920x1080,Intel i5,8,Windows 10,1.75,No,0,256,0,0,55890.72
Workstation,15.6,1920x1080,Intel i7,16,Windows 10,2.17,No,0,512,0,0,124568.64
Notebook,15.6,1920x1080,Intel i7,16,Windows 10,2.06,No,0,512,0,0,101178.72
Ultrabook,12.5,1920x1080,Intel i7,16,Windows 10,1.36,No,0,512,0,0,95797.44
Ultrabook,12.5,1920x1080,Intel i7,16,Windows 10,0.91,No,0,512,0,0,103896.0
Notebook,15.6,1920x1080,Intel i5,8,Windows 10,2.3,No,0,256,0,0,53918.82719999999
Ultrabook,13.3,1920x1080,Intel i7,32,Windows 10,1.05,Yes,0,512,0,0,149130.72
Gaming,15.6,1920x1080,Intel i7,8,Windows 10,1.99,No,1000,128,0,0,71928.0
Notebook,15.6,1366x768,AMD A10,8,Windows 10,2.2,No,1000,0,0,0,30849.12
Gaming,17.3,1920x1080,Intel i7,24,Windows 10,4.33,Yes,1000,256,0,0,67612.31999999999
Ultrabook,12.5,1366x768,Intel i5,8,Windows 10,1.3,No,0,180,0,0,58554.72
Notebook,15.6,1920x1080,Intel i7,8,Windows 10,2.17,No,0,256,0,0,47893.39199999999
Notebook,14.0,1920x1080,Intel i7,8,Windows 10,1.48,No,0,1000,0,0,93186.72
Notebook,13.3,1920x1080,Intel i3,8,Windows 10,1.4,No,0,256,0,0,50562.72
Notebook,15.6,1920x1080,Intel i5,8,Windows 10,2.3,No,0,256,0,0,48538.08
Netbook,11.6,1366x768,Intel Celeron,4,Windows 10 S,1.2,No,0,0,0,64,18115.2
Notebook,15.6,1366x768,Intel i5,8,Windows 10,1.91,No,0,256,0,0,32979.7872
2 in 1 Convertible,13.9,1920x1080,Intel i5,8,Windows 10,1.4,Yes,0,256,0,0,85194.72
Notebook,14.0,1366x768,Intel Celeron,4,Windows 10,2.1,No,500,0,0,0,15930.72
Netbook,11.6,1366x768,Intel Celeron,4,Chrome OS,1.25,No,0,16,0,0,14119.2
Notebook,13.3,1920x1080,Intel i5,8,Windows 10,1.44,No,0,256,0,0,50562.72
Notebook,15.6,1920x1080,Intel i7,8,Windows 10,2.0,No,1000,256,0,0,65214.72
Notebook,15.6,1920x1080,Intel i5,4,Windows 10,2.2,No,1000,0,0,0,32660.64
Ultrabook,13.3,1920x1080,Intel i7,8,Windows 10,1.34,No,0,512,0,0,70489.44
Gaming,15.6,1920x1080,Intel i7,8,No OS,2.4,No,1000,256,0,0,61218.72
Ultrabook,13.3,1920x1080,Intel i5,8,Windows 10,1.29,Yes,0,128,0,0,47898.72
Notebook,15.6,1920x1080,Intel i7,4,Windows 10,2.2,No,500,0,0,0,34045.92
Notebook,15.6,1920x1080,Intel i5,8,Windows 10,2.18,No,1000,0,0,0,44542.08
Notebook,15.6,1920x1080,Intel i7,16,Windows 10,2.2,No,2000,256,0,0,64961.10719999999
Notebook,15.6,1920x1080,Intel i7,16,No OS,1.95,No,0,256,0,0,74589.336
Netbook,11.6,1366x768,Intel Celeron,2,Windows 10,1.1,No,0,0,0,32,13053.6
Notebook,15.6,1366x768,Intel i5,4,Windows 10,2.04,Yes,1000,0,0,0,27783.9216
Gaming,15.6,1920x1080,Intel i7,24,Windows 10,2.24,No,0,512,0,0,158135.04
Notebook,15.6,1920x1080,Intel i5,8,Windows 10,2.04,No,0,256,0,0,47365.92
Gaming,17.3,1920x1080,Intel i7,16,Windows 10,3.0,No,1000,256,0,0,80133.12
Gaming,15.6,1920x1080,Intel i7,8,Windows 10,3.2,No,1000,256,0,0,74538.72
Ultrabook,13.3,1920x1080,Intel i7,8,Windows 10,1.32,No,0,256,0,0,74538.72
Notebook,14.0,1920x1080,Intel i5,8,Windows 10,1.64,No,0,256,0,0,68184.0144
Notebook,15.6,1366x768,Intel i3,4,Windows 10,1.63,No,0,128,0,0,36709.92
Notebook,17.3,1920x1080,Intel i5,8,Linux,2.8,No,1000,128,0,0,47365.92
Notebook,14.0,1920x1080,Intel i5,8,Windows 7,2.02,No,0,256,0,0,71395.2
Notebook,15.6,1920x1080,Intel i7,4,Windows 10,2.2,No,1000,0,0,0,42570.72
Notebook,15.6,1366x768,Intel i3,8,No OS,2.2,No,2000,0,0,0,24455.52
Notebook,15.6,1920x1080,Intel i5,4,Windows 10,2.3,No,500,0,0,0,31168.8
Notebook,15.6,1920x1080,Intel i5,8,Windows 10,1.9,No,0,256,0,0,73366.56
Gaming,17.3,1920x1080,Intel i7,16,Windows 10,4.42,No,1000,128,0,0,160520.3856
Notebook,15.6,1920x1080,Intel i5,8,Windows 10,2.0,No,500,0,0,0,45820.8
Notebook,15.6,3840x2160,Intel i7,8,Windows 10,2.0,No,1000,256,0,0,69210.72
Notebook,13.3,1920x1080,Intel Celeron,4,Windows 10,1.2,No,0,32,0,0,19660.32
Gaming,15.6,1920x1080,Intel i5,8,Windows 10,2.3,No,1000,128,0,0,87858.72
Notebook,15.6,1920x1080,Intel i7,8,Windows 10,1.93,No,0,256,0,0,72940.31999999999
Notebook,15.6,1920x1080,Intel i5,8,Windows 10,2.2,No,0,256,0,0,42486.0048
Notebook,15.6,1920x1080,Intel Pentium,4,Windows 10,1.86,No,0,256,0,0,21258.1872
Gaming,17.3,1920x1080,Intel i7,12,Windows 10,2.62,No,1000,0,0,0,95850.72
Notebook,14.0,1920x1080,Intel i7,8,Windows 10,1.87,No,0,256,0,0,45767.52
Ultrabook,13.3,3200x1800,Intel i7,8,Windows 10,1.2,Yes,0,256,0,0,74538.72
Notebook,14.0,1920x1080,Intel i3,4,Windows 10,1.6,No,0,128,0,0,39207.1536
Ultrabook,13.3,3200x1800,Intel i7,8,Windows 10,1.34,No,0,256,0,0,61005.6
Gaming,15.6,1920x1080,Intel i5,8,Linux,2.4,No,1000,0,0,0,42517.44
Notebook,15.6,1366x768,AMD E,4,Windows 10,2.0,No,500,0,0,0,18594.72
Notebook,15.6,1920x1080,Intel i3,4,Windows 10,2.1,No,0,128,0,0,37589.04
Notebook,14.0,1920x1080,Intel i5,4,Windows 10,1.87,No,500,0,0,0,41824.8
Notebook,15.6,1920x1080,Intel i5,4,No OS,2.15,No,1000,0,0,0,24634.008
Notebook,15.6,1920x1080,Intel i3,4,Windows 10,1.86,No,500,0,0,0,21152.16
Notebook,15.6,1920x1080,Intel i7,8,Windows 10,1.99,No,0,512,0,0,92121.12
Notebook,15.6,1920x1080,Intel i3,4,Windows 10,2.2,No,0,128,0,0,26586.72
Notebook,15.6,1920x1080,Intel i5,8,Windows 10,1.9,No,0,256,0,0,59513.2272
Gaming,17.3,1920x1080,Intel i7,16,Windows 10,4.42,No,1000,256,0,0,143802.72
Notebook,17.3,1600x900,Intel i3,8,Windows 10,2.65,No,1000,0,0,0,28992.312
Notebook,17.3,1920x1080,Intel i7,8,Windows 10,2.63,No,1000,0,0,0,68198.4
Notebook,15.6,1366x768,Intel Celeron,4,Linux,2.0,No,500,0,0,0,11934.72
Notebook,13.3,1920x1080,Intel Atom,4,Windows 10,1.35,No,0,0,0,32,13586.4
Notebook,17.3,1600x900,Intel i7,6,Windows 10,2.8,No,1000,128,0,0,50562.72
Notebook,15.6,1920x1080,AMD A10,6,Windows 10,1.91,No,0,128,0,0,30310.992
Notebook,15.6,1366x768,Intel i3,4,Windows 10,2.18,No,1000,0,0,0,32921.712
2 in 1 Convertible,11.6,1920x1080,Intel Celeron,4,Windows 10,1.25,Yes,0,0,0,32,18594.72
Notebook,15.6,1920x1080,Intel i3,4,Windows 10,2.05,No,0,128,0,0,33566.4
Ultrabook,13.3,3200x1800,Intel M ,16,Windows 10,1.16,Yes,0,512,0,0,104695.2
Notebook,17.3,1920x1080,Intel i7,8,Windows 10,3.4,No,0,256,0,0,159786.72
Notebook,15.6,1920x1080,Intel i5,8,Windows 10,2.5,No,1000,128,0,0,44701.92
Ultrabook,13.3,3840x2160,Intel i5,8,Windows 10,1.21,Yes,0,128,0,0,85194.72
Notebook,15.6,1366x768,Intel i5,4,Windows 10,1.93,No,500,0,0,0,51095.52
Notebook,15.6,1366x768,Intel i5,8,Windows 10,2.2,No,1000,0,0,0,39373.92
Notebook,15.6,1920x1080,Intel Pentium,4,Windows 10,2.2,No,500,0,0,0,18328.32
Notebook,14.0,1366x768,Intel i5,4,Windows 10,2.02,No,500,0,0,0,52747.2
Workstation,17.3,1600x900,Intel i5,8,Windows 10,3.14,No,500,0,0,0,99153.5472
Notebook,14.0,1366x768,Intel Pentium,8,Windows 10,1.94,No,2000,0,0,0,20725.92
Notebook,15.6,1920x1080,AMD A9,6,Windows 10,1.95,No,0,256,0,0,34578.72
Notebook,15.6,1920x1080,Intel i5,8,Windows 10,2.3,No,0,256,0,0,44222.4
Notebook,15.6,1920x1080,Intel i5,4,Windows 10,2.05,No,500,0,0,0,36496.8
Notebook,14.0,1920x1080,Intel Atom,4,Windows 10,1.4,No,0,32,0,0,13266.72
Ultrabook,14.0,1920x1080,Intel i7,16,Windows 10,1.24,Yes,0,512,0,0,99367.2
Gaming,17.3,1920x1080,Intel i7,32,Windows 10,4.6,No,1000,256,0,0,141884.63999999998
Gaming,17.3,1920x1080,Intel i7,16,Windows 10,4.14,No,1000,512,0,0,145401.12
Notebook,15.6,1920x1080,Intel i7,8,Linux,2.2,No,0,256,0,0,39907.2528
Notebook,14.0,1920x1080,Intel Celeron,4,Windows 10,1.45,No,0,32,0,0,20725.92
Notebook,15.6,1366x768,Intel i5,8,Windows 10,1.9,No,500,0,0,0,53733.94559999999
Notebook,13.3,1920x1080,Intel i3,4,Windows 10,1.49,No,0,128,0,0,38308.32
Notebook,15.6,1920x1080,Intel i7,16,Windows 10,1.93,No,0,256,0,0,81912.13919999999
Netbook,11.6,1366x768,Intel Celeron,4,Chrome OS,1.26,No,0,0,0,16,15717.6
Gaming,17.3,1920x1080,Intel i7,16,Windows 10,4.5,No,1000,128,0,0,125154.72
Gaming,17.3,1920x1080,Intel i7,16,Windows 10,3.78,No,1000,256,0,0,79813.44
Ultrabook,14.0,1920x1080,Intel i7,12,Windows 10,1.4,No,0,256,0,0,89137.44
Notebook,15.6,1366x768,Intel i7,12,Windows 10,2.2,Yes,1000,0,0,0,32447.52
Gaming,17.3,1920x1080,Intel i5,8,Windows 10,2.73,No,1000,128,0,0,94305.6
2 in 1 Convertible,15.6,1366x768,Intel i5,8,Windows 10,2.2,Yes,1000,0,0,0,39373.92
Notebook,15.6,1920x1080,AMD A12,12,Windows 10,2.2,No,0,512,0,0,50562.72
2 in 1 Convertible,11.6,1366x768,Intel M ,4,Windows 10,1.39,Yes,0,128,0,0,32127.84
Notebook,15.6,1920x1080,Intel i7,16,Windows 10,2.5,No,1000,128,0,0,90522.72
Notebook,17.3,1920x1080,Intel i3,4,No OS,2.8,No,500,0,0,0,28185.12
Notebook,15.6,1366x768,Intel i3,8,Windows 10,2.29,No,1000,0,0,0,24455.52
2 in 1 Convertible,13.3,1920x1080,Intel i7,8,Windows 10,1.37,Yes,0,512,0,0,107892.0
Notebook,14.0,1920x1080,Intel i5,8,Windows 10,1.7,No,0,256,0,0,78534.72
2 in 1 Convertible,12.5,1920x1080,Intel i5,8,Windows 10,1.34,Yes,0,256,0,0,88977.59999999999
Workstation,15.6,1920x1080,Intel i7,8,Windows 10,2.06,Yes,0,256,0,0,93932.64
Notebook,15.6,1920x1080,Intel i7,8,Windows 10,1.84,No,0,256,0,0,64948.32
Notebook,15.6,1366x768,Intel i3,4,Windows 10,2.1,No,500,0,0,0,35616.6144
Notebook,14.0,1920x1080,Intel Celeron,4,Windows 10,1.6,No,0,0,0,32,17529.12
Gaming,17.3,1920x1080,Intel i7,16,Windows 10,4.14,No,1000,128,0,0,117162.72
Notebook,15.6,1366x768,Intel i3,4,Linux,2.18,No,1000,0,0,0,24775.2
Gaming,15.6,3840x2160,Intel i7,16,Windows 10,1.8,No,2000,256,0,0,122490.72
Notebook,15.6,1920x1080,Intel i7,8,Windows 10,2.2,No,0,256,0,0,74538.72
Notebook,15.6,1920x1080,Intel i5,6,Windows 10,2.4,No,1000,0,0,0,30049.92
2 in 1 Convertible,15.6,1920x1080,Intel i7,8,Windows 10,2.0,Yes,0,256,0,0,69210.72
Notebook,14.0,1366x768,Intel Pentium,4,Windows 10,1.6,No,0,0,0,128,18594.72
Notebook,15.6,3840x2160,Intel Xeon,32,Windows 10,2.5,No,0,1000,0,0,261018.72
Gaming,15.6,1920x1080,Intel i7,16,Windows 10,2.59,No,1000,0,0,0,46833.6528
Notebook,15.6,1366x768,Intel i3,4,Linux,2.18,No,1000,0,0,0,23650.992
Notebook,15.6,1366x768,Intel i3,4,Linux,2.25,No,1000,0,0,0,19127.52
Notebook,15.6,1366x768,Intel i5,4,Linux,1.93,No,500,0,0,0,46300.32
Gaming,17.3,1920x1080,Intel i7,8,Windows 10,3.0,No,1000,128,0,0,62231.04
Notebook,15.6,1920x1080,Intel i5,4,Linux,2.18,No,0,128,0,0,30316.32
Ultrabook,15.6,1920x1080,Intel i7,8,Windows 10,1.84,No,0,512,0,0,74005.92
Gaming,15.6,1920x1080,Intel i7,16,Windows 10,2.94,No,1000,256,0,0,120831.5808
2 in 1 Convertible,11.6,1366x768,Intel Celeron,4,Chrome OS,1.25,Yes,0,0,0,32,20193.12
Notebook,14.0,1366x768,Intel i5,8,Windows 10,2.31,No,0,256,0,0,59886.72
Notebook,14.0,1920x1080,Intel i5,8,Windows 7,1.65,No,0,256,0,0,78055.2
Notebook,15.6,1920x1080,Intel i5,4,Windows 10,2.2,No,1000,0,0,0,41345.28
Notebook,15.6,1366x768,Intel i5,8,Windows 10,2.2,No,0,256,0,0,42570.72
Notebook,15.6,1366x768,Intel i5,4,Windows 7,1.88,No,500,0,0,0,49656.96
Notebook,15.6,1920x1080,Intel i7,8,Windows 10,2.2,No,1000,0,0,0,47898.72
Notebook,14.0,1920x1080,Intel Atom,2,Windows 10,1.4,No,0,0,0,32,12733.92
Notebook,15.6,1920x1080,Intel i5,4,No OS,2.2,No,0,128,0,0,24935.04
2 in 1 Convertible,13.3,1920x1080,Intel i5,6,Windows 10,1.5,Yes,1000,0,0,0,34046.4528
Notebook,15.6,1920x1080,Intel i7,8,Windows 10,2.0,No,0,256,0,0,96969.6
Ultrabook,14.0,1920x1080,Intel i7,16,Windows 10,1.1,No,0,512,0,0,101232.0
Gaming,15.6,1920x1080,Intel i7,16,Windows 10,2.62,No,1000,256,0,0,78801.12
Notebook,15.6,1920x1080,Intel i5,4,Windows 10,1.8,No,0,256,0,0,44169.12
Notebook,15.6,1920x1080,Intel i3,4,Windows 10,2.2,No,1000,0,0,0,30849.12
Notebook,15.6,1366x768,Intel Celeron,8,Windows 10,2.0,No,1000,0,0,0,21258.72
Notebook,15.6,1920x1080,Intel i5,8,Windows 10,1.99,No,1000,0,0,0,48304.7136
Ultrabook,13.3,3200x1800,Intel i5,8,Windows 10,1.23,Yes,0,256,0,0,99580.32
Notebook,14.0,1366x768,Intel Celeron,2,Windows 10,1.42,No,0,0,0,32,13266.72
2 in 1 Convertible,13.3,1920x1080,Intel i7,8,Windows 10,1.37,Yes,0,256,0,0,93635.3376
Notebook,15.6,3840x2160,Intel i7,16,Windows 10,2.06,Yes,0,1000,0,0,127818.72
Gaming,15.6,1920x1080,Intel i7,8,Windows 10,2.5,No,1000,128,0,0,59087.52
Notebook,17.0,1600x900,AMD A9,8,Windows 10,2.6,No,1000,0,0,0,27753.552
Ultrabook,14.0,1920x1080,Intel i7,16,Windows 10,1.14,No,0,512,0,0,130536.0
Gaming,15.6,1920x1080,Intel i7,8,No OS,2.5,No,1000,0,0,0,62284.32
Notebook,15.6,1366x768,Intel i3,4,Windows 10,2.4,No,500,0,0,0,23976.0
Notebook,14.0,1366x768,Intel Celeron,4,Windows 10,1.43,No,0,0,0,32,14598.72
Ultrabook,14.0,1920x1080,Intel i5,8,Windows 10,1.8,No,0,256,0,0,48964.32
Gaming,14.0,1920x1080,Intel i7,16,Windows 10,1.95,No,0,256,0,0,138474.72
Notebook,13.3,1920x1080,Intel i5,8,Windows 10,1.2,No,0,256,0,0,64628.64
Ultrabook,12.5,1920x1080,Intel i7,8,Windows 10,1.36,No,0,256,0,0,84395.52
Gaming,17.3,1920x1080,Intel i7,32,Windows 10,3.8,No,0,512,0,0,149130.72
Gaming,15.6,1920x1080,Intel i5,8,Linux,2.4,No,1000,0,0,0,37775.52
Ultrabook,13.3,1920x1080,Intel i5,8,Windows 10,1.2,No,0,256,0,0,77250.672
Gaming,15.6,1920x1080,Intel i7,8,Windows 10,2.2,No,1000,128,0,0,63499.10399999999
Notebook,15.6,1366x768,Intel i3,4,No OS,1.86,No,500,0,0,0,19441.872
Notebook,15.6,1920x1080,Intel i5,8,Windows 10,2.0,No,500,0,0,0,56689.92
Notebook,15.6,1920x1080,Intel i7,8,Windows 10,2.2,No,0,256,0,0,48964.32
Notebook,15.6,1920x1080,Intel i7,16,Windows 10,2.2,No,2000,256,0,0,60472.8
Gaming,15.6,1920x1080,Intel i7,8,Windows 10,3.31,No,1000,128,0,0,63722.88
Gaming,17.3,3840x2160,Intel i7,32,Windows 10,4.42,No,1000,512,0,0,167691.8736
Notebook,14.0,1920x1080,Intel i5,8,Windows 10,1.56,No,0,256,0,0,65481.12
Notebook,15.6,1366x768,Intel Celeron,4,Windows 10,2.2,No,500,0,0,0,22324.32
Notebook,15.6,1920x1080,Intel i5,4,Windows 10,2.2,No,500,0,0,0,28504.8
Notebook,15.6,1920x1080,Intel i3,6,Windows 10,2.04,No,1000,0,0,0,28717.92
Gaming,17.3,1920x1080,Intel i7,8,Windows 10,2.7,No,1000,128,0,0,79215.1056
Notebook,15.6,1366x768,Intel i3,4,Windows 10,2.1,No,0,128,0,0,26533.44
Notebook,15.6,1920x1080,Intel i5,8,Windows 10,2.06,No,1000,0,0,0,50882.4
Notebook,15.6,1920x1080,Intel i7,8,Windows 10,2.1,No,1000,0,0,0,39693.6
Notebook,15.6,1920x1080,Intel i5,8,Windows 10,2.0,No,0,256,0,0,67026.23999999999
Notebook,15.6,1366x768,Intel i3,4,Linux,2.1,No,0,128,0,0,21951.36
Ultrabook,13.5,2256x1504,Intel i7,8,Windows 10 S,1.25,Yes,0,256,0,0,99519.048
Notebook,15.6,1920x1080,Intel i5,8,Windows 10,1.9,No,1000,128,0,0,43580.376
2 in 1 Convertible,13.3,1920x1080,Intel i5,8,Windows 10,1.3,Yes,0,256,0,0,55091.52
Notebook,15.6,1366x768,AMD E,4,Windows 10,2.2,No,0,128,0,0,18594.72
2 in 1 Convertible,14.0,1920x1080,Intel i3,4,Windows 10,1.63,Yes,0,128,0,0,37242.72
Gaming,15.6,1920x1080,Intel i7,16,Windows 10,2.4,No,1000,256,0,0,68944.31999999999
Ultrabook,14.0,1920x1080,Intel i5,8,Windows 10,1.1,No,0,256,0,0,60472.8
2 in 1 Convertible,11.6,1366x768,Intel Celeron,8,Chrome OS,1.4,Yes,0,0,0,64,26373.6
Ultrabook,15.6,1920x1080,Intel i7,8,Windows 10,1.09,No,0,512,0,0,122490.72
Gaming,15.6,1920x1080,Intel i5,16,Windows 10,2.5,No,0,256,0,0,69210.72
Gaming,15.6,1920x1080,Intel i5,8,Windows 10,2.2,No,0,256,0,0,53168.112
Notebook,15.6,1366x768,Intel Celeron,4,Windows 10,1.86,No,0,128,0,0,22324.32
Gaming,15.6,1920x1080,Intel i5,16,Windows 10,3.21,No,1000,128,0,0,109277.28
Notebook,17.3,1920x1080,Intel i3,4,Windows 10,2.5,No,0,256,0,0,37242.72
2 in 1 Convertible,13.3,1920x1080,Intel i7,8,Windows 10,1.19,Yes,0,512,0,0,79866.72
Gaming,15.6,1920x1080,Intel i7,16,Windows 10,3.49,No,1000,256,0,0,149916.6
Notebook,15.6,1366x768,Intel i5,4,Windows 10,1.86,No,500,0,0,0,32639.8608
Notebook,15.6,1366x768,Intel i3,4,Windows 10,2.2,No,1000,0,0,0,29073.297599999994
Notebook,17.3,1920x1080,AMD A10,6,Windows 10,2.65,No,2000,0,0,0,30316.32
Notebook,15.6,1366x768,Intel Celeron,4,Windows 10,2.1,No,500,0,0,0,16943.04
Notebook,14.0,1366x768,Intel Celeron,4,Chrome OS,1.45,No,0,0,0,32,19980.0
Notebook,14.0,1920x1080,Intel i5,4,Windows 10,1.7,No,0,256,0,0,37242.72
Workstation,17.3,1920x1080,Intel i7,8,Windows 10,3.14,No,500,0,0,0,101657.7072
2 in 1 Convertible,14.0,2560x1440,Intel i7,8,Windows 10,1.42,Yes,0,256,0,0,137995.19999999998
Notebook,13.3,1920x1080,Intel i5,8,Windows 10,1.5,No,0,256,0,0,51841.44
Netbook,11.6,1366x768,Intel Celeron,4,Windows 10,1.4,No,0,0,0,32,14332.32
2 in 1 Convertible,14.0,1920x1080,Intel i7,16,Windows 10,1.38,Yes,0,512,0,0,93186.72
2 in 1 Convertible,12.5,1920x1080,Intel M ,4,Chrome OS,1.2,Yes,0,0,0,64,35644.32
Ultrabook,13.3,1920x1080,Intel i7,16,Windows 10,1.36,Yes,0,512,0,0,100006.56
Notebook,15.6,1920x1080,Intel i7,4,Windows 10,2.1,No,500,0,0,0,36709.92
Gaming,15.6,1920x1080,Intel i5,8,Windows 10,2.56,No,1000,0,0,0,43636.32
Notebook,15.6,1920x1080,AMD A9,4,Windows 10,2.2,No,0,256,0,0,21258.72
Notebook,15.6,1366x768,AMD A12,8,Windows 10,2.2,No,1000,0,0,0,22857.12
Notebook,15.6,1920x1080,Intel i5,4,Windows 10,2.1,No,1000,0,0,0,33110.856
Notebook,15.6,1366x768,Intel i3,4,No OS,1.9,No,500,0,0,0,23976.0
Notebook,15.6,1920x1080,Intel i5,8,Windows 10,2.18,No,0,256,0,0,42357.6
2 in 1 Convertible,13.3,1920x1080,Intel i5,8,Windows 10,1.6,Yes,0,256,0,0,53226.72
Workstation,15.6,1920x1080,Intel i7,16,Windows 7,2.18,No,0,512,0,0,98834.4
Notebook,14.0,1920x1080,Intel i5,8,Windows 10,1.8,No,0,256,0,0,63456.48
Notebook,17.3,1920x1080,AMD A10,6,Windows 10,2.71,No,2000,0,0,0,34898.932799999995
Gaming,15.6,1920x1080,Intel i7,8,Windows 10,2.5,No,1000,128,0,0,66546.72
Notebook,14.0,1920x1080,Intel i5,8,Linux,1.64,No,0,256,0,0,58021.92
Notebook,15.6,1920x1080,Intel i5,8,Linux,1.98,No,1000,0,0,0,38681.28
Notebook,14.0,1920x1080,Intel Celeron,4,Windows 10,1.5,No,0,0,0,32,15877.44
Notebook,15.6,1920x1080,Intel i5,16,Windows 10,1.93,No,0,512,0,0,76012.44480000001
Notebook,14.0,1920x1080,Intel i5,8,Windows 10,1.87,No,0,256,0,0,45664.6896
Notebook,15.6,1920x1080,Intel i5,8,Windows 10,1.9,No,0,256,0,0,62817.12
Notebook,15.6,1366x768,AMD A6,4,Windows 10,2.19,No,500,0,0,0,15877.44
Notebook,14.0,1920x1200,Intel Atom,4,Windows 10,1.4,No,32,0,0,0,14119.2
Notebook,17.3,1920x1080,Intel i7,8,Windows 10,2.63,No,0,256,0,0,63936.0
Ultrabook,14.0,2560x1440,Intel i7,8,Windows 10,1.17,No,0,512,0,0,89864.1792
2 in 1 Convertible,13.3,1366x768,Intel i5,8,Windows 10,1.58,Yes,0,256,0,0,44574.048
Ultrabook,14.0,1920x1080,Intel i5,8,Windows 10,1.32,No,0,256,0,0,79866.72
Gaming,17.3,3840x2160,Intel i7,32,Windows 10,4.36,No,1000,1000,0,0,194972.832
Gaming,17.3,1920x1080,Intel i7,8,Windows 10,2.7,No,1000,128,0,0,71847.0144
Notebook,15.6,1366x768,Intel i5,4,No OS,1.9,No,1000,0,0,0,26101.872
Notebook,15.6,1920x1080,Intel i5,8,Windows 10,2.2,No,1000,128,0,0,38308.32
2 in 1 Convertible,13.3,1920x1080,Intel i3,4,Windows 10,1.71,Yes,1000,0,0,0,34578.72
Notebook,15.6,1366x768,Intel i5,8,Linux,2.32,No,1000,0,0,0,31409.6256
Notebook,15.6,1920x1080,AMD A9,4,Windows 10,2.1,No,1000,0,0,0,26053.92
Gaming,17.3,1920x1080,Intel i7,16,Windows 10,4.2,No,1000,128,0,0,103096.8
Notebook,15.6,1366x768,Intel i5,12,Windows 10,2.25,No,1000,0,0,0,34578.72
Notebook,15.6,1920x1080,AMD A9,6,Windows 10,2.1,No,1000,128,0,0,34632.0
Notebook,15.6,1366x768,Intel i5,4,Windows 10,2.4,No,500,0,0,0,29783.52
Notebook,13.3,1920x1080,Intel i5,8,Windows 10,1.44,No,0,256,0,0,51148.8
Notebook,15.6,1920x1080,Intel i7,4,Windows 10,1.85,No,1000,0,0,0,41505.12
Workstation,15.6,1920x1080,Intel i7,16,Windows 10,2.6,No,0,256,0,0,128884.32
2 in 1 Convertible,13.3,1920x1080,Intel i5,8,Windows 10,1.55,Yes,1000,0,0,0,35111.52
Gaming,15.6,1920x1080,Intel i7,16,Windows 10,1.8,No,1000,256,0,0,111593.8944
Notebook,15.6,1366x768,Intel i3,4,Windows 10,2.4,No,500,0,0,0,21887.424
Notebook,15.6,1920x1080,Intel i7,8,Windows 10,2.0,No,1000,128,0,0,64308.96
Notebook,15.6,1366x768,Intel i3,8,Windows 10,2.0,No,0,256,0,0,35431.2
Notebook,14.0,1920x1080,Intel i5,8,Windows 10,1.25,Yes,0,256,0,0,81784.8
2 in 1 Convertible,14.0,1920x1080,Intel i5,8,Windows 10,1.7,Yes,0,256,0,0,53226.72
Workstation,15.6,3840x2160,Intel i7,16,Windows 10,2.5,No,0,1000,0,0,175770.72
Notebook,14.0,1366x768,Intel Celeron,2,Chrome OS,1.68,No,0,0,0,32,17582.399999999998
Ultrabook,13.3,1920x1080,Intel i7,16,Windows 10,0.81,No,0,256,0,0,87858.72
Notebook,15.6,1920x1080,Intel i3,8,Windows 10,1.86,No,0,256,0,0,28717.92
Notebook,14.0,1366x768,Intel i5,8,Windows 10,1.6,No,0,256,0,0,60031.1088
Workstation,17.3,1920x1080,Intel Xeon,16,Windows 7,3.0,No,0,256,0,0,233845.92
Netbook,11.6,1366x768,Intel Celeron,4,Windows 10,1.4,Yes,0,128,0,0,25308.0
Notebook,15.6,1920x1080,Intel i5,8,Windows 10,1.84,No,0,256,0,0,101232.0
Notebook,15.6,1366x768,Intel i5,4,No OS,2.45,No,1000,0,0,0,30849.12
Ultrabook,14.0,1920x1080,Intel i5,4,Windows 10,1.7,No,0,180,0,0,58394.88
Notebook,15.6,1366x768,Intel i7,4,Windows 10,2.37,No,0,256,0,0,45282.672
2 in 1 Convertible,13.3,3200x1800,Intel i5,8,Windows 10,1.3,Yes,0,256,0,0,63882.72
Notebook,15.6,1920x1080,Intel i5,8,Windows 10,2.2,No,1000,128,0,0,58554.72
Workstation,15.6,1920x1080,Intel i7,8,Windows 7,2.59,No,0,256,0,0,83170.08
Gaming,15.6,3840x2160,Intel i7,16,Windows 10,4.42,No,1000,256,0,0,152859.7872
Notebook,15.6,1366x768,Intel i5,4,Windows 10,2.1,No,0,256,0,0,31914.72
Gaming,15.6,1920x1080,Intel i7,8,Windows 10,2.5,No,1000,128,0,0,55837.44
Ultrabook,12.5,1920x1080,Intel i7,16,Windows 10,1.18,No,0,256,0,0,99047.52
Ultrabook,12.3,2400x1600,Intel i5,8,Chrome OS,1.1,Yes,0,256,0,0,83063.52
Ultrabook,13.3,3200x1800,Intel i5,8,Windows 10,1.2,No,0,256,0,0,60153.12
Notebook,13.3,1366x768,Intel i3,4,Windows 10,1.65,No,500,0,0,0,45234.72
Notebook,13.3,1366x768,Intel i5,4,Windows 10,1.6,No,0,128,0,0,34898.4
Notebook,17.3,1366x768,Intel Pentium,4,Windows 10,2.8,No,1000,0,0,0,25059.715199999995
Gaming,15.6,3840x2160,Intel i7,16,Windows 10,2.72,Yes,1000,128,0,0,58554.72
Ultrabook,13.3,1920x1080,Intel i7,8,Windows 10,1.31,Yes,0,256,0,0,85194.72
Notebook,15.6,1366x768,Intel Pentium,4,Linux,2.1,No,1000,0,0,0,15877.44
Notebook,15.6,1920x1080,Intel i7,16,Windows 10,2.3,No,0,256,0,0,62938.0656
2 in 1 Convertible,15.0,1920x1080,Intel i7,16,Windows 10,1.71,Yes,0,256,0,0,95850.72
Notebook,14.0,1366x768,Intel i5,4,Windows 10,1.75,No,0,128,0,0,54345.6
Gaming,15.6,1920x1080,Intel i7,8,Windows 10,2.62,No,1000,0,0,0,58554.72
Ultrabook,12.5,1366x768,Intel i5,4,Windows 10,1.26,No,0,256,0,0,66280.31999999999
2 in 1 Convertible,15.6,1920x1080,Intel i7,12,Windows 10,2.3,Yes,2000,0,0,0,44701.92
Notebook,15.6,3840x2160,Intel i7,16,Windows 7,2.5,No,0,512,0,0,126273.6
Notebook,14.0,1920x1080,Intel i3,4,Windows 10,1.8,No,0,128,0,0,33886.08
Gaming,14.0,1920x1080,Intel i7,16,Windows 10,1.95,No,0,512,0,0,154458.72
Notebook,15.6,1920x1080,Intel Pentium,8,Windows 10,2.0,No,0,128,0,0,31003.632
Gaming,17.3,1920x1080,Intel i7,32,Windows 10,4.42,No,1000,1000,0,0,191211.264
Gaming,17.3,1920x1080,Intel i7,16,Windows 10,4.3,No,1000,256,0,0,125208.0
Ultrabook,14.0,1920x1080,Intel i7,16,Windows 10,1.47,No,0,512,0,0,93985.92
Notebook,15.6,1366x768,Intel Celeron,8,No OS,2.2,No,1000,0,0,0,17529.12
Ultrabook,14.0,1920x1080,Intel i7,16,Windows 10,1.7,No,0,512,0,0,122490.72
Gaming,14.0,1920x1080,Intel i7,16,Windows 10,1.6,No,1000,256,0,0,100752.48
Gaming,15.6,1920x1080,Intel i5,8,Windows 10,2.2,No,1000,128,0,0,58021.92
Gaming,15.6,1920x1080,Intel i7,4,Windows 10,2.4,No,1000,0,0,0,53226.72
Gaming,17.3,1920x1080,Intel i7,16,Windows 10,4.2,No,1000,256,0,0,122490.72
Gaming,15.6,1920x1080,Intel i5,8,Windows 10,2.62,No,0,256,0,0,52480.8
Gaming,15.6,1920x1080,Intel i7,8,Windows 10,2.24,No,1000,128,0,0,71341.92
Notebook,14.0,1920x1080,Intel Celeron,4,Windows 10,1.22,No,0,0,0,32,10810.512
2 in 1 Convertible,13.3,1920x1080,Intel i7,8,Windows 10,1.37,Yes,0,512,0,0,104961.6
2 in 1 Convertible,15.6,1920x1080,Intel i5,8,Windows 10,2.08,Yes,0,256,0,0,51095.52
Ultrabook,12.0,2304x1440,Intel M ,8,Mac OS X,0.92,No,0,0,0,512,62071.2
2 in 1 Convertible,14.0,2560x1440,Intel i5,8,Windows 10,1.42,Yes,0,256,0,0,124142.4
Notebook,14.0,1366x768,Intel Celeron,4,Windows 10,1.63,No,0,0,0,32,15930.72
Notebook,15.6,1366x768,Intel i5,8,Windows 10,1.95,No,0,128,0,0,43156.8
2 in 1 Convertible,13.9,1920x1080,Intel i7,8,Windows 10,1.38,Yes,0,256,0,0,71874.72
Notebook,15.6,1920x1080,Intel i3,8,Windows 10,2.0,No,0,256,0,0,39373.92
Workstation,15.6,1920x1080,Intel i7,8,Windows 10,3.14,No,0,256,0,0,110017.872
Notebook,15.6,1920x1080,Intel i5,8,Windows 10,2.37,No,0,256,0,0,58554.72
Ultrabook,13.3,1920x1080,Intel i5,8,Windows 10,1.29,No,0,256,0,0,79866.72
Notebook,15.6,3840x2160,Intel i5,8,Windows 10,2.06,Yes,0,256,0,0,93186.72
Netbook,11.6,1366x768,Intel Pentium,4,Windows 10,1.63,No,0,128,0,0,39640.32
Netbook,12.5,1366x768,Intel i5,8,Windows 10,1.26,No,0,256,0,0,74005.92
Notebook,15.6,1366x768,Intel i5,4,Windows 10,2.1,No,500,0,0,0,41558.4
Notebook,15.6,1366x768,AMD A12,8,Windows 10,2.04,No,2000,0,0,0,33513.119999999995
Gaming,15.6,3840x2160,Intel i7,16,Windows 10,2.62,No,0,512,0,0,89457.12
Notebook,15.6,1920x1080,Intel i5,4,Windows 10,2.4,No,1000,0,0,0,32447.52
Gaming,17.3,1920x1080,Intel i7,12,Windows 10,3.74,No,1000,0,0,0,93186.72
Gaming,17.3,1920x1080,Intel i7,16,Windows 10,2.9,No,1000,512,0,0,128671.2
Ultrabook,13.3,1920x1080,Intel i5,8,Windows 10,0.81,No,0,256,0,0,79866.72
Notebook,15.6,1920x1080,Intel i7,8,Windows 10,1.98,No,1000,0,0,0,51202.08
Notebook,15.6,1920x1080,Intel i5,8,Windows 10,2.18,No,0,256,0,0,42081.0768
Ultrabook,14.0,1920x1080,Intel i7,8,Windows 10,1.32,No,0,256,0,0,99047.52
Ultrabook,12.5,3840x2160,Intel i7,16,Windows 10,1.29,Yes,0,512,0,0,95850.72
Netbook,11.6,1366x768,Intel Celeron,4,Chrome OS,1.23,No,0,0,0,16,20512.8
Gaming,17.3,1920x1080,Intel i7,16,Windows 10,4.36,No,1000,128,0,0,133467.4656
Notebook,14.0,1366x768,Intel i5,4,Windows 10,1.76,No,500,0,0,0,40226.4
Notebook,15.6,1366x768,Intel i3,4,Windows 10,2.1,No,500,0,0,0,26101.872
Ultrabook,14.0,1366x768,Intel i5,4,Windows 10,1.25,No,0,128,0,0,58075.2
Ultrabook,14.0,1920x1080,Intel i7,8,Windows 10,1.13,No,0,512,0,0,133146.72
Gaming,15.6,1920x1080,Intel i5,8,Windows 10,2.4,No,0,256,0,0,63882.72
Ultrabook,14.0,1920x1080,Intel i5,8,Windows 10,1.13,No,0,0,0,256,99900.0
Notebook,14.0,1366x768,Intel Pentium,4,Windows 10,1.75,No,0,128,0,0,26586.72
2 in 1 Convertible,13.3,1920x1080,Intel i5,8,Windows 10,1.1,Yes,0,256,0,0,72354.23999999999
Notebook,14.0,1366x768,Intel i3,4,Windows 10,1.76,No,500,0,0,0,31168.8
Netbook,11.6,1366x768,Intel Celeron,4,Chrome OS,1.35,No,0,0,0,32,18914.4
Notebook,14.0,1920x1080,Intel i3,8,Windows 10,1.5,No,0,128,0,0,32980.32
Gaming,17.3,3840x2160,Intel i7,32,Windows 10,3.49,Yes,0,512,0,0,292986.72
Ultrabook,14.0,2560x1440,Intel i7,16,Windows 10,1.1,No,0,512,0,0,111834.72
Notebook,15.6,1920x1080,Intel i5,4,Linux,2.1,No,1000,0,0,0,27652.32
Notebook,14.0,1920x1080,Intel i5,8,Windows 10,1.7,No,0,256,0,0,63190.08
Notebook,14.0,1920x1080,Intel i5,8,Windows 10,1.32,No,0,256,0,0,87912.0
Gaming,15.6,1920x1080,Intel i7,16,Windows 10,3.21,No,1000,256,0,0,147832.28639999998
Gaming,17.3,1920x1080,Intel i7,16,Windows 10,2.9,No,1000,256,0,0,128884.32
Notebook,15.6,1366x768,Intel i3,4,Windows 10,2.0,No,500,0,0,0,35644.32
Notebook,14.0,1366x768,Intel Celeron,4,Chrome OS,1.5,No,0,0,0,16,17316.0
Notebook,15.6,1920x1080,Intel i5,8,Windows 10,2.3,No,128,0,0,0,31435.2
Gaming,17.3,1920x1080,Intel i7,16,Windows 10,2.73,No,1000,512,0,0,95850.72
Gaming,17.3,1920x1080,Intel i7,32,Windows 10,4.42,No,1000,512,0,0,163723.57919999998
Notebook,17.3,1600x900,Intel i5,8,Windows 10,2.63,No,1000,0,0,0,48484.8
Notebook,15.6,1366x768,Intel i5,8,Windows 10,2.18,No,0,128,0,0,38041.3872
Ultrabook,14.0,1920x1080,Intel i7,8,Windows 7,1.54,No,0,512,0,0,99633.6
Notebook,15.6,1920x1080,Intel i7,4,Windows 10,2.18,No,0,256,0,0,39373.92
2 in 1 Convertible,11.6,1366x768,Intel Celeron,4,Chrome OS,1.4,Yes,0,0,0,32,32767.2
Ultrabook,13.3,1920x1080,Intel i5,8,Windows 10,1.45,No,0,512,0,0,54665.28
2 in 1 Convertible,13.3,1920x1080,Intel i5,8,Windows 10,1.28,Yes,0,256,0,0,121318.56
Ultrabook,14.0,1920x1080,Intel i7,8,Windows 10,1.54,No,0,512,0,0,78215.04
Notebook,15.6,1366x768,Intel Celeron,4,No OS,1.86,No,0,128,0,0,15930.72
Gaming,15.6,1920x1080,Intel i7,16,Windows 10,2.1,No,1000,128,0,0,101178.72
Notebook,17.3,1920x1080,Intel i7,8,Linux,2.83,No,1000,0,0,0,46087.2
Ultrabook,14.0,1920x1080,Intel i7,8,Windows 10,1.96,No,0,256,0,0,101391.84
Notebook,15.6,1920x1080,Intel i7,8,Windows 10,2.3,No,0,256,0,0,41931.36
Notebook,15.6,1920x1080,Intel i5,8,Windows 10,1.9,No,0,128,0,0,50349.6
Notebook,15.6,1366x768,Intel Pentium,4,Windows 10,2.0,No,1000,0,0,0,23922.72
2 in 1 Convertible,13.3,1920x1080,Intel i7,8,Windows 10,1.28,Yes,0,256,0,0,136343.52
Notebook,13.3,1920x1080,Intel i5,8,Windows 10,1.62,Yes,1000,0,0,0,34578.72
Notebook,15.6,1920x1080,Intel i3,4,No OS,2.2,No,1000,0,0,0,24988.32
Notebook,15.6,1920x1080,Intel i5,8,Windows 10,2.3,No,1000,0,0,0,45323.1648
Notebook,15.6,1920x1080,Intel i5,8,Windows 10,1.84,No,0,256,0,0,71874.72
Notebook,13.3,1920x1080,Intel i5,4,Windows 10,1.05,No,0,128,0,0,68464.8
Gaming,15.6,1920x1080,Intel i5,8,No OS,2.5,No,1000,0,0,0,54185.76
Ultrabook,13.3,3200x1800,Intel i7,16,Windows 10,1.29,Yes,0,512,0,0,119347.2
Notebook,15.6,1920x1080,Intel i5,4,Windows 10,2.07,No,500,0,0,0,48484.8
Ultrabook,13.3,1366x768,Intel i5,8,Windows 10,1.2,No,0,256,0,0,58341.6
2 in 1 Convertible,13.3,1920x1080,Intel i7,8,Windows 10,1.37,Yes,0,256,0,0,103896.0
Notebook,14.0,1920x1080,Intel i5,8,Windows 10,1.56,No,0,256,0,0,48058.56
Workstation,15.6,1920x1080,Intel i7,8,Windows 10,2.23,No,1000,0,0,0,94731.84
Notebook,15.6,1366x768,Intel i5,4,Windows 10,2.38,No,500,0,0,0,56210.4
Notebook,15.6,1920x1080,Intel i3,4,No OS,2.2,No,1000,0,0,0,25521.12
Notebook,15.6,1920x1080,Intel i7,8,Windows 10,2.0,No,0,256,0,0,73952.64
Notebook,13.3,1920x1080,Intel i3,4,Windows 10,1.44,No,0,180,0,0,39160.8
Ultrabook,15.0,1920x1080,Intel i7,16,Windows 10,1.23,No,0,256,0,0,98514.72
Ultrabook,12.5,1920x1080,Intel i7,8,Windows 10,1.6,No,0,256,0,0,90043.2
Notebook,15.6,1366x768,Intel Pentium,4,Linux,2.0,No,1000,0,0,0,21258.1872
Ultrabook,13.3,1920x1080,Intel i5,8,Windows 10,1.28,No,0,256,0,0,49816.8
Notebook,15.6,1920x1080,Intel i5,4,Windows 10,2.18,No,1000,128,0,0,48618.0
Notebook,15.6,1920x1080,Intel i5,4,Windows 10,2.04,No,0,256,0,0,44701.92
2 in 1 Convertible,13.3,1920x1080,Intel i5,4,Windows 10,1.28,Yes,0,256,0,0,90576.0
2 in 1 Convertible,15.6,1366x768,Intel i5,4,Windows 10,2.3,Yes,500,0,0,0,36486.14399999999
Notebook,14.1,1366x768,Intel Celeron,4,Windows 10,1.65,No,0,0,0,32,18541.44
Notebook,15.6,1920x1080,Intel i7,8,Windows 10,2.2,No,1000,0,0,0,35644.32
Notebook,15.6,1366x768,Intel Pentium,4,Windows 10,2.2,No,500,0,0,0,19660.32
2 in 1 Convertible,13.3,1920x1080,Intel i5,4,Windows 10,1.28,Yes,0,256,0,0,95850.72
Notebook,15.6,1366x768,Intel i3,4,Linux,2.18,No,1000,0,0,0,24279.696
Gaming,17.3,1920x1080,Intel i5,12,Windows 10,2.2,No,1000,128,0,0,72988.272
Netbook,11.6,1366x768,Intel Celeron,4,Chrome OS,1.25,No,0,0,0,32,15824.16
Notebook,17.3,1600x900,AMD A4,4,Windows 10,2.8,No,500,0,0,0,20193.12
Notebook,14.0,1920x1080,Intel i5,4,Windows 10,1.95,No,0,128,0,0,67399.2
2 in 1 Convertible,13.3,3200x1800,Intel i7,16,Windows 10,1.42,Yes,0,256,0,0,74538.72
Ultrabook,15.0,1920x1080,Intel i7,8,Windows 10,1.17,No,0,256,0,0,90522.72
Ultrabook,14.0,1920x1080,Intel i5,8,Windows 10,1.32,No,0,256,0,0,95850.72
Gaming,17.3,3840x2160,Intel i7,16,Windows 10,2.43,No,2000,512,0,0,141138.72
Notebook,13.3,1920x1080,Intel i5,8,Windows 10,1.05,No,0,256,0,0,78588.0
Gaming,15.6,1920x1080,Intel i7,8,Linux,2.62,No,1000,0,0,0,49497.12
Notebook,15.6,1920x1080,Intel i7,8,Windows 10,2.04,No,1000,0,0,0,47952.0
Notebook,15.6,1366x768,Intel i3,4,Windows 10,2.18,No,1000,0,0,0,32713.92
Notebook,15.6,1920x1080,Intel i5,8,Windows 10,1.9,No,500,0,0,0,49816.8
2 in 1 Convertible,13.3,3200x1800,Intel i7,8,Windows 10,1.24,Yes,0,512,0,0,107257.968
Gaming,17.3,1920x1080,Intel i7,32,Windows 10,3.58,No,0,512,0,0,68145.12
2 in 1 Convertible,13.3,1920x1080,Intel i7,16,Windows 10,1.22,Yes,0,256,0,0,87858.72
Ultrabook,14.0,1920x1080,Intel i7,8,Windows 10,1.13,No,0,0,0,256,109170.72
Notebook,15.6,1920x1080,Intel i5,8,Windows 10,1.95,No,0,512,0,0,104588.1072
Ultrabook,15.6,1920x1080,Intel i7,16,Windows 10,1.08,Yes,0,512,0,0,111834.72
Netbook,12.5,1920x1080,Intel i7,8,Windows 10,1.26,No,0,512,0,0,79014.23999999999
Notebook,15.6,1920x1080,Intel Celeron,4,Chrome OS,2.2,No,0,0,0,16,19127.52
Notebook,15.6,1920x1080,Intel i5,8,Windows 10,2.6,No,1000,128,0,0,42037.92
Ultrabook,14.0,1920x1080,Intel i7,8,Windows 10,0.98,Yes,0,512,0,0,101178.72
Notebook,14.0,1920x1080,Intel i5,8,Windows 10,1.6,No,0,256,0,0,64202.4
Ultrabook,12.5,3840x2160,Intel M ,8,Windows 10,1.09,Yes,0,240,0,0,165168.0
Notebook,15.6,1920x1080,Intel i7,6,Windows 10,2.2,No,0,256,0,0,42037.92
Notebook,15.6,1920x1080,Intel i7,8,Windows 10,2.04,No,0,256,0,0,54291.78719999999
Notebook,15.6,1920x1080,Intel i3,4,Windows 10,2.4,No,1000,0,0,0,26586.72
Notebook,13.3,1920x1080,Intel i5,4,Windows 10,1.44,No,0,128,0,0,46939.68
Notebook,13.3,1920x1080,Intel i5,8,Windows 10,1.49,No,0,256,0,0,51148.8
Gaming,17.3,1920x1080,Intel i7,16,Windows 10,2.7,No,1000,256,0,0,85194.72
Gaming,15.6,1920x1080,Intel i7,16,Windows 10,2.6,No,1000,128,0,0,71874.72
Gaming,15.6,1920x1080,Intel i5,8,Windows 10,2.2,No,1000,128,0,0,59668.804800000005
Notebook,15.6,1366x768,Intel i5,4,Windows 10,2.18,No,1000,0,0,0,36496.2672
Ultrabook,15.6,1920x1080,Intel i7,8,Windows 10,1.84,No,0,256,0,0,69103.62719999999
Ultrabook,13.3,3200x1800,Intel i7,8,Windows 10,1.39,Yes,0,256,0,0,61218.72
Notebook,15.6,1920x1080,Intel i7,16,Windows 10,2.4,No,0,256,0,0,105228.0
2 in 1 Convertible,13.3,1920x1080,Intel i5,8,Windows 10,1.37,Yes,0,512,0,0,97236.0
Notebook,15.6,1366x768,Intel i5,4,Windows 10,1.95,No,500,0,0,0,38889.072
Ultrabook,12.5,1920x1080,Intel i7,8,Windows 10,1.36,No,0,256,0,0,87912.0
Notebook,15.6,1920x1080,Intel i5,8,Windows 10,2.31,No,0,256,0,0,62071.2
Notebook,15.6,1366x768,Intel i5,4,Windows 10,2.18,No,1000,0,0,0,37725.4368
Notebook,14.0,1366x768,Intel i5,4,Windows 10,1.95,No,500,0,0,0,61218.72
Notebook,15.6,1366x768,Intel Pentium,4,Windows 10,2.2,No,1000,0,0,0,16463.52
Ultrabook,12.5,1920x1080,Intel i5,4,Windows 10,1.26,No,500,0,0,0,84129.12
Notebook,15.6,1366x768,Intel Celeron,4,No OS,1.86,No,1000,0,0,0,15392.592
2 in 1 Convertible,13.3,3200x1800,Intel i7,16,Windows 10,1.3,Yes,0,1000,0,0,95850.72
Notebook,14.0,1920x1080,Intel i5,4,Windows 10,1.47,No,0,128,0,0,58874.4
Netbook,12.5,1920x1080,Intel i5,8,Windows 10,1.26,No,0,256,0,0,88924.31999999999
Notebook,15.6,1366x768,Intel i3,4,Windows 10,2.18,No,1000,0,0,0,29762.208
Gaming,15.6,1920x1080,Intel i7,8,Windows 10,2.2,No,1000,128,0,0,63882.72
Ultrabook,14.0,1920x1080,Intel i5,8,Windows 10,1.36,No,0,256,0,0,87325.92
Gaming,17.3,2560x1440,Intel i7,16,Windows 10,4.36,No,1000,512,0,0,146946.24
Gaming,17.3,1920x1080,Intel i5,8,Windows 10,2.75,No,1000,128,0,0,74538.72
Notebook,17.3,1600x900,Intel Pentium,4,Windows 10,2.8,No,1000,0,0,0,28238.4
Notebook,15.6,1366x768,Intel i5,4,Windows 10,2.23,No,500,0,0,0,32980.32
Notebook,15.6,1366x768,Intel i5,8,Windows 10,2.2,No,0,256,0,0,59620.32
2 in 1 Convertible,11.3,1920x1080,Intel M ,8,Windows 10,1.1,Yes,0,256,0,0,69210.72
Gaming,15.6,1920x1080,AMD FX,16,Windows 10,2.5,No,1000,512,0,0,53226.72
Ultrabook,12.5,1920x1080,Intel i5,8,Windows 10,1.36,Yes,0,256,0,0,78438.816
Notebook,15.6,1920x1080,Intel i7,8,No OS,2.2,No,1000,0,0,0,36496.8
Notebook,17.3,1600x900,Intel i3,4,Windows 10,2.36,No,1000,0,0,0,35111.52
Notebook,14.0,1366x768,Intel Celeron,4,Chrome OS,1.68,No,0,0,0,32,18594.72
Workstation,15.6,1920x1080,Intel i7,8,Windows 10,2.0,No,0,8,0,0,119826.72
Ultrabook,14.0,1920x1080,Intel i7,8,Windows 10,1.36,No,0,256,0,0,94572.0
Notebook,13.3,1920x1080,Intel i5,8,Windows 7,1.2,No,0,256,0,0,77788.8
2 in 1 Convertible,12.5,1920x1080,Intel M ,8,Chrome OS,1.2,No,0,0,0,64,61751.52
Ultrabook,14.0,1920x1080,Intel i7,8,Windows 10,1.7,No,0,256,0,0,79333.3872
Gaming,17.3,3840x2160,Intel i7,16,Windows 10,4.36,No,1000,512,0,0,168045.12
2 in 1 Convertible,13.3,1920x1080,Intel i5,8,Windows 10,1.24,Yes,0,256,0,0,101178.72
2 in 1 Convertible,11.6,1366x768,Intel Pentium,4,Windows 10,1.45,Yes,0,256,0,0,41292.0
Ultrabook,13.3,3200x1800,Intel i7,8,Windows 10,1.3,No,0,256,0,0,67559.04
2 in 1 Convertible,11.6,1366x768,Intel Celeron,4,Chrome OS,1.25,Yes,0,0,0,32,20725.92
Notebook,13.3,1920x1080,Intel i5,8,Windows 10,1.2,No,0,256,0,0,81784.8
Ultrabook,12.5,1920x1080,Intel i5,8,Windows 10,1.36,No,0,256,0,0,93772.8
Notebook,15.6,1920x1080,Intel i5,12,Windows 10,2.4,No,1000,128,0,0,53759.52
Ultrabook,12.5,1920x1080,Intel i7,8,Windows 10,1.1,Yes,0,512,0,0,95371.2
Notebook,15.6,1366x768,Intel i5,8,Windows 10,2.04,No,1000,0,0,0,45101.52
Notebook,15.6,1366x768,Intel i3,4,Linux,2.25,No,1000,0,0,0,24808.2336
Notebook,15.6,1366x768,Intel i5,4,Windows 10,1.9,No,500,0,0,0,43956.0
Notebook,15.6,1920x1080,Intel i3,4,Windows 10,2.04,No,500,0,0,0,36496.8
Gaming,17.3,1920x1080,Intel i7,32,Windows 10,4.42,No,1000,256,0,0,167778.72
Notebook,15.6,1920x1080,Intel i5,6,Windows 10,2.4,No,0,256,0,0,37029.6
2 in 1 Convertible,13.3,3200x1800,Intel i7,16,Windows 10,1.22,Yes,0,512,0,0,101178.72
Ultrabook,14.0,2560x1440,Intel i7,8,Windows 10,1.5,Yes,0,256,0,0,104587.57439999998
Gaming,17.3,1920x1080,Intel i7,32,Windows 10,4.42,No,1000,256,0,0,149184.0
Notebook,14.0,1920x1080,Intel i5,8,Windows 10,1.95,No,0,256,0,0,62870.4
Gaming,17.3,1920x1080,Intel i7,16,Windows 10,2.73,No,1000,256,0,0,109218.672
Notebook,15.6,1920x1080,Intel i5,8,Windows 10,2.04,No,1000,128,0,0,52161.12
Notebook,14.0,1366x768,Intel i5,4,Windows 7,1.7,No,0,0,508,0,53386.56
2 in 1 Convertible,15.6,3840x2160,Intel i7,16,Windows 10,2.3,Yes,2000,512,0,0,95850.72
Notebook,15.6,1366x768,Intel i7,6,Windows 10,2.04,No,1000,0,0,0,30849.12
Gaming,17.3,1920x1080,Intel i7,16,Windows 10,2.99,No,1000,256,0,0,93186.72
2 in 1 Convertible,15.6,1920x1080,Intel i7,12,Windows 10,2.19,Yes,0,512,0,0,69210.72
Notebook,13.3,1920x1080,Intel i5,4,Windows 7,1.2,No,0,128,0,0,63669.6
Notebook,15.6,1920x1080,AMD A12,6,Windows 10,2.2,No,0,256,0,0,29250.72
Notebook,15.6,1366x768,Intel i5,4,Windows 10,2.3,No,0,256,0,0,34578.72
Notebook,14.0,1366x768,Intel i5,4,Windows 10,1.75,No,500,0,0,0,48751.2
Notebook,15.6,1366x768,Intel i5,4,Windows 10,2.25,No,500,0,0,0,31914.72
Notebook,15.6,1920x1080,Intel i5,8,Windows 10,2.04,No,1000,0,0,0,42943.68
Gaming,15.6,1920x1080,Intel i7,8,Windows 10,2.5,No,1000,128,0,0,63349.92
Notebook,15.6,1366x768,Intel i7,8,Windows 10,2.36,No,1000,0,0,0,39906.72
Notebook,14.0,1920x1080,Intel i5,8,Windows 10,1.6,No,0,128,0,0,59620.32
Netbook,12.5,1920x1080,Intel M ,8,Windows 10,0.97,No,0,512,0,0,101658.24
Notebook,15.6,1920x1080,Intel i3,4,Windows 10,2.1,No,1000,128,0,0,26586.72
Notebook,15.6,1366x768,Intel Celeron,4,No OS,1.9,No,0,128,0,0,14418.6336
Notebook,15.6,1920x1080,Intel i5,8,Windows 10,2.3,No,0,256,0,0,71874.72
2 in 1 Convertible,13.3,1920x1080,Intel i5,8,Windows 10,1.68,Yes,0,256,0,0,47365.92
Notebook,13.3,3200x1800,Intel i5,8,Windows 10,1.4,No,0,256,0,0,61272.0
Ultrabook,13.3,1920x1080,Intel i7,8,Windows 10,1.11,Yes,0,256,0,0,71874.72
Notebook,15.6,1366x768,Intel Pentium,4,Windows 10,2.4,No,500,0,0,0,20246.4
Gaming,15.6,1920x1080,Intel i7,16,Windows 10,2.5,No,1000,256,0,0,95850.72
Ultrabook,14.0,1920x1080,Intel i7,8,Windows 10,1.48,No,0,512,0,0,111301.92
Gaming,15.6,1920x1080,Intel i7,8,Windows 10,2.7,No,1000,128,0,0,67132.8
Notebook,13.3,1920x1080,Intel i5,8,Windows 10,1.34,No,0,256,0,0,63349.92
Notebook,15.6,1366x768,Intel i3,4,Windows 10,2.18,No,0,128,0,0,29144.16
Notebook,14.0,1366x768,Intel i5,4,Windows 10,1.64,No,500,0,0,0,41505.12
Notebook,13.3,1920x1080,Intel i5,4,Windows 10,1.2,No,0,128,0,0,63669.6
Notebook,14.0,1366x768,Intel i5,4,Windows 10,1.48,No,0,256,0,0,58607.46719999999
Notebook,14.0,1920x1080,Intel i5,4,Windows 10,1.95,No,0,256,0,0,64202.4
Ultrabook,14.0,1920x1080,Intel i7,8,Windows 7,1.43,No,0,256,0,0,77202.72
Notebook,14.0,1920x1080,Intel i5,8,Windows 10,1.64,No,0,256,0,0,55904.5728
Notebook,14.0,1366x768,Intel i3,4,Windows 10,1.64,No,500,0,0,0,36443.52
Gaming,15.6,1920x1080,Intel i5,8,Windows 10,2.65,No,0,0,1000,0,50562.72
Ultrabook,12.5,1920x1080,Intel i5,4,Windows 10,1.26,No,500,0,0,0,81997.92
Notebook,14.0,1920x1080,Intel i5,4,Windows 10,1.48,No,0,256,0,0,84715.2
Ultrabook,14.0,1920x1080,Intel i7,8,Windows 10,1.54,No,0,256,0,0,100550.5488
Notebook,13.3,1366x768,Intel i3,4,Windows 10,1.49,No,500,0,0,0,42624.0
Notebook,13.3,1366x768,Intel i5,8,Windows 10,1.5,No,0,256,0,0,64468.8
Notebook,15.6,1366x768,Intel i3,4,Windows 10,2.04,No,0,256,0,0,41025.0672
Notebook,17.3,3840x2160,Intel i7,16,Windows 7,2.4,No,0,512,0,0,158135.04
Notebook,14.0,1920x1080,Intel i5,8,Windows 10,1.47,No,0,256,0,0,79387.2
Notebook,14.0,1920x1080,Intel i7,8,Windows 10,1.43,No,0,256,0,0,118761.12
2 in 1 Convertible,15.6,1920x1080,Intel i3,4,Windows 10,2.08,Yes,1000,0,0,0,42410.3472
Ultrabook,13.3,1920x1080,Intel i5,8,Windows 10,1.2,No,0,256,0,0,84715.2
Notebook,13.3,1920x1080,Intel i5,8,Windows 10,1.11,No,0,256,0,0,61218.72
Notebook,14.0,1920x1080,Intel i7,8,Windows 10,1.64,No,0,256,0,0,63159.7104
Notebook,15.6,1920x1080,Intel i5,8,Windows 10,2.09,No,500,0,0,0,55754.3232
Ultrabook,12.5,1366x768,Intel i5,4,Windows 10,1.26,No,0,256,0,0,83063.52
Notebook,14.0,1366x768,Intel i5,4,Windows 10,2.31,No,500,0,0,0,63349.92
Notebook,14.0,1366x768,Intel i5,4,Windows 10,1.95,No,500,0,0,0,56476.8
Ultrabook,13.3,3200x1800,Intel i5,8,Windows 10,1.29,Yes,0,256,0,0,86526.72
Notebook,17.3,1920x1080,Intel i5,8,Windows 10,2.63,No,0,256,0,0,57542.4
Notebook,14.0,1366x768,Intel i5,4,Windows 10,1.64,No,0,256,0,0,51841.44
Notebook,15.6,1366x768,AMD A9,6,Windows 10,2.1,No,1000,0,0,0,21791.52
Gaming,17.3,1920x1080,Intel i7,8,Windows 10,2.7,No,1000,128,0,0,63499.10399999999
Notebook,14.0,1920x1080,Intel i5,8,Windows 7,1.95,No,0,256,0,0,63669.6
Notebook,15.6,1920x1080,Intel i7,8,Windows 10,1.84,No,0,256,0,0,65480.5872
Ultrabook,12.5,1920x1080,Intel i7,8,Windows 10,1.26,No,0,256,0,0,71874.72
Notebook,15.6,1366x768,Intel i5,4,Windows 10,2.04,No,500,0,0,0,39533.76
Ultrabook,14.0,1920x1080,Intel i7,8,Windows 10,1.47,No,0,256,0,0,91908.0
Notebook,15.6,1920x1080,Intel i5,8,Windows 7,2.09,No,0,256,0,0,56633.976
Notebook,14.0,1920x1080,Intel i5,8,Windows 10,1.64,No,0,256,0,0,53839.9728
2 in 1 Convertible,15.6,1920x1080,Intel i7,4,Windows 10,1.8,Yes,0,256,0,0,45128.16
Notebook,14.0,1366x768,Intel Atom,2,Windows 10,1.45,No,0,0,0,32,11231.424
Notebook,15.6,1920x1080,Intel i7,16,Windows 10,2.4,No,0,256,0,0,75924.0
Notebook,15.6,1920x1080,Intel i5,8,Windows 10,2.3,No,0,256,0,0,55922.688
Notebook,14.0,1920x1080,Intel i5,4,Windows 10,1.54,No,500,0,0,0,53280.0
Notebook,15.6,1920x1080,Intel i5,8,Windows 10,1.84,No,500,256,0,0,112065.9552
Notebook,14.0,1920x1080,Intel i5,8,Windows 7,1.43,No,0,256,0,0,78268.31999999999
Gaming,17.3,1920x1080,Intel i7,16,Windows 10,3.78,No,1000,256,0,0,82351.6992
Gaming,17.3,1920x1080,Intel i7,16,Windows 10,4.6,No,1000,128,0,0,122010.66719999998
Netbook,11.6,1366x768,Intel Celeron,4,Chrome OS,1.2,No,0,0,0,16,15339.311999999998
Notebook,14.0,2560x1440,Intel i7,16,Windows 7,1.1,No,0,256,0,0,139593.6
Notebook,15.6,1920x1080,Intel i7,8,Windows 10,1.91,No,1000,0,0,0,52161.12
2 in 1 Convertible,15.6,1920x1080,Intel i5,8,Windows 10,2.3,Yes,0,256,0,0,58288.32
Notebook,15.6,1366x768,Intel i5,4,Windows 10,2.04,No,0,256,0,0,52161.12
Ultrabook,13.3,3200x1800,Intel i7,16,Windows 10,1.2,Yes,0,1000,0,0,120093.12
Notebook,15.6,1366x768,Intel i3,4,Windows 10,2.31,No,500,0,0,0,37570.392
Notebook,15.6,1366x768,Intel i5,4,No OS,1.96,No,500,0,0,0,26586.72
Notebook,15.6,1366x768,AMD A8,8,Windows 10,2.4,No,1000,0,0,0,23922.72
2 in 1 Convertible,13.3,1920x1080,Intel i7,12,Windows 10,1.6,Yes,0,256,0,0,69210.72
Gaming,15.6,1920x1080,Intel i7,16,Windows 10,2.94,No,1000,256,0,0,96916.32
Notebook,15.6,1920x1080,Intel i7,8,Windows 10,2.04,No,0,256,0,0,57009.6
Gaming,17.3,1920x1080,Intel i7,16,No OS,4.0,No,1000,0,0,0,53173.44
Notebook,15.6,1920x1080,Intel i5,4,Windows 10,2.25,No,1000,0,0,0,29783.52
Notebook,15.6,1920x1080,Intel i7,16,Windows 10,2.32,No,2000,0,0,0,52746.6672
Gaming,15.6,1920x1080,Intel i7,16,Windows 10,1.8,No,1000,256,0,0,102777.12
Ultrabook,13.3,1920x1080,Intel i7,8,Windows 10,1.29,No,0,256,0,0,77682.23999999999
Gaming,17.3,1920x1080,Intel i7,64,Windows 10,3.58,No,0,1000,0,0,211788.0
2 in 1 Convertible,13.3,1920x1080,Intel i7,8,Windows 10,1.62,Yes,0,256,0,0,42517.9728
Gaming,15.6,3840x2160,Intel i7,16,Windows 10,3.21,No,1000,256,0,0,70809.12
Ultrabook,12.0,2304x1440,Intel M ,8,Mac OS X,0.92,No,0,0,0,256,69264.0
Notebook,15.6,1366x768,Intel i3,4,Windows 10,2.06,No,500,0,0,0,25679.8944
Notebook,15.6,1366x768,Intel i5,4,Windows 10,2.31,No,500,0,0,0,63882.72
Ultrabook,12.5,1920x1080,Intel i5,8,Windows 7,1.26,No,0,256,0,0,63882.72
Notebook,13.3,1920x1080,Intel i7,8,Windows 10,1.49,No,0,256,0,0,58075.2
Ultrabook,12.5,1920x1080,Intel i7,8,Windows 10,1.3,Yes,0,256,0,0,91294.7472
Notebook,17.3,1600x900,Intel i5,8,Windows 10,3.0,No,1000,0,0,0,35111.52
Notebook,15.6,1920x1080,Intel i5,4,Windows 10,2.3,No,1000,0,0,0,52054.56
Gaming,17.3,1920x1080,Intel i7,16,Windows 10,3.78,No,1000,256,0,0,133146.72
Notebook,15.6,1366x768,Intel i5,4,Windows 10,2.1,No,500,0,0,0,28771.2
Notebook,15.6,1920x1080,Intel i5,4,Windows 7,2.31,No,500,0,0,0,50083.2
Ultrabook,12.5,2560x1440,Intel M ,8,Windows 10,0.99,Yes,0,512,0,0,74538.72
Gaming,17.3,1920x1080,Intel i7,32,Windows 10,4.6,No,0,512,1000,0,172627.19999999998
2 in 1 Convertible,10.1,1920x1200,Intel Atom,4,Windows 10,0.69,Yes,0,0,0,64,34433.2656
Ultrabook,13.3,3840x2160,Intel i7,16,Windows 10,1.3,No,0,512,0,0,109170.72
Notebook,15.6,1920x1080,Intel i5,8,Windows 10,2.18,No,0,256,0,0,39960.0
Notebook,14.0,1920x1080,Intel i5,4,Windows 7,1.54,No,500,0,0,0,54931.14719999999
Workstation,15.6,1920x1080,Intel i7,8,Windows 7,1.9,No,0,256,0,0,79653.59999999999
Notebook,14.0,1920x1080,Intel i5,8,Windows 7,1.7,No,0,180,0,0,63882.72
Notebook,13.3,3200x1800,Intel Pentium,4,Chrome OS,1.29,No,0,0,0,32,32767.2
Notebook,15.6,1366x768,AMD A8,4,Windows 10,2.4,No,500,0,0,0,20619.36
Notebook,15.6,1366x768,Intel Pentium,4,Linux,2.2,No,500,0,0,0,20965.1472
Notebook,15.6,1366x768,Intel i3,4,No OS,1.86,No,1000,0,0,0,18434.3472
Gaming,17.3,1920x1080,Intel i7,8,Windows 10,2.7,No,1000,256,0,0,85194.72
Ultrabook,13.3,1920x1080,Intel i5,4,Windows 10,1.4,No,0,256,0,0,43601.688
Netbook,12.5,1366x768,Intel i5,4,Windows 7,2.4,No,0,128,0,0,85194.72
Notebook,15.6,1920x1080,Intel i5,8,Windows 10,2.4,No,1000,256,0,0,42570.72
Notebook,15.6,1920x1080,Intel i5,8,Windows 10,2.36,No,1000,0,0,0,34035.264
Gaming,17.3,1920x1080,Intel i7,8,Windows 10,2.6,No,0,256,0,0,85194.72
Notebook,15.6,1366x768,Intel Pentium,4,Windows 10,1.96,No,1000,0,0,0,26640.0
Gaming,17.3,1920x1080,Intel i7,16,Windows 10,4.3,No,1000,128,0,0,122490.72
Ultrabook,12.5,1366x768,Intel i3,4,Windows 7,1.5,No,500,0,0,0,60480.792
Ultrabook,12.5,1366x768,Intel i3,4,Windows 7,1.5,No,0,128,0,0,62176.1616
Notebook,15.6,1366x768,Intel Celeron,4,Chrome OS,2.2,No,0,16,0,0,11135.52
Workstation,17.3,1920x1080,Intel i7,8,Windows 7,3.0,No,1000,0,0,0,154458.72
Gaming,15.6,1920x1080,Intel i7,16,Windows 10,2.4,No,0,512,0,0,63882.72
Ultrabook,12.5,1366x768,Intel i5,8,Windows 7,1.5,No,0,256,0,0,75289.968
Gaming,17.3,1920x1080,Intel i7,8,Windows 10,2.9,No,1000,128,0,0,80516.20319999999
2 in 1 Convertible,15.6,1920x1080,Intel i5,4,Windows 10,2.1,Yes,0,256,0,0,46193.76
Notebook,15.6,1920x1080,AMD A6,4,Windows 10,2.1,No,1000,0,0,0,21205.44
Gaming,15.6,1920x1080,Intel i7,16,Windows 10,2.59,No,1000,128,0,0,71341.92
Notebook,13.3,3200x1800,Intel M ,8,Windows 10,1.16,Yes,0,256,0,0,90522.72
Notebook,15.6,1366x768,Intel i5,4,Windows 7,2.24,No,500,0,0,0,40980.312
Notebook,15.6,1366x768,Intel i3,4,Windows 10,2.1,No,0,128,0,0,22857.12
Ultrabook,13.3,1920x1080,Intel i7,8,Windows 10,1.16,No,0,512,0,0,104908.32
2 in 1 Convertible,10.1,1920x1200,Intel Atom,4,Android,0.69,Yes,0,0,0,64,29250.72
Ultrabook,13.3,1920x1080,Intel i7,8,Windows 10,1.23,No,0,256,0,0,73473.12
Gaming,17.3,1920x1080,Intel i7,16,Windows 10,4.6,No,0,256,1000,0,146519.46719999998
Ultrabook,12.5,3840x2160,Intel i7,8,Windows 10,1.25,Yes,0,256,0,0,54825.12
Ultrabook,13.3,1920x1080,Intel i7,16,Windows 10,1.05,No,0,512,0,0,118601.28
Gaming,17.3,1920x1080,Intel i7,8,Windows 10,3.52,No,1000,128,0,0,69929.4672
Notebook,13.3,1920x1080,Intel Atom,4,Windows 10,1.35,No,0,0,0,32,10442.88
Notebook,13.3,1920x1080,Intel i5,8,Windows 10,1.16,No,0,256,0,0,90043.2
Notebook,14.0,1920x1080,Intel i5,8,Windows 7,1.43,No,0,256,0,0,80612.64
Notebook,15.6,1366x768,Intel i5,4,Linux,2.09,No,500,0,0,0,27899.0064
Notebook,15.6,1366x768,Intel i3,4,Windows 10,2.0,No,1000,0,0,0,23176.8
2 in 1 Convertible,14.0,1920x1080,Intel i7,8,Windows 10,1.8,Yes,0,256,0,0,88924.31999999999
2 in 1 Convertible,10.1,1920x1200,Intel Atom,4,Windows 10,0.69,Yes,0,0,0,64,25521.12
Ultrabook,12.5,1366x768,Intel i5,8,Windows 7,1.26,No,0,256,0,0,100965.6
Gaming,15.6,1920x1080,Intel i5,8,No OS,2.4,No,1000,128,0,0,52693.92
Gaming,17.3,1920x1080,Intel i5,8,Windows 10,3.35,No,1000,128,0,0,60153.12
Notebook,15.6,1366x768,Intel i7,8,Windows 10,2.04,No,2000,0,0,0,33513.119999999995
2 in 1 Convertible,14.0,1920x1080,Intel i7,8,Windows 7,1.8,Yes,0,512,0,0,109244.2464
Notebook,14.0,1366x768,Intel Celeron,4,Windows 10,1.5,No,0,0,0,32,14811.84
Ultrabook,15.6,1920x1080,Intel i7,8,Windows 10,1.84,No,0,256,0,0,40066.56
Notebook,15.6,1920x1080,Intel i5,4,Windows 10,2.23,No,1000,0,0,0,32820.48
Notebook,15.6,1920x1080,Intel i7,16,Windows 10,2.5,No,0,0,1000,0,58554.72
Workstation,17.3,1920x1080,Intel i7,8,Windows 7,3.0,No,0,256,0,0,210424.032
Notebook,15.6,1366x768,Intel i5,8,Windows 10,2.5,No,1000,0,0,0,41771.52
Gaming,17.3,1920x1080,Intel i7,16,Windows 10,3.78,No,1000,256,0,0,127818.72
Ultrabook,15.6,1920x1080,Intel i7,8,Windows 7,1.88,No,0,256,0,0,115709.2416
2 in 1 Convertible,14.0,2560x1440,Intel i7,16,Windows 10,2.8,Yes,0,512,0,0,130003.2
Gaming,15.6,1920x1080,Intel i7,8,Windows 10,2.4,No,1000,128,0,0,60888.384
2 in 1 Convertible,13.3,1920x1080,Intel i5,8,Windows 10,1.48,Yes,0,256,0,0,86793.12
Workstation,15.6,1920x1080,Intel i7,8,Windows 7,2.59,No,0,256,0,0,118761.12
2 in 1 Convertible,13.3,2560x1440,Intel i7,8,Windows 10,1.48,Yes,0,256,0,0,95850.72
Workstation,15.6,1920x1080,Intel i7,8,Windows 7,2.0,No,0,256,0,0,101178.72
Ultrabook,12.5,1920x1080,Intel i7,8,Windows 7,1.26,No,0,256,0,0,122381.49599999998
Notebook,15.6,1920x1080,Intel i7,8,Windows 10,2.18,No,0,256,0,0,53807.472
Notebook,15.6,1920x1080,Intel i5,8,Windows 7,1.88,No,0,256,0,0,84129.12
2 in 1 Convertible,14.0,2560x1440,Intel i7,8,Windows 10,1.27,Yes,0,256,0,0,124621.92
Notebook,15.6,1366x768,Intel i3,4,No OS,1.9,No,1000,0,0,0,18061.92
Notebook,15.6,1366x768,AMD E,4,Windows 10,1.86,No,500,0,0,0,15824.16
Notebook,15.6,1920x1080,Intel i5,8,No OS,2.32,No,1000,0,0,0,31914.72
Gaming,15.6,1920x1080,Intel i7,8,Windows 10,2.62,No,1000,0,0,0,63882.72
Notebook,15.6,3840x2160,Intel i5,8,Windows 10,2.04,Yes,0,256,0,0,119916.2304
Notebook,15.6,1920x1080,AMD A6,4,Windows 10,1.91,No,0,256,0,0,25515.2592
Gaming,17.3,1920x1080,Intel i7,16,Windows 10,2.7,No,1000,256,0,0,79536.38399999999
Ultrabook,14.0,1920x1080,Intel i7,12,Windows 7,1.4,No,0,512,0,0,122490.72
Notebook,15.6,1920x1080,Intel i5,8,Windows 10,2.5,No,0,0,1000,0,42010.7472
2 in 1 Convertible,13.3,2560x1440,Intel i7,8,Windows 10,1.48,Yes,0,512,0,0,108744.48
Ultrabook,14.0,1920x1080,Intel i7,8,Windows 7,1.7,No,0,256,0,0,79866.72
Gaming,14.0,1920x1080,Intel i7,16,Windows 10,1.7,No,1000,256,0,0,94252.32
Gaming,15.6,1920x1080,Intel i7,8,Windows 10,2.62,No,1000,0,0,0,47898.72
Notebook,15.6,1366x768,Intel i3,8,Windows 10,2.2,No,1000,0,0,0,24455.52
Notebook,15.6,1366x768,Intel i5,4,No OS,2.1,No,500,0,0,0,25414.0272
Gaming,15.6,3840x2160,Intel i7,8,Windows 10,2.62,No,1000,128,0,0,79813.44
Notebook,15.6,1920x1080,Intel i5,8,Windows 10,1.95,No,0,256,0,0,74059.2
Notebook,15.6,1920x1080,Intel i3,4,Windows 10,2.2,No,1000,0,0,0,24935.04
Notebook,14.0,1366x768,Intel Celeron,2,Windows 10,1.44,No,0,0,0,32,13266.72
Gaming,15.6,1920x1080,Intel i7,8,Windows 10,2.2,No,1000,0,0,0,44701.92
Notebook,15.6,1920x1080,Intel i7,8,Windows 10,1.96,No,0,256,0,0,36177.12
Notebook,15.6,1920x1080,Intel i7,16,Windows 10,2.1,No,0,512,0,0,61751.52
Notebook,15.6,1366x768,Intel Celeron,4,Windows 10,2.2,No,500,0,0,0,19660.32
Notebook,15.6,1366x768,Intel i5,4,No OS,2.1,No,500,0,0,0,21205.44
Notebook,15.6,1920x1080,Intel i7,8,No OS,2.2,No,1000,0,0,0,37775.52
Notebook,14.0,1920x1080,Intel i3,4,Windows 10,2.0,No,0,256,0,0,40972.32
Notebook,15.6,1920x1080,Intel i7,4,Windows 7,2.32,No,0,0,1000,0,43956.0
Gaming,15.6,1920x1080,Intel i7,16,Windows 10,3.31,No,0,512,0,0,69530.4
Gaming,15.6,1920x1080,Intel i7,16,Windows 10,1.91,No,1000,128,0,0,114731.5536
Notebook,15.6,1366x768,Intel i3,4,Windows 10,2.07,No,500,0,0,0,34632.0
2 in 1 Convertible,14.0,2560x1440,Intel i5,8,Windows 10,1.36,Yes,0,256,0,0,87219.36
Ultrabook,15.6,1920x1080,Intel i7,6,Windows 10,1.54,No,0,256,0,0,44275.68
Notebook,15.6,1920x1080,Intel i7,8,Linux,1.98,No,0,256,0,0,47686.1328
Notebook,15.6,1366x768,Intel Celeron,4,Windows 10,2.1,No,500,0,0,0,17742.239999999998
Notebook,15.6,1920x1080,Intel i7,6,Windows 10,2.18,No,1000,0,0,0,42570.72
Gaming,15.6,1920x1080,Intel i7,8,Windows 10,2.59,No,1000,256,0,0,48431.52
2 in 1 Convertible,15.6,1920x1080,Intel i7,16,Windows 10,2.09,Yes,0,512,0,0,62817.12
Notebook,15.6,1920x1080,Intel i5,4,Windows 10,2.23,No,0,256,0,0,36816.48
Ultrabook,13.3,3200x1800,Intel i5,8,Linux,1.23,Yes,0,256,0,0,58554.72
Gaming,17.3,1920x1080,Intel i7,16,Windows 10,4.2,No,1000,256,0,0,138474.72
Gaming,15.6,1920x1080,Intel i5,8,Windows 10,2.4,No,1000,0,0,0,43636.32
2 in 1 Convertible,12.3,2400x1600,Samsung,4,Chrome OS,1.15,Yes,0,0,0,32,35111.52
Notebook,15.6,1366x768,Intel i5,4,Windows 10,1.86,No,500,0,0,0,25840.8
Ultrabook,12.0,2304x1440,Intel M ,8,Mac OS X,0.92,No,0,0,0,256,61964.64
2 in 1 Convertible,13.3,1920x1080,Intel i5,8,Windows 10,1.6,Yes,0,256,0,0,63882.72
Notebook,15.6,1920x1080,Intel i7,12,Windows 10,2.21,No,1000,128,0,0,70702.56
Notebook,15.6,1366x768,Intel i3,4,No OS,1.9,No,1000,0,0,0,19607.04
Gaming,17.3,1920x1080,Intel i7,16,Windows 10,4.3,No,1000,512,0,0,114552.0
Notebook,15.6,1366x768,Intel Celeron,4,Linux,2.1,No,1000,0,0,0,14492.16
Gaming,17.3,1920x1080,Intel i7,16,Windows 10,2.43,No,1000,256,0,0,109165.392
Notebook,15.6,1366x768,Intel i3,4,Windows 10,2.3,No,0,128,0,0,26586.72
Notebook,15.6,1366x768,Intel i7,8,No OS,2.2,No,500,0,0,0,33513.119999999995
2 in 1 Convertible,15.6,1920x1080,Intel i7,16,Windows 10,2.0,Yes,0,512,0,0,68464.8
Ultrabook,13.3,3200x1800,Intel i7,16,Windows 10,1.2,Yes,0,512,0,0,142790.4
Gaming,15.6,1920x1080,Intel i7,8,Windows 10,2.2,No,1000,0,0,0,62284.32
Notebook,15.6,1920x1080,Intel i5,8,Windows 10,2.36,No,0,256,0,0,47365.92
Notebook,15.6,1366x768,Intel i5,8,Windows 10,1.91,No,0,256,0,0,30849.12
Notebook,15.6,1366x768,AMD E,4,Windows 10,2.2,No,500,0,0,0,15930.72
Notebook,17.3,1600x900,Intel i3,8,Windows 10,3.3,No,1000,0,0,0,33513.119999999995
Gaming,15.6,1920x1080,Intel i7,16,Windows 10,2.2,No,1000,256,0,0,130482.72
Ultrabook,12.0,2304x1440,Intel M ,8,Mac OS X,0.92,No,0,0,0,512,68145.12
Notebook,15.6,1920x1080,Intel i7,16,Windows 10,2.2,No,1000,128,0,0,93186.72
Gaming,17.3,1920x1080,Intel i7,16,Windows 10,2.43,No,1000,256,0,0,103842.1872
2 in 1 Convertible,15.6,1920x1080,Intel i5,8,Windows 10,2.19,Yes,0,256,0,0,53226.72
Gaming,17.3,1920x1080,Intel i7,16,Windows 10,2.9,No,1000,256,0,0,103842.72
Netbook,11.6,1366x768,Intel Celeron,2,Chrome OS,1.3,No,0,32,0,0,9270.72
Notebook,17.3,1600x900,Intel i3,4,Windows 10,3.3,No,1000,0,0,0,31861.44
Notebook,17.3,1600x900,Intel i5,8,No OS,2.8,No,1000,0,0,0,28717.92
Gaming,15.6,1920x1080,Intel i7,8,Windows 10,2.6,No,1000,128,0,0,67772.16
2 in 1 Convertible,14.0,1920x1080,Intel i7,8,Windows 10,1.2,Yes,0,256,0,0,61218.72
Notebook,15.6,1920x1080,Intel i7,8,Windows 10,2.3,No,0,256,0,0,81465.12
Gaming,15.6,1920x1080,Intel i7,8,Windows 10,2.2,No,1000,128,0,0,78647.1408
Notebook,15.6,1920x1080,AMD A12,6,Windows 10,2.1,No,1000,0,0,0,28185.12
Ultrabook,12.5,1920x1080,Intel i5,8,Windows 7,1.26,Yes,0,256,0,0,91288.3536
2 in 1 Convertible,15.0,1920x1080,Intel i3,4,Windows 10,2.08,Yes,500,0,0,0,27119.52
Notebook,15.6,1366x768,Intel Pentium,4,Windows 10,2.65,No,1000,0,0,0,16463.52
Ultrabook,13.3,3200x1800,Intel i7,8,Windows 10,1.29,Yes,0,256,0,0,78694.56
Notebook,15.6,1366x768,Intel i5,4,Linux,2.18,No,1000,0,0,0,27804.7008
Gaming,15.6,1920x1080,Intel i7,16,Windows 10,2.6,Yes,1000,128,0,0,54825.12
Gaming,15.6,1920x1080,Intel i7,8,Windows 10,2.2,No,1000,128,0,0,61218.72
Netbook,12.5,1920x1080,Intel i7,16,Windows 10,1.3,Yes,0,512,0,0,87912.0
Gaming,14.0,1920x1080,Intel i7,16,Windows 10,1.95,No,0,1000,0,0,186426.72
Notebook,15.6,1366x768,Intel i3,8,Windows 10,2.3,Yes,1000,0,0,0,24988.8528
Gaming,17.3,1920x1080,Intel i7,16,Windows 10,2.7,No,1000,256,0,0,85141.44
Ultrabook,11.6,1366x768,Intel i5,4,Mac OS X,1.08,No,0,0,0,256,51095.52
Notebook,15.6,1920x1080,Intel i3,4,Windows 10,2.1,No,1000,0,0,0,25467.84
Ultrabook,14.0,2560x1440,Intel i7,8,Windows 7,1.54,No,0,256,0,0,117119.5632
Notebook,15.6,1366x768,Intel i5,4,Windows 7,2.24,No,500,0,0,0,39267.36
Gaming,15.6,1920x1080,Intel i7,8,Windows 10,2.3,No,1000,128,0,0,62284.32
Notebook,13.3,1920x1080,Intel i7,16,Windows 10,1.4,No,0,512,0,0,79866.72
Notebook,15.6,1920x1080,AMD A12,6,Windows 10,2.2,No,0,256,0,0,31838.5296
Ultrabook,13.3,1920x1080,Intel i7,8,Windows 10,1.45,No,0,256,0,0,68198.4
Notebook,15.6,1366x768,Intel i3,4,Linux,2.4,No,500,0,0,0,19276.704
2 in 1 Convertible,17.3,1920x1080,Intel i7,16,Windows 10,2.77,Yes,0,512,0,0,95850.72
Notebook,14.0,1920x1080,Intel i5,4,Windows 7,1.54,No,0,256,0,0,58607.46719999999
Gaming,15.6,1920x1080,Intel i7,16,Windows 10,2.5,No,1000,256,0,0,85248.0
Notebook,14.0,1366x768,Intel i5,4,Windows 10,1.6,No,500,0,0,0,46620.0
Gaming,15.6,1920x1080,Intel i7,16,Windows 10,2.34,No,1000,256,0,0,123876.0
Notebook,15.6,1920x1080,Intel i5,8,No OS,2.3,No,0,256,0,0,30529.44
2 in 1 Convertible,13.3,3200x1800,Intel i5,8,Windows 10,1.24,Yes,0,256,0,0,96596.64
Notebook,15.6,1366x768,Intel Pentium,4,Linux,2.2,No,500,0,0,0,17262.72
Notebook,15.6,1366x768,AMD A6,4,Windows 10,1.86,No,500,0,0,0,21258.72
Notebook,15.6,1920x1080,Intel i3,6,Windows 10,2.4,No,0,128,0,0,30316.32
Notebook,14.0,1920x1080,Intel i5,8,Windows 10,1.9,No,0,256,0,0,57116.16
Notebook,15.6,1366x768,Intel Pentium,4,Windows 10,2.2,No,500,0,0,0,23655.7872
Notebook,15.6,1366x768,Intel Celeron,4,Windows 10,2.0,No,1000,0,0,0,18061.92
Gaming,17.3,1920x1080,Intel i7,16,Windows 10,4.0,No,1000,128,0,0,101232.0
Notebook,15.6,1366x768,Intel i3,4,Windows 10,2.29,No,500,0,0,0,26107.2
Notebook,15.6,1920x1080,Intel i7,8,Windows 7,2.32,No,0,0,1000,0,47685.6
Gaming,15.6,1920x1080,Intel i7,8,Windows 10,2.4,No,1000,128,0,0,65481.12
2 in 1 Convertible,14.0,1920x1080,Intel i5,4,Windows 10,1.8,Yes,0,128,0,0,44382.7728
Ultrabook,13.3,1920x1080,Intel M ,8,Windows 10,1.2,No,0,512,0,0,38841.12
Notebook,15.6,1366x768,Intel i3,6,Windows 10,2.3,No,1000,0,0,0,24455.52
Notebook,15.6,1366x768,Intel Celeron,4,Linux,2.4,No,500,0,0,0,15397.92
Notebook,15.6,1366x768,Intel Celeron,2,Windows 10,2.2,No,500,0,0,0,20193.12
Notebook,15.6,1920x1080,Intel i7,8,Windows 10,2.6,No,1000,0,0,0,47898.72
Notebook,15.6,1920x1080,AMD A9,6,Windows 10,2.04,No,0,0,1000,0,29303.4672
Notebook,15.6,1366x768,Intel i7,8,Linux,2.3,No,1000,0,0,0,42943.1472
Netbook,11.6,1366x768,Intel Celeron,2,Windows 10,1.17,No,0,0,0,32,11135.52
Notebook,15.6,1366x768,Intel i7,4,Windows 10,2.2,No,500,0,0,0,38378.6496
2 in 1 Convertible,14.0,1920x1080,Intel i7,4,Windows 10,1.8,Yes,0,128,0,0,33992.64
2 in 1 Convertible,13.3,3200x1800,Intel i7,16,Windows 10,1.3,Yes,0,512,0,0,79866.72
Notebook,14.0,1366x768,Intel Celeron,2,Windows 10,1.5,No,0,0,0,64,12201.12
Notebook,15.6,1366x768,Intel i7,6,Windows 10,2.19,No,1000,0,0,0,40705.92
Notebook,15.6,1366x768,Intel Celeron,4,Windows 10,2.2,No,500,0,0,0,19660.32
Ultrabook,13.3,1920x1080,Intel M ,8,Windows 10,1.2,No,0,512,0,0,38841.12
Notebook,15.6,1366x768,Intel i3,6,Windows 10,2.3,No,1000,0,0,0,24455.52
Notebook,15.6,1366x768,Intel Celeron,4,Linux,2.4,No,500,0,0,0,15397.92
Notebook,15.6,1366x768,Intel Celeron,2,Windows 10,2.2,No,500,0,0,0,20193.12
Notebook,15.6,1920x1080,Intel i7,8,Windows 10,2.6,No,1000,0,0,0,47898.72
Notebook,15.6,1920x1080,AMD A9,6,Windows 10,2.04,No,0,0,1000,0,29303.4672
Notebook,15.6,1366x768,Intel i7,8,Linux,2.3,No,1000,0,0,0,42943.1472
Netbook,11.6,1366x768,Intel Celeron,2,Windows 10,1.17,No,0,0,0,32,11135.52
Notebook,15.6,1366x768,Intel i7,4,Windows 10,2.2,No,500,0,0,0,38378.6496
2 in 1 Convertible,14.0,1920x1080,Intel i7,4,Windows 10,1.8,Yes,0,128,0,0,33992.64
2 in 1 Convertible,13.3,3200x1800,Intel i7,16,Windows 10,1.3,Yes,0,512,0,0,79866.72
Notebook,14.0,1366x768,Intel Celeron,2,Windows 10,1.5,No,0,0,0,64,12201.12
Notebook,15.6,1366x768,Intel i7,6,Windows 10,2.19,No,1000,0,0,0,40705.92
Notebook,15.6,1366x768,Intel Celeron,4,Windows 10,2.2,No,500,0,0,0,19660.32
Ultrabook,13.3,1920x1080,Intel M ,8,Windows 10,1.2,No,0,512,0,0,38841.12
Notebook,15.6,1366x768,Intel i3,6,Windows 10,2.3,No,1000,0,0,0,24455.52
Notebook,15.6,1366x768,Intel Celeron,4,Linux,2.4,No,500,0,0,0,15397.92
Notebook,15.6,1366x768,Intel Celeron,2,Windows 10,2.2,No,500,0,0,0,20193.12
Notebook,15.6,1920x1080,Intel i7,8,Windows 10,2.6,No,1000,0,0,0,47898.72
Notebook,15.6,1920x1080,AMD A9,6,Windows 10,2.04,No,0,0,1000,0,29303.4672
Notebook,15.6,1366x768,Intel i7,8,Linux,2.3,No,1000,0,0,0,42943.1472
Netbook,11.6,1366x768,Intel Celeron,2,Windows 10,1.17,No,0,0,0,32,11135.52
Notebook,15.6,1366x768,Intel i7,4,Windows 10,2.2,No,500,0,0,0,38378.6496
2 in 1 Convertible,14.0,1920x1080,Intel i7,4,Windows 10,1.8,Yes,0,128,0,0,33992.64
2 in 1 Convertible,13.3,3200x1800,Intel i7,16,Windows 10,1.3,Yes,0,512,0,0,79866.72
Notebook,14.0,1366x768,Intel Celeron,2,Windows 10,1.5,No,0,0,0,64,12201.12
Notebook,15.6,1366x768,Intel i7,6,Windows 10,2.19,No,1000,0,0,0,40705.92
Notebook,15.6,1366x768,Intel Celeron,4,Windows 10,2.2,No,500,0,0,0,19660.32
