,x0_No,x0_Yes,x1_Female,x1_Male,x2_No,x2_Yes,Dependents,Education,Property_Area,Loan_Status
0,1.0,0.0,0.0,1.0,1.0,0.0,0.0,0.0,2.0,Y
1,0.0,1.0,0.0,1.0,1.0,0.0,1.0,0.0,0.0,N
2,0.0,1.0,0.0,1.0,0.0,1.0,0.0,0.0,2.0,Y
3,0.0,1.0,0.0,1.0,1.0,0.0,0.0,1.0,2.0,Y
4,1.0,0.0,0.0,1.0,1.0,0.0,0.0,0.0,2.0,Y
5,0.0,1.0,0.0,1.0,0.0,1.0,2.0,0.0,2.0,Y
6,0.0,1.0,0.0,1.0,1.0,0.0,0.0,1.0,2.0,Y
7,0.0,1.0,0.0,1.0,1.0,0.0,3.0,0.0,1.0,N
8,0.0,1.0,0.0,1.0,1.0,0.0,2.0,0.0,2.0,Y
9,0.0,1.0,0.0,1.0,1.0,0.0,2.0,0.0,2.0,Y
10,0.0,1.0,0.0,1.0,1.0,0.0,2.0,0.0,2.0,Y
11,0.0,1.0,0.0,1.0,1.0,0.0,2.0,0.0,2.0,Y
12,1.0,0.0,0.0,1.0,1.0,0.0,0.0,0.0,0.0,N
13,0.0,1.0,0.0,1.0,1.0,0.0,2.0,0.0,2.0,Y
14,1.0,0.0,0.0,1.0,1.0,0.0,0.0,0.0,2.0,Y
15,1.0,0.0,0.0,1.0,1.0,0.0,1.0,1.0,2.0,Y
16,1.0,0.0,1.0,0.0,1.0,0.0,0.0,0.0,2.0,N
17,0.0,1.0,0.0,1.0,1.0,0.0,0.0,1.0,0.0,N
18,0.0,1.0,0.0,1.0,1.0,0.0,0.0,0.0,2.0,Y
19,0.0,1.0,0.0,1.0,1.0,0.0,0.0,1.0,2.0,N
20,0.0,1.0,0.0,1.0,1.0,0.0,1.0,0.0,2.0,Y
21,0.0,1.0,0.0,1.0,1.0,0.0,0.0,1.0,1.0,N
22,0.0,1.0,0.0,1.0,1.0,0.0,2.0,1.0,0.0,N
23,0.0,1.0,0.0,1.0,1.0,0.0,1.0,0.0,1.0,N
24,0.0,1.0,0.0,1.0,0.0,1.0,0.0,0.0,1.0,Y
25,0.0,1.0,0.0,1.0,1.0,0.0,0.0,0.0,1.0,Y
26,0.0,1.0,0.0,1.0,1.0,0.0,2.0,1.0,2.0,Y
27,1.0,0.0,0.0,1.0,1.0,0.0,0.0,1.0,2.0,N
28,1.0,0.0,1.0,0.0,1.0,0.0,2.0,0.0,1.0,Y
29,0.0,1.0,0.0,1.0,1.0,0.0,1.0,0.0,2.0,N
30,1.0,0.0,0.0,1.0,1.0,0.0,0.0,0.0,2.0,N
31,1.0,0.0,0.0,1.0,0.0,1.0,1.0,0.0,0.0,N
32,0.0,1.0,0.0,1.0,1.0,0.0,0.0,0.0,1.0,Y
33,0.0,1.0,0.0,1.0,1.0,0.0,0.0,0.0,2.0,Y
34,0.0,1.0,0.0,1.0,1.0,0.0,0.0,0.0,2.0,N
35,0.0,1.0,1.0,0.0,1.0,0.0,0.0,0.0,1.0,Y
36,1.0,0.0,0.0,1.0,1.0,0.0,0.0,0.0,2.0,Y
37,1.0,0.0,0.0,1.0,1.0,0.0,0.0,1.0,1.0,Y
38,1.0,0.0,0.0,1.0,1.0,0.0,0.0,0.0,2.0,N
39,1.0,0.0,0.0,1.0,1.0,0.0,0.0,0.0,2.0,Y
40,0.0,1.0,0.0,1.0,1.0,0.0,0.0,0.0,2.0,Y
41,0.0,1.0,0.0,1.0,1.0,0.0,0.0,0.0,1.0,Y
42,0.0,1.0,0.0,1.0,0.0,1.0,0.0,1.0,2.0,Y
43,1.0,0.0,1.0,0.0,1.0,0.0,0.0,0.0,2.0,Y
44,0.0,1.0,0.0,1.0,1.0,0.0,1.0,0.0,2.0,Y
45,0.0,1.0,0.0,1.0,1.0,0.0,0.0,0.0,2.0,Y
46,0.0,1.0,1.0,0.0,1.0,0.0,0.0,0.0,2.0,N
47,1.0,0.0,1.0,0.0,1.0,0.0,0.0,0.0,1.0,Y
48,0.0,1.0,1.0,0.0,1.0,0.0,0.0,1.0,1.0,Y
49,1.0,0.0,1.0,0.0,1.0,0.0,0.0,0.0,1.0,Y
50,1.0,0.0,1.0,0.0,1.0,0.0,0.0,0.0,1.0,N
51,0.0,1.0,0.0,1.0,1.0,0.0,2.0,0.0,2.0,N
52,0.0,1.0,0.0,1.0,1.0,0.0,2.0,0.0,1.0,Y
53,0.0,1.0,0.0,1.0,1.0,0.0,0.0,0.0,1.0,Y
54,0.0,1.0,0.0,1.0,1.0,0.0,0.0,0.0,0.0,N
55,0.0,1.0,0.0,1.0,1.0,0.0,1.0,0.0,2.0,Y
56,0.0,1.0,0.0,1.0,1.0,0.0,2.0,1.0,2.0,Y
57,0.0,1.0,0.0,1.0,1.0,0.0,0.0,0.0,2.0,Y
58,0.0,1.0,0.0,1.0,1.0,0.0,3.0,0.0,2.0,Y
59,0.0,1.0,0.0,1.0,0.0,1.0,0.0,1.0,0.0,N
60,0.0,1.0,0.0,1.0,1.0,0.0,1.0,0.0,0.0,N
61,1.0,0.0,1.0,0.0,1.0,0.0,0.0,0.0,1.0,N
62,0.0,1.0,0.0,1.0,1.0,0.0,0.0,0.0,1.0,N
63,1.0,0.0,0.0,1.0,1.0,0.0,0.0,1.0,2.0,N
64,0.0,1.0,0.0,1.0,0.0,1.0,3.0,1.0,2.0,Y
65,1.0,0.0,1.0,0.0,1.0,0.0,0.0,0.0,1.0,N
66,0.0,1.0,0.0,1.0,1.0,0.0,0.0,0.0,2.0,Y
67,0.0,1.0,0.0,1.0,0.0,1.0,2.0,1.0,1.0,Y
68,1.0,0.0,0.0,1.0,1.0,0.0,0.0,0.0,1.0,Y
69,0.0,1.0,0.0,1.0,1.0,0.0,3.0,1.0,1.0,N
70,0.0,1.0,0.0,1.0,0.0,1.0,3.0,0.0,1.0,Y
71,1.0,0.0,0.0,1.0,1.0,0.0,0.0,0.0,2.0,N
72,1.0,0.0,0.0,1.0,1.0,0.0,0.0,0.0,2.0,N
73,0.0,1.0,0.0,1.0,0.0,1.0,1.0,0.0,2.0,N
74,0.0,1.0,0.0,1.0,1.0,0.0,3.0,0.0,1.0,N
75,0.0,1.0,0.0,1.0,0.0,1.0,3.0,1.0,1.0,Y
76,1.0,0.0,1.0,0.0,1.0,0.0,0.0,0.0,1.0,Y
77,0.0,1.0,0.0,1.0,0.0,1.0,1.0,0.0,1.0,Y
78,0.0,1.0,1.0,0.0,1.0,0.0,2.0,0.0,2.0,N
79,0.0,1.0,0.0,1.0,1.0,0.0,0.0,0.0,1.0,N
80,0.0,1.0,0.0,1.0,1.0,0.0,1.0,0.0,2.0,Y
81,1.0,0.0,0.0,1.0,1.0,0.0,0.0,0.0,1.0,Y
82,0.0,1.0,0.0,1.0,1.0,0.0,2.0,1.0,1.0,Y
83,0.0,1.0,0.0,1.0,1.0,0.0,0.0,0.0,1.0,Y
84,1.0,0.0,0.0,1.0,1.0,0.0,0.0,0.0,2.0,Y
85,0.0,1.0,0.0,1.0,1.0,0.0,0.0,0.0,1.0,Y
86,0.0,1.0,0.0,1.0,1.0,0.0,0.0,0.0,1.0,Y
87,0.0,1.0,0.0,1.0,1.0,0.0,2.0,0.0,1.0,Y
88,0.0,1.0,0.0,1.0,1.0,0.0,2.0,1.0,2.0,Y
89,1.0,0.0,0.0,1.0,1.0,0.0,0.0,0.0,1.0,Y
90,1.0,0.0,0.0,1.0,1.0,0.0,0.0,1.0,1.0,Y
91,1.0,0.0,0.0,1.0,1.0,0.0,0.0,0.0,2.0,N
92,0.0,1.0,1.0,0.0,1.0,0.0,0.0,0.0,1.0,Y
93,0.0,1.0,0.0,1.0,1.0,0.0,0.0,0.0,1.0,Y
94,0.0,1.0,0.0,1.0,1.0,0.0,0.0,1.0,1.0,Y
95,0.0,1.0,0.0,1.0,1.0,0.0,0.0,0.0,1.0,Y
96,0.0,1.0,0.0,1.0,1.0,0.0,2.0,1.0,2.0,Y
97,1.0,0.0,0.0,1.0,1.0,0.0,0.0,0.0,1.0,Y
98,0.0,1.0,0.0,1.0,1.0,0.0,0.0,0.0,1.0,Y
99,0.0,1.0,0.0,1.0,1.0,0.0,0.0,0.0,2.0,Y
100,0.0,1.0,0.0,1.0,1.0,0.0,1.0,0.0,2.0,Y
101,1.0,0.0,0.0,1.0,1.0,0.0,0.0,1.0,0.0,N
102,0.0,1.0,0.0,1.0,1.0,0.0,2.0,0.0,2.0,N
103,0.0,1.0,0.0,1.0,1.0,0.0,3.0,1.0,1.0,Y
104,1.0,0.0,0.0,1.0,1.0,0.0,0.0,0.0,2.0,Y
105,0.0,1.0,1.0,0.0,1.0,0.0,0.0,0.0,1.0,Y
106,0.0,1.0,0.0,1.0,1.0,0.0,0.0,1.0,0.0,N
107,1.0,0.0,1.0,0.0,0.0,1.0,1.0,0.0,1.0,Y
108,1.0,0.0,0.0,1.0,1.0,0.0,0.0,0.0,1.0,Y
109,0.0,1.0,1.0,0.0,1.0,0.0,0.0,0.0,1.0,Y
110,0.0,1.0,0.0,1.0,1.0,0.0,1.0,0.0,2.0,Y
111,0.0,1.0,0.0,1.0,1.0,0.0,0.0,0.0,0.0,N
112,0.0,1.0,0.0,1.0,1.0,0.0,0.0,0.0,0.0,Y
113,1.0,0.0,1.0,0.0,1.0,0.0,0.0,0.0,1.0,Y
114,1.0,0.0,1.0,0.0,1.0,0.0,0.0,0.0,1.0,Y
115,0.0,1.0,0.0,1.0,1.0,0.0,2.0,0.0,1.0,Y
116,0.0,1.0,0.0,1.0,1.0,0.0,0.0,1.0,0.0,Y
117,1.0,0.0,1.0,0.0,1.0,0.0,0.0,0.0,0.0,Y
118,1.0,0.0,0.0,1.0,1.0,0.0,0.0,0.0,0.0,Y
119,0.0,1.0,0.0,1.0,1.0,0.0,0.0,0.0,0.0,N
120,1.0,0.0,0.0,1.0,1.0,0.0,0.0,0.0,2.0,Y
121,1.0,0.0,0.0,1.0,1.0,0.0,0.0,0.0,1.0,Y
122,0.0,1.0,0.0,1.0,0.0,1.0,0.0,0.0,1.0,Y
123,1.0,0.0,0.0,1.0,1.0,0.0,0.0,0.0,1.0,Y
124,0.0,1.0,0.0,1.0,1.0,0.0,3.0,0.0,1.0,N
125,0.0,1.0,1.0,0.0,1.0,0.0,0.0,0.0,0.0,N
126,0.0,1.0,0.0,1.0,0.0,1.0,2.0,0.0,2.0,Y
127,0.0,1.0,0.0,1.0,1.0,0.0,2.0,1.0,0.0,N
128,0.0,1.0,0.0,1.0,1.0,0.0,2.0,0.0,0.0,N
129,1.0,0.0,0.0,1.0,1.0,0.0,0.0,0.0,2.0,Y
130,1.0,0.0,0.0,1.0,0.0,1.0,0.0,0.0,1.0,Y
131,0.0,1.0,0.0,1.0,1.0,0.0,0.0,0.0,1.0,Y
132,0.0,1.0,1.0,0.0,1.0,0.0,0.0,0.0,1.0,Y
133,0.0,1.0,0.0,1.0,1.0,0.0,1.0,0.0,2.0,Y
134,1.0,0.0,1.0,0.0,1.0,0.0,0.0,0.0,0.0,N
135,0.0,1.0,0.0,1.0,1.0,0.0,0.0,0.0,1.0,Y
136,1.0,0.0,0.0,1.0,1.0,0.0,0.0,0.0,0.0,N
137,0.0,1.0,0.0,1.0,0.0,1.0,0.0,0.0,0.0,Y
138,1.0,0.0,0.0,1.0,1.0,0.0,0.0,0.0,2.0,N
139,0.0,1.0,0.0,1.0,1.0,0.0,2.0,1.0,0.0,N
140,1.0,0.0,0.0,1.0,1.0,0.0,0.0,0.0,2.0,Y
141,0.0,1.0,0.0,1.0,1.0,0.0,1.0,0.0,0.0,Y
142,0.0,1.0,0.0,1.0,1.0,0.0,1.0,0.0,2.0,Y
143,1.0,0.0,0.0,1.0,1.0,0.0,0.0,0.0,0.0,Y
144,0.0,1.0,0.0,1.0,1.0,0.0,0.0,0.0,1.0,Y
145,0.0,1.0,0.0,1.0,1.0,0.0,0.0,1.0,1.0,Y
146,0.0,1.0,0.0,1.0,1.0,0.0,0.0,0.0,2.0,N
147,0.0,1.0,0.0,1.0,1.0,0.0,1.0,0.0,1.0,N
148,0.0,1.0,0.0,1.0,1.0,0.0,2.0,0.0,0.0,Y
149,0.0,1.0,0.0,1.0,1.0,0.0,0.0,0.0,2.0,Y
150,0.0,1.0,0.0,1.0,1.0,0.0,0.0,0.0,0.0,Y
151,0.0,1.0,1.0,0.0,1.0,0.0,0.0,0.0,0.0,N
152,0.0,1.0,0.0,1.0,1.0,0.0,0.0,0.0,0.0,Y
153,1.0,0.0,0.0,1.0,1.0,0.0,0.0,0.0,1.0,N
154,0.0,1.0,0.0,1.0,1.0,0.0,2.0,0.0,1.0,Y
155,0.0,1.0,0.0,1.0,1.0,0.0,0.0,1.0,0.0,Y
156,0.0,1.0,0.0,1.0,1.0,0.0,3.0,1.0,0.0,N
157,0.0,1.0,0.0,1.0,1.0,0.0,0.0,0.0,1.0,Y
158,0.0,1.0,0.0,1.0,0.0,1.0,0.0,1.0,1.0,N
159,0.0,1.0,0.0,1.0,1.0,0.0,0.0,0.0,0.0,Y
160,0.0,1.0,0.0,1.0,1.0,0.0,2.0,0.0,0.0,Y
161,0.0,1.0,0.0,1.0,1.0,0.0,3.0,0.0,1.0,N
162,0.0,1.0,0.0,1.0,1.0,0.0,1.0,0.0,1.0,Y
163,1.0,0.0,0.0,1.0,1.0,0.0,0.0,1.0,2.0,N
164,0.0,1.0,0.0,1.0,1.0,0.0,1.0,0.0,2.0,N
165,1.0,0.0,0.0,1.0,1.0,0.0,0.0,0.0,0.0,N
166,0.0,1.0,0.0,1.0,1.0,0.0,0.0,0.0,1.0,Y
167,0.0,1.0,1.0,0.0,1.0,0.0,0.0,0.0,1.0,Y
168,0.0,1.0,0.0,1.0,0.0,1.0,1.0,0.0,0.0,N
169,0.0,1.0,0.0,1.0,1.0,0.0,0.0,0.0,0.0,Y
170,0.0,1.0,0.0,1.0,0.0,1.0,0.0,0.0,0.0,Y
171,0.0,1.0,0.0,1.0,1.0,0.0,0.0,0.0,0.0,Y
172,1.0,0.0,0.0,1.0,1.0,0.0,0.0,1.0,0.0,Y
173,0.0,1.0,0.0,1.0,1.0,0.0,0.0,1.0,2.0,N
174,1.0,0.0,0.0,1.0,1.0,0.0,0.0,0.0,1.0,Y
175,1.0,0.0,0.0,1.0,1.0,0.0,0.0,0.0,0.0,Y
176,0.0,1.0,0.0,1.0,1.0,0.0,1.0,0.0,1.0,N
177,1.0,0.0,0.0,1.0,1.0,0.0,0.0,0.0,0.0,Y
178,1.0,0.0,1.0,0.0,1.0,0.0,0.0,1.0,2.0,Y
179,0.0,1.0,1.0,0.0,1.0,0.0,0.0,0.0,1.0,Y
180,0.0,1.0,0.0,1.0,1.0,0.0,1.0,1.0,1.0,Y
181,1.0,0.0,0.0,1.0,1.0,0.0,2.0,0.0,1.0,Y
182,0.0,1.0,0.0,1.0,1.0,0.0,3.0,1.0,2.0,N
183,0.0,1.0,0.0,1.0,1.0,0.0,1.0,1.0,2.0,Y
184,0.0,1.0,0.0,1.0,1.0,0.0,2.0,1.0,1.0,Y
185,1.0,0.0,1.0,0.0,1.0,0.0,0.0,1.0,1.0,Y
186,1.0,0.0,1.0,0.0,1.0,0.0,0.0,0.0,2.0,Y
187,1.0,0.0,0.0,1.0,1.0,0.0,0.0,1.0,0.0,Y
188,1.0,0.0,0.0,1.0,1.0,0.0,0.0,0.0,2.0,Y
189,1.0,0.0,0.0,1.0,1.0,0.0,0.0,0.0,1.0,N
190,1.0,0.0,1.0,0.0,1.0,0.0,0.0,0.0,1.0,N
191,0.0,1.0,0.0,1.0,1.0,0.0,3.0,0.0,1.0,N
192,0.0,1.0,0.0,1.0,0.0,1.0,1.0,0.0,2.0,Y
193,0.0,1.0,0.0,1.0,0.0,1.0,3.0,1.0,0.0,Y
194,0.0,1.0,0.0,1.0,1.0,0.0,0.0,0.0,2.0,Y
195,0.0,1.0,0.0,1.0,1.0,0.0,3.0,1.0,1.0,Y
196,0.0,1.0,0.0,1.0,1.0,0.0,0.0,0.0,0.0,N
197,0.0,1.0,0.0,1.0,1.0,0.0,0.0,0.0,1.0,Y
198,0.0,1.0,0.0,1.0,1.0,0.0,2.0,0.0,1.0,N
199,0.0,1.0,1.0,0.0,1.0,0.0,2.0,0.0,1.0,Y
200,0.0,1.0,0.0,1.0,1.0,0.0,0.0,0.0,2.0,N
201,0.0,1.0,0.0,1.0,1.0,0.0,2.0,0.0,1.0,Y
202,1.0,0.0,0.0,1.0,1.0,0.0,0.0,0.0,1.0,Y
203,0.0,1.0,0.0,1.0,1.0,0.0,0.0,0.0,1.0,Y
204,0.0,1.0,0.0,1.0,1.0,0.0,0.0,0.0,1.0,Y
205,0.0,1.0,0.0,1.0,1.0,0.0,0.0,0.0,0.0,N
206,0.0,1.0,0.0,1.0,0.0,1.0,0.0,1.0,2.0,N
207,0.0,1.0,0.0,1.0,1.0,0.0,2.0,0.0,1.0,Y
208,0.0,1.0,0.0,1.0,1.0,0.0,0.0,0.0,1.0,Y
209,1.0,0.0,0.0,1.0,0.0,1.0,0.0,0.0,0.0,Y
210,0.0,1.0,0.0,1.0,1.0,0.0,1.0,0.0,1.0,Y
211,0.0,1.0,0.0,1.0,1.0,0.0,0.0,0.0,0.0,Y
212,1.0,0.0,0.0,1.0,1.0,0.0,0.0,1.0,0.0,Y
213,1.0,0.0,1.0,0.0,1.0,0.0,0.0,0.0,1.0,Y
214,0.0,1.0,0.0,1.0,1.0,0.0,1.0,0.0,1.0,Y
215,0.0,1.0,0.0,1.0,1.0,0.0,1.0,0.0,0.0,Y
216,0.0,1.0,0.0,1.0,1.0,0.0,0.0,0.0,2.0,N
217,1.0,0.0,1.0,0.0,0.0,1.0,0.0,0.0,2.0,Y
218,1.0,0.0,1.0,0.0,1.0,0.0,1.0,0.0,0.0,Y
219,0.0,1.0,0.0,1.0,1.0,0.0,1.0,0.0,1.0,Y
220,0.0,1.0,0.0,1.0,1.0,0.0,2.0,0.0,0.0,Y
221,0.0,1.0,0.0,1.0,1.0,0.0,1.0,1.0,2.0,N
222,1.0,0.0,0.0,1.0,1.0,0.0,0.0,0.0,2.0,Y
223,0.0,1.0,0.0,1.0,0.0,1.0,2.0,0.0,0.0,Y
224,0.0,1.0,0.0,1.0,1.0,0.0,0.0,1.0,1.0,Y
225,1.0,0.0,0.0,1.0,0.0,1.0,0.0,0.0,2.0,N
226,0.0,1.0,0.0,1.0,1.0,0.0,2.0,0.0,2.0,Y
227,0.0,1.0,0.0,1.0,1.0,0.0,1.0,1.0,2.0,Y
228,0.0,1.0,0.0,1.0,1.0,0.0,1.0,0.0,1.0,Y
229,0.0,1.0,0.0,1.0,1.0,0.0,0.0,0.0,2.0,Y
230,0.0,1.0,0.0,1.0,1.0,0.0,0.0,1.0,1.0,N
231,1.0,0.0,1.0,0.0,1.0,0.0,2.0,0.0,2.0,N
232,1.0,0.0,0.0,1.0,0.0,1.0,0.0,1.0,0.0,Y
233,0.0,1.0,0.0,1.0,1.0,0.0,1.0,1.0,1.0,Y
234,1.0,0.0,1.0,0.0,1.0,0.0,3.0,0.0,0.0,Y
235,1.0,0.0,0.0,1.0,1.0,0.0,0.0,1.0,0.0,N
236,0.0,1.0,0.0,1.0,1.0,0.0,3.0,0.0,2.0,N
237,0.0,1.0,0.0,1.0,1.0,0.0,3.0,1.0,1.0,N
238,0.0,1.0,0.0,1.0,1.0,0.0,1.0,0.0,2.0,Y
239,1.0,0.0,0.0,1.0,1.0,0.0,0.0,0.0,1.0,Y
240,1.0,0.0,1.0,0.0,1.0,0.0,1.0,0.0,1.0,N
241,1.0,0.0,1.0,0.0,1.0,0.0,0.0,0.0,0.0,Y
242,1.0,0.0,0.0,1.0,0.0,1.0,0.0,0.0,1.0,Y
243,1.0,0.0,0.0,1.0,1.0,0.0,0.0,0.0,0.0,Y
244,0.0,1.0,0.0,1.0,1.0,0.0,2.0,0.0,1.0,Y
245,0.0,1.0,0.0,1.0,1.0,0.0,3.0,0.0,2.0,Y
246,1.0,0.0,1.0,0.0,1.0,0.0,0.0,0.0,0.0,N
247,1.0,0.0,1.0,0.0,1.0,0.0,1.0,0.0,2.0,Y
248,1.0,0.0,1.0,0.0,1.0,0.0,0.0,0.0,2.0,Y
249,1.0,0.0,0.0,1.0,1.0,0.0,0.0,0.0,0.0,Y
250,0.0,1.0,0.0,1.0,1.0,0.0,0.0,0.0,1.0,Y
251,0.0,1.0,0.0,1.0,1.0,0.0,2.0,0.0,1.0,Y
252,0.0,1.0,0.0,1.0,1.0,0.0,1.0,0.0,1.0,Y
253,0.0,1.0,0.0,1.0,1.0,0.0,0.0,0.0,1.0,Y
254,0.0,1.0,0.0,1.0,1.0,0.0,0.0,0.0,2.0,Y
255,0.0,1.0,1.0,0.0,1.0,0.0,0.0,1.0,0.0,Y
256,1.0,0.0,0.0,1.0,0.0,1.0,1.0,1.0,2.0,N
257,0.0,1.0,0.0,1.0,1.0,0.0,0.0,0.0,1.0,Y
258,0.0,1.0,0.0,1.0,1.0,0.0,2.0,0.0,2.0,Y
259,1.0,0.0,1.0,0.0,1.0,0.0,0.0,0.0,2.0,Y
260,1.0,0.0,0.0,1.0,1.0,0.0,0.0,0.0,0.0,Y
261,1.0,0.0,1.0,0.0,0.0,1.0,0.0,0.0,1.0,N
262,0.0,1.0,0.0,1.0,1.0,0.0,0.0,0.0,0.0,Y
263,1.0,0.0,1.0,0.0,1.0,0.0,0.0,0.0,1.0,Y
264,1.0,0.0,0.0,1.0,1.0,0.0,0.0,0.0,0.0,Y
265,0.0,1.0,0.0,1.0,1.0,0.0,0.0,0.0,0.0,Y
266,0.0,1.0,0.0,1.0,1.0,0.0,2.0,0.0,1.0,N
267,0.0,1.0,0.0,1.0,1.0,0.0,2.0,0.0,2.0,Y
268,1.0,0.0,1.0,0.0,1.0,0.0,0.0,0.0,2.0,N
269,0.0,1.0,0.0,1.0,1.0,0.0,0.0,0.0,1.0,Y
270,0.0,1.0,0.0,1.0,1.0,0.0,3.0,0.0,2.0,Y
271,0.0,1.0,0.0,1.0,1.0,0.0,1.0,0.0,1.0,Y
272,0.0,1.0,1.0,0.0,1.0,0.0,1.0,0.0,2.0,Y
273,1.0,0.0,1.0,0.0,1.0,0.0,0.0,0.0,0.0,N
274,0.0,1.0,0.0,1.0,1.0,0.0,1.0,0.0,2.0,N
275,0.0,1.0,0.0,1.0,1.0,0.0,0.0,1.0,2.0,N
276,0.0,1.0,0.0,1.0,1.0,0.0,0.0,1.0,1.0,Y
277,1.0,0.0,1.0,0.0,1.0,0.0,0.0,0.0,0.0,Y
278,0.0,1.0,0.0,1.0,1.0,0.0,1.0,0.0,2.0,Y
279,1.0,0.0,0.0,1.0,1.0,0.0,0.0,0.0,0.0,Y
280,1.0,0.0,0.0,1.0,1.0,0.0,0.0,1.0,2.0,N
281,1.0,0.0,1.0,0.0,1.0,0.0,0.0,0.0,0.0,Y
282,1.0,0.0,1.0,0.0,1.0,0.0,0.0,0.0,2.0,N
283,0.0,1.0,0.0,1.0,1.0,0.0,2.0,1.0,0.0,Y
284,1.0,0.0,1.0,0.0,1.0,0.0,0.0,0.0,1.0,Y
285,1.0,0.0,0.0,1.0,1.0,0.0,0.0,1.0,1.0,Y
286,1.0,0.0,1.0,0.0,1.0,0.0,0.0,0.0,0.0,Y
287,0.0,1.0,0.0,1.0,0.0,1.0,2.0,0.0,0.0,Y
288,0.0,1.0,0.0,1.0,1.0,0.0,0.0,0.0,0.0,N
289,0.0,1.0,0.0,1.0,1.0,0.0,1.0,1.0,2.0,Y
290,0.0,1.0,0.0,1.0,1.0,0.0,2.0,0.0,1.0,Y
291,0.0,1.0,0.0,1.0,1.0,0.0,0.0,0.0,2.0,Y
292,1.0,0.0,1.0,0.0,1.0,0.0,1.0,0.0,1.0,Y
293,0.0,1.0,0.0,1.0,0.0,1.0,1.0,0.0,0.0,N
294,0.0,1.0,0.0,1.0,1.0,0.0,0.0,0.0,1.0,Y
295,0.0,1.0,0.0,1.0,1.0,0.0,3.0,0.0,1.0,Y
296,0.0,1.0,0.0,1.0,1.0,0.0,2.0,1.0,0.0,Y
297,1.0,0.0,1.0,0.0,1.0,0.0,0.0,0.0,0.0,Y
298,0.0,1.0,0.0,1.0,0.0,1.0,1.0,0.0,0.0,N
299,1.0,0.0,0.0,1.0,1.0,0.0,0.0,0.0,0.0,Y
300,0.0,1.0,0.0,1.0,0.0,1.0,0.0,0.0,1.0,Y
301,0.0,1.0,1.0,0.0,1.0,0.0,0.0,0.0,2.0,N
302,1.0,0.0,1.0,0.0,1.0,0.0,0.0,0.0,2.0,Y
303,1.0,0.0,0.0,1.0,1.0,0.0,1.0,0.0,2.0,Y
304,1.0,0.0,0.0,1.0,1.0,0.0,0.0,0.0,1.0,Y
305,1.0,0.0,0.0,1.0,1.0,0.0,0.0,0.0,2.0,Y
306,0.0,1.0,0.0,1.0,0.0,1.0,1.0,0.0,2.0,Y
307,0.0,1.0,0.0,1.0,0.0,1.0,0.0,0.0,1.0,Y
308,0.0,1.0,0.0,1.0,1.0,0.0,1.0,0.0,0.0,Y
309,0.0,1.0,0.0,1.0,0.0,1.0,2.0,0.0,0.0,Y
310,1.0,0.0,1.0,0.0,1.0,0.0,3.0,1.0,2.0,N
311,1.0,0.0,1.0,0.0,1.0,0.0,0.0,0.0,1.0,Y
312,0.0,1.0,0.0,1.0,1.0,0.0,3.0,1.0,0.0,N
313,1.0,0.0,1.0,0.0,1.0,0.0,0.0,0.0,0.0,N
314,0.0,1.0,0.0,1.0,1.0,0.0,1.0,1.0,2.0,Y
315,0.0,1.0,0.0,1.0,1.0,0.0,3.0,1.0,1.0,Y
316,0.0,1.0,0.0,1.0,1.0,0.0,2.0,0.0,0.0,Y
317,0.0,1.0,0.0,1.0,1.0,0.0,0.0,0.0,1.0,Y
318,0.0,1.0,0.0,1.0,1.0,0.0,0.0,1.0,0.0,N
319,0.0,1.0,0.0,1.0,1.0,0.0,2.0,1.0,2.0,Y
320,0.0,1.0,0.0,1.0,1.0,0.0,0.0,0.0,1.0,Y
321,0.0,1.0,0.0,1.0,1.0,0.0,0.0,0.0,0.0,Y
322,0.0,1.0,0.0,1.0,1.0,0.0,0.0,0.0,1.0,Y
323,1.0,0.0,0.0,1.0,1.0,0.0,0.0,0.0,0.0,N
324,0.0,1.0,0.0,1.0,1.0,0.0,3.0,0.0,0.0,Y
325,0.0,1.0,1.0,0.0,0.0,1.0,0.0,0.0,0.0,N
326,0.0,1.0,1.0,0.0,1.0,0.0,0.0,0.0,1.0,Y
327,1.0,0.0,1.0,0.0,1.0,0.0,0.0,0.0,2.0,Y
328,0.0,1.0,0.0,1.0,1.0,0.0,2.0,0.0,0.0,Y
329,0.0,1.0,0.0,1.0,1.0,0.0,1.0,0.0,2.0,N
330,0.0,1.0,0.0,1.0,1.0,0.0,0.0,1.0,2.0,N
331,0.0,1.0,0.0,1.0,1.0,0.0,3.0,0.0,1.0,Y
332,1.0,0.0,1.0,0.0,1.0,0.0,1.0,0.0,1.0,N
333,0.0,1.0,0.0,1.0,1.0,0.0,2.0,0.0,1.0,Y
334,0.0,1.0,0.0,1.0,1.0,0.0,0.0,0.0,2.0,Y
335,0.0,1.0,0.0,1.0,1.0,0.0,0.0,0.0,2.0,Y
336,1.0,0.0,0.0,1.0,0.0,1.0,0.0,0.0,0.0,Y
337,1.0,0.0,0.0,1.0,1.0,0.0,0.0,1.0,0.0,N
338,1.0,0.0,0.0,1.0,1.0,0.0,0.0,0.0,1.0,N
339,1.0,0.0,0.0,1.0,1.0,0.0,0.0,0.0,0.0,N
340,0.0,1.0,0.0,1.0,1.0,0.0,1.0,0.0,1.0,Y
341,0.0,1.0,0.0,1.0,1.0,0.0,2.0,0.0,1.0,Y
342,0.0,1.0,0.0,1.0,0.0,1.0,2.0,0.0,0.0,Y
343,1.0,0.0,0.0,1.0,1.0,0.0,1.0,0.0,2.0,N
344,1.0,0.0,1.0,0.0,1.0,0.0,0.0,0.0,2.0,Y
345,0.0,1.0,0.0,1.0,1.0,0.0,0.0,0.0,2.0,Y
346,0.0,1.0,0.0,1.0,1.0,0.0,3.0,0.0,0.0,Y
347,0.0,1.0,0.0,1.0,1.0,0.0,0.0,0.0,1.0,Y
348,1.0,0.0,0.0,1.0,1.0,0.0,0.0,0.0,2.0,N
349,0.0,1.0,0.0,1.0,1.0,0.0,2.0,0.0,2.0,Y
350,0.0,1.0,0.0,1.0,1.0,0.0,0.0,0.0,1.0,Y
351,1.0,0.0,0.0,1.0,1.0,0.0,0.0,0.0,1.0,Y
352,1.0,0.0,1.0,0.0,1.0,0.0,0.0,0.0,2.0,Y
353,1.0,0.0,0.0,1.0,0.0,1.0,0.0,0.0,2.0,Y
354,0.0,1.0,0.0,1.0,1.0,0.0,2.0,0.0,2.0,N
355,1.0,0.0,0.0,1.0,1.0,0.0,1.0,0.0,2.0,Y
356,1.0,0.0,0.0,1.0,1.0,0.0,0.0,1.0,1.0,Y
357,0.0,1.0,0.0,1.0,1.0,0.0,0.0,1.0,2.0,N
358,0.0,1.0,0.0,1.0,1.0,0.0,0.0,0.0,2.0,Y
359,0.0,1.0,0.0,1.0,1.0,0.0,0.0,0.0,0.0,Y
360,1.0,0.0,0.0,1.0,1.0,0.0,3.0,0.0,0.0,Y
361,0.0,1.0,0.0,1.0,1.0,0.0,3.0,0.0,0.0,Y
362,0.0,1.0,0.0,1.0,1.0,0.0,0.0,0.0,2.0,Y
363,0.0,1.0,0.0,1.0,1.0,0.0,2.0,1.0,1.0,Y
364,0.0,1.0,0.0,1.0,1.0,0.0,2.0,0.0,2.0,Y
365,0.0,1.0,0.0,1.0,1.0,0.0,2.0,0.0,1.0,Y
366,1.0,0.0,1.0,0.0,1.0,0.0,0.0,0.0,2.0,N
367,0.0,1.0,0.0,1.0,1.0,0.0,0.0,0.0,2.0,Y
368,1.0,0.0,0.0,1.0,1.0,0.0,0.0,1.0,0.0,Y
369,1.0,0.0,1.0,0.0,1.0,0.0,0.0,0.0,1.0,N
370,0.0,1.0,0.0,1.0,1.0,0.0,2.0,1.0,2.0,N
371,1.0,0.0,0.0,1.0,1.0,0.0,0.0,1.0,0.0,N
372,1.0,0.0,0.0,1.0,1.0,0.0,0.0,0.0,1.0,Y
373,1.0,0.0,1.0,0.0,1.0,0.0,0.0,1.0,1.0,Y
374,1.0,0.0,1.0,0.0,0.0,1.0,0.0,0.0,0.0,N
375,1.0,0.0,1.0,0.0,1.0,0.0,0.0,0.0,1.0,Y
376,0.0,1.0,0.0,1.0,1.0,0.0,0.0,1.0,2.0,Y
377,1.0,0.0,1.0,0.0,1.0,0.0,0.0,1.0,0.0,Y
378,0.0,1.0,0.0,1.0,1.0,0.0,1.0,0.0,1.0,N
379,1.0,0.0,1.0,0.0,0.0,1.0,1.0,1.0,1.0,N
380,0.0,1.0,0.0,1.0,1.0,0.0,0.0,0.0,2.0,Y
381,0.0,1.0,0.0,1.0,1.0,0.0,0.0,1.0,0.0,N
382,0.0,1.0,0.0,1.0,1.0,0.0,0.0,1.0,0.0,Y
383,0.0,1.0,1.0,0.0,1.0,0.0,0.0,1.0,1.0,N
384,1.0,0.0,1.0,0.0,1.0,0.0,0.0,0.0,2.0,Y
385,1.0,0.0,1.0,0.0,1.0,0.0,1.0,0.0,2.0,N
386,0.0,1.0,0.0,1.0,0.0,1.0,2.0,0.0,2.0,N
387,0.0,1.0,0.0,1.0,1.0,0.0,0.0,0.0,0.0,Y
388,0.0,1.0,0.0,1.0,1.0,0.0,0.0,0.0,1.0,Y
389,0.0,1.0,0.0,1.0,1.0,0.0,0.0,0.0,0.0,Y
390,1.0,0.0,1.0,0.0,1.0,0.0,0.0,1.0,2.0,N
391,0.0,1.0,0.0,1.0,1.0,0.0,0.0,0.0,2.0,Y
392,0.0,1.0,0.0,1.0,1.0,0.0,1.0,0.0,2.0,N
393,0.0,1.0,0.0,1.0,1.0,0.0,0.0,0.0,0.0,Y
394,1.0,0.0,1.0,0.0,1.0,0.0,1.0,1.0,0.0,N
395,0.0,1.0,0.0,1.0,1.0,0.0,2.0,0.0,1.0,Y
396,0.0,1.0,0.0,1.0,1.0,0.0,0.0,0.0,0.0,Y
397,1.0,0.0,0.0,1.0,1.0,0.0,0.0,1.0,2.0,Y
398,1.0,0.0,1.0,0.0,0.0,1.0,1.0,0.0,1.0,Y
399,1.0,0.0,0.0,1.0,1.0,0.0,0.0,0.0,0.0,N
400,0.0,1.0,0.0,1.0,1.0,0.0,0.0,0.0,1.0,Y
401,1.0,0.0,0.0,1.0,1.0,0.0,0.0,0.0,2.0,Y
402,0.0,1.0,1.0,0.0,1.0,0.0,0.0,0.0,1.0,Y
403,1.0,0.0,0.0,1.0,1.0,0.0,0.0,0.0,1.0,Y
404,0.0,1.0,0.0,1.0,1.0,0.0,0.0,0.0,2.0,Y
405,0.0,1.0,1.0,0.0,0.0,1.0,0.0,1.0,0.0,Y
406,1.0,0.0,0.0,1.0,1.0,0.0,0.0,0.0,1.0,Y
407,0.0,1.0,0.0,1.0,1.0,0.0,0.0,0.0,0.0,Y
408,1.0,0.0,0.0,1.0,1.0,0.0,3.0,1.0,1.0,Y
409,0.0,1.0,0.0,1.0,1.0,0.0,0.0,0.0,0.0,Y
410,0.0,1.0,0.0,1.0,0.0,1.0,1.0,0.0,0.0,Y
411,0.0,1.0,0.0,1.0,1.0,0.0,2.0,1.0,0.0,Y
412,0.0,1.0,0.0,1.0,1.0,0.0,0.0,0.0,0.0,N
413,0.0,1.0,0.0,1.0,1.0,0.0,2.0,0.0,0.0,N
414,1.0,0.0,0.0,1.0,0.0,1.0,1.0,1.0,1.0,N
415,0.0,1.0,0.0,1.0,1.0,0.0,2.0,1.0,0.0,N
416,0.0,1.0,0.0,1.0,1.0,0.0,2.0,1.0,2.0,Y
417,0.0,1.0,0.0,1.0,1.0,0.0,0.0,0.0,0.0,N
418,0.0,1.0,0.0,1.0,1.0,0.0,0.0,0.0,0.0,Y
419,1.0,0.0,0.0,1.0,0.0,1.0,0.0,0.0,1.0,Y
420,0.0,1.0,0.0,1.0,1.0,0.0,2.0,0.0,1.0,Y
421,0.0,1.0,0.0,1.0,1.0,0.0,0.0,0.0,2.0,Y
422,0.0,1.0,0.0,1.0,1.0,0.0,0.0,0.0,2.0,N
423,1.0,0.0,0.0,1.0,1.0,0.0,2.0,0.0,0.0,Y
424,0.0,1.0,0.0,1.0,1.0,0.0,0.0,0.0,1.0,N
425,0.0,1.0,0.0,1.0,0.0,1.0,0.0,0.0,1.0,Y
426,0.0,1.0,0.0,1.0,1.0,0.0,3.0,0.0,2.0,Y
427,0.0,1.0,0.0,1.0,1.0,0.0,0.0,0.0,0.0,Y
428,1.0,0.0,1.0,0.0,1.0,0.0,1.0,1.0,1.0,Y
429,1.0,0.0,0.0,1.0,1.0,0.0,0.0,0.0,1.0,N
430,1.0,0.0,0.0,1.0,1.0,0.0,0.0,0.0,0.0,Y
431,0.0,1.0,0.0,1.0,1.0,0.0,3.0,1.0,2.0,N
432,0.0,1.0,1.0,0.0,1.0,0.0,2.0,1.0,1.0,Y
433,0.0,1.0,0.0,1.0,1.0,0.0,0.0,0.0,2.0,N
434,0.0,1.0,0.0,1.0,0.0,1.0,1.0,0.0,1.0,Y
435,0.0,1.0,0.0,1.0,1.0,0.0,1.0,1.0,0.0,N
436,0.0,1.0,0.0,1.0,1.0,0.0,3.0,0.0,1.0,Y
437,1.0,0.0,1.0,0.0,0.0,1.0,0.0,0.0,2.0,Y
438,1.0,0.0,0.0,1.0,1.0,0.0,2.0,0.0,0.0,Y
439,0.0,1.0,0.0,1.0,1.0,0.0,2.0,0.0,1.0,Y
440,0.0,1.0,0.0,1.0,1.0,0.0,2.0,0.0,1.0,N
441,0.0,1.0,0.0,1.0,1.0,0.0,2.0,0.0,2.0,N
442,1.0,0.0,1.0,0.0,1.0,0.0,0.0,1.0,0.0,Y
443,0.0,1.0,0.0,1.0,1.0,0.0,3.0,1.0,0.0,Y
444,0.0,1.0,0.0,1.0,1.0,0.0,0.0,0.0,1.0,Y
445,0.0,1.0,0.0,1.0,1.0,0.0,2.0,0.0,1.0,Y
446,0.0,1.0,0.0,1.0,1.0,0.0,1.0,1.0,0.0,Y
447,1.0,0.0,0.0,1.0,1.0,0.0,2.0,0.0,0.0,N
448,0.0,1.0,0.0,1.0,0.0,1.0,2.0,0.0,1.0,Y
449,1.0,0.0,0.0,1.0,1.0,0.0,0.0,0.0,2.0,N
450,1.0,0.0,0.0,1.0,1.0,0.0,0.0,1.0,1.0,Y
451,0.0,1.0,0.0,1.0,1.0,0.0,1.0,1.0,2.0,Y
452,1.0,0.0,0.0,1.0,1.0,0.0,0.0,1.0,0.0,Y
453,0.0,1.0,0.0,1.0,1.0,0.0,0.0,0.0,0.0,N
454,0.0,1.0,1.0,0.0,1.0,0.0,1.0,0.0,1.0,Y
455,0.0,1.0,0.0,1.0,1.0,0.0,0.0,1.0,0.0,Y
456,0.0,1.0,0.0,1.0,1.0,0.0,0.0,0.0,2.0,Y
457,0.0,1.0,0.0,1.0,0.0,1.0,1.0,0.0,1.0,Y
458,1.0,0.0,0.0,1.0,1.0,0.0,0.0,0.0,0.0,N
459,1.0,0.0,1.0,0.0,1.0,0.0,0.0,0.0,0.0,Y
460,1.0,0.0,1.0,0.0,1.0,0.0,0.0,0.0,1.0,Y
461,0.0,1.0,0.0,1.0,1.0,0.0,2.0,0.0,1.0,Y
462,0.0,1.0,0.0,1.0,1.0,0.0,1.0,1.0,0.0,N
463,0.0,1.0,0.0,1.0,1.0,0.0,0.0,1.0,1.0,Y
464,0.0,1.0,0.0,1.0,1.0,0.0,2.0,0.0,0.0,Y
465,1.0,0.0,0.0,1.0,1.0,0.0,0.0,0.0,2.0,N
466,0.0,1.0,0.0,1.0,0.0,1.0,0.0,0.0,2.0,Y
467,1.0,0.0,0.0,1.0,1.0,0.0,0.0,1.0,0.0,N
468,0.0,1.0,0.0,1.0,1.0,0.0,1.0,0.0,1.0,Y
469,0.0,1.0,0.0,1.0,1.0,0.0,2.0,0.0,2.0,Y
470,0.0,1.0,0.0,1.0,1.0,0.0,0.0,0.0,1.0,N
471,1.0,0.0,0.0,1.0,1.0,0.0,0.0,0.0,0.0,N
472,0.0,1.0,0.0,1.0,1.0,0.0,3.0,0.0,0.0,Y
473,0.0,1.0,1.0,0.0,1.0,0.0,2.0,0.0,1.0,Y
474,0.0,1.0,0.0,1.0,1.0,0.0,0.0,1.0,1.0,N
475,1.0,0.0,0.0,1.0,1.0,0.0,0.0,0.0,1.0,N
476,1.0,0.0,1.0,0.0,1.0,0.0,0.0,1.0,0.0,N
477,0.0,1.0,0.0,1.0,1.0,0.0,2.0,1.0,1.0,Y
478,1.0,0.0,0.0,1.0,1.0,0.0,0.0,0.0,1.0,Y
479,0.0,1.0,0.0,1.0,0.0,1.0,3.0,0.0,0.0,Y
480,0.0,1.0,0.0,1.0,0.0,1.0,2.0,0.0,0.0,Y
481,1.0,0.0,0.0,1.0,1.0,0.0,0.0,0.0,1.0,N
482,0.0,1.0,0.0,1.0,1.0,0.0,0.0,0.0,1.0,Y
483,0.0,1.0,0.0,1.0,1.0,0.0,1.0,1.0,1.0,Y
484,1.0,0.0,0.0,1.0,1.0,0.0,1.0,1.0,1.0,Y
485,1.0,0.0,0.0,1.0,1.0,0.0,0.0,1.0,1.0,Y
486,0.0,1.0,0.0,1.0,1.0,0.0,0.0,0.0,0.0,Y
487,0.0,1.0,0.0,1.0,1.0,0.0,3.0,0.0,2.0,Y
488,1.0,0.0,0.0,1.0,1.0,0.0,2.0,0.0,0.0,N
489,1.0,0.0,0.0,1.0,1.0,0.0,0.0,1.0,0.0,Y
490,0.0,1.0,0.0,1.0,1.0,0.0,0.0,0.0,2.0,Y
491,1.0,0.0,0.0,1.0,1.0,0.0,2.0,0.0,1.0,Y
492,0.0,1.0,0.0,1.0,1.0,0.0,0.0,1.0,0.0,N
493,0.0,1.0,0.0,1.0,1.0,0.0,3.0,0.0,0.0,Y
494,0.0,1.0,1.0,0.0,1.0,0.0,1.0,0.0,1.0,Y
495,1.0,0.0,1.0,0.0,1.0,0.0,0.0,0.0,1.0,N
496,1.0,0.0,1.0,0.0,1.0,0.0,1.0,0.0,1.0,Y
497,0.0,1.0,0.0,1.0,1.0,0.0,1.0,1.0,2.0,Y
498,0.0,1.0,1.0,0.0,1.0,0.0,0.0,1.0,1.0,Y
499,0.0,1.0,0.0,1.0,1.0,0.0,0.0,0.0,0.0,Y
500,1.0,0.0,0.0,1.0,1.0,0.0,0.0,1.0,1.0,N
501,1.0,0.0,0.0,1.0,1.0,0.0,0.0,0.0,0.0,Y
502,1.0,0.0,1.0,0.0,1.0,0.0,0.0,0.0,1.0,N
503,0.0,1.0,0.0,1.0,1.0,0.0,0.0,0.0,0.0,Y
504,0.0,1.0,0.0,1.0,0.0,1.0,2.0,0.0,0.0,N
505,0.0,1.0,0.0,1.0,1.0,0.0,1.0,1.0,0.0,Y
506,0.0,1.0,0.0,1.0,1.0,0.0,1.0,0.0,2.0,Y
507,0.0,1.0,0.0,1.0,1.0,0.0,0.0,1.0,2.0,N
508,0.0,1.0,0.0,1.0,1.0,0.0,0.0,0.0,0.0,N
509,0.0,1.0,0.0,1.0,1.0,0.0,1.0,0.0,1.0,Y
510,1.0,0.0,1.0,0.0,1.0,0.0,0.0,0.0,2.0,Y
511,0.0,1.0,0.0,1.0,0.0,1.0,3.0,0.0,1.0,Y
512,0.0,1.0,0.0,1.0,1.0,0.0,0.0,0.0,1.0,Y
513,0.0,1.0,1.0,0.0,1.0,0.0,0.0,0.0,1.0,Y
514,0.0,1.0,0.0,1.0,1.0,0.0,2.0,1.0,1.0,Y
515,0.0,1.0,0.0,1.0,1.0,0.0,0.0,0.0,0.0,Y
516,1.0,0.0,0.0,1.0,0.0,1.0,0.0,1.0,1.0,Y
517,0.0,1.0,0.0,1.0,1.0,0.0,2.0,0.0,2.0,N
518,0.0,1.0,0.0,1.0,1.0,0.0,0.0,1.0,0.0,Y
519,1.0,0.0,0.0,1.0,1.0,0.0,0.0,0.0,2.0,Y
520,0.0,1.0,0.0,1.0,1.0,0.0,3.0,0.0,0.0,N
521,1.0,0.0,1.0,0.0,1.0,0.0,0.0,0.0,2.0,N
522,0.0,1.0,0.0,1.0,1.0,0.0,0.0,0.0,2.0,N
523,0.0,1.0,0.0,1.0,1.0,0.0,1.0,0.0,2.0,Y
524,0.0,1.0,0.0,1.0,1.0,0.0,0.0,0.0,2.0,N
525,0.0,1.0,0.0,1.0,1.0,0.0,2.0,1.0,1.0,N
526,0.0,1.0,0.0,1.0,1.0,0.0,3.0,0.0,1.0,N
527,0.0,1.0,0.0,1.0,1.0,0.0,2.0,0.0,2.0,Y
528,0.0,1.0,0.0,1.0,1.0,0.0,0.0,0.0,1.0,N
529,1.0,0.0,0.0,1.0,1.0,0.0,0.0,0.0,2.0,Y
530,0.0,1.0,0.0,1.0,1.0,0.0,1.0,0.0,0.0,Y
531,1.0,0.0,0.0,1.0,1.0,0.0,0.0,0.0,2.0,Y
532,0.0,1.0,0.0,1.0,1.0,0.0,2.0,0.0,1.0,Y
533,1.0,0.0,0.0,1.0,1.0,0.0,0.0,0.0,2.0,N
534,0.0,1.0,1.0,0.0,1.0,0.0,0.0,0.0,1.0,Y
535,0.0,1.0,0.0,1.0,1.0,0.0,1.0,0.0,0.0,N
536,0.0,1.0,0.0,1.0,1.0,0.0,1.0,0.0,0.0,N
537,0.0,1.0,0.0,1.0,1.0,0.0,1.0,0.0,0.0,N
538,0.0,1.0,0.0,1.0,1.0,0.0,0.0,0.0,2.0,Y
539,1.0,0.0,1.0,0.0,1.0,0.0,0.0,1.0,1.0,Y
540,1.0,0.0,0.0,1.0,1.0,0.0,0.0,0.0,1.0,Y
541,0.0,1.0,0.0,1.0,0.0,1.0,2.0,0.0,1.0,N
542,0.0,1.0,0.0,1.0,1.0,0.0,0.0,0.0,1.0,Y
543,0.0,1.0,0.0,1.0,0.0,1.0,2.0,0.0,1.0,N
544,1.0,0.0,0.0,1.0,0.0,1.0,3.0,0.0,1.0,Y
545,0.0,1.0,0.0,1.0,1.0,0.0,0.0,0.0,0.0,Y
546,1.0,0.0,0.0,1.0,1.0,0.0,0.0,1.0,0.0,Y
547,0.0,1.0,0.0,1.0,0.0,1.0,2.0,1.0,0.0,N
548,1.0,0.0,0.0,1.0,1.0,0.0,0.0,0.0,1.0,N
549,0.0,1.0,0.0,1.0,0.0,1.0,0.0,0.0,0.0,Y
550,0.0,1.0,0.0,1.0,1.0,0.0,2.0,0.0,2.0,Y
551,1.0,0.0,1.0,0.0,1.0,0.0,3.0,0.0,2.0,N
552,0.0,1.0,0.0,1.0,1.0,0.0,0.0,1.0,0.0,Y
553,0.0,1.0,0.0,1.0,1.0,0.0,3.0,0.0,2.0,Y
554,1.0,0.0,0.0,1.0,1.0,0.0,0.0,0.0,0.0,Y
555,0.0,1.0,0.0,1.0,1.0,0.0,0.0,1.0,2.0,N
556,0.0,1.0,0.0,1.0,1.0,0.0,1.0,0.0,1.0,Y
557,0.0,1.0,0.0,1.0,1.0,0.0,2.0,1.0,0.0,Y
558,0.0,1.0,0.0,1.0,1.0,0.0,0.0,0.0,0.0,Y
559,1.0,0.0,1.0,0.0,1.0,0.0,0.0,0.0,0.0,Y
560,0.0,1.0,0.0,1.0,1.0,0.0,3.0,0.0,0.0,Y
561,0.0,1.0,0.0,1.0,1.0,0.0,1.0,0.0,2.0,Y
562,0.0,1.0,0.0,1.0,1.0,0.0,2.0,0.0,2.0,Y
563,1.0,0.0,1.0,0.0,0.0,1.0,0.0,0.0,1.0,N
