<mxfile host="app.diagrams.net" modified="2023-09-06T17:31:17.485Z" agent="Mozilla/5.0 (Windows NT 10.0; Win64; x64) AppleWebKit/537.36 (KHTML, like Gecko) Chrome/116.0.0.0 Safari/537.36" etag="YSeQhZ62BClCjb7DJxFO" version="21.7.2" type="gitlab">
  <diagram name="Page-1" id="03018318-947c-dd8e-b7a3-06fadd420f32">
    <mxGraphModel dx="2233" dy="2467" grid="1" gridSize="10" guides="1" tooltips="1" connect="1" arrows="1" fold="1" page="1" pageScale="1" pageWidth="1100" pageHeight="850" background="none" math="0" shadow="0">
      <root>
        <mxCell id="0" />
        <mxCell id="1" parent="0" />
        <mxCell id="677b7b8949515195-2" value="ALL NEWS" style="whiteSpace=wrap;html=1;rounded=0;shadow=0;labelBackgroundColor=none;strokeWidth=1;fontFamily=Verdana;fontSize=28;align=center;comic=1;" parent="1" vertex="1">
          <mxGeometry x="30" y="30" width="190" height="50" as="geometry" />
        </mxCell>
        <mxCell id="677b7b8949515195-9" value="" style="line;strokeWidth=1;html=1;rounded=0;shadow=0;labelBackgroundColor=none;fillColor=none;fontFamily=Verdana;fontSize=14;fontColor=#000000;align=center;comic=1;" parent="1" vertex="1">
          <mxGeometry y="110" width="1100" height="10" as="geometry" />
        </mxCell>
        <mxCell id="677b7b8949515195-15" value="&lt;div style=&quot;text-align: justify&quot;&gt;&lt;br&gt;&lt;/div&gt;" style="whiteSpace=wrap;html=1;rounded=0;shadow=0;labelBackgroundColor=none;strokeWidth=1;fillColor=none;fontFamily=Verdana;fontSize=12;align=center;verticalAlign=top;spacing=10;comic=1;" parent="1" vertex="1">
          <mxGeometry x="40" y="180" width="300" height="350" as="geometry" />
        </mxCell>
        <mxCell id="677b7b8949515195-26" value="" style="whiteSpace=wrap;html=1;rounded=0;shadow=0;labelBackgroundColor=none;strokeWidth=1;fillColor=none;fontFamily=Verdana;fontSize=12;align=center;comic=1;" parent="1" vertex="1">
          <mxGeometry y="710" width="1100" height="150" as="geometry" />
        </mxCell>
        <mxCell id="QS-fFT0Z4BycfrMn5x45-2" value="LOGO" style="whiteSpace=wrap;html=1;rounded=0;shadow=0;labelBackgroundColor=none;strokeWidth=1;fontFamily=Verdana;fontSize=28;align=center;comic=1;" vertex="1" parent="1">
          <mxGeometry x="410" y="30" width="190" height="50" as="geometry" />
        </mxCell>
        <mxCell id="QS-fFT0Z4BycfrMn5x45-3" value="LOGIN" style="whiteSpace=wrap;html=1;rounded=0;shadow=0;labelBackgroundColor=none;strokeWidth=1;fontFamily=Verdana;fontSize=28;align=center;comic=1;" vertex="1" parent="1">
          <mxGeometry x="680" y="30" width="190" height="50" as="geometry" />
        </mxCell>
        <mxCell id="QS-fFT0Z4BycfrMn5x45-4" value="SIGN UP" style="whiteSpace=wrap;html=1;rounded=0;shadow=0;labelBackgroundColor=none;strokeWidth=1;fontFamily=Verdana;fontSize=28;align=center;comic=1;" vertex="1" parent="1">
          <mxGeometry x="890" y="30" width="190" height="50" as="geometry" />
        </mxCell>
        <mxCell id="QS-fFT0Z4BycfrMn5x45-5" value="&lt;div style=&quot;text-align: justify&quot;&gt;&lt;br&gt;&lt;/div&gt;" style="whiteSpace=wrap;html=1;rounded=0;shadow=0;labelBackgroundColor=none;strokeWidth=1;fillColor=none;fontFamily=Verdana;fontSize=12;align=center;verticalAlign=top;spacing=10;comic=1;" vertex="1" parent="1">
          <mxGeometry x="400" y="180" width="300" height="350" as="geometry" />
        </mxCell>
        <mxCell id="QS-fFT0Z4BycfrMn5x45-6" value="&lt;div style=&quot;text-align: justify&quot;&gt;&lt;br&gt;&lt;/div&gt;" style="whiteSpace=wrap;html=1;rounded=0;shadow=0;labelBackgroundColor=none;strokeWidth=1;fillColor=none;fontFamily=Verdana;fontSize=12;align=center;verticalAlign=top;spacing=10;comic=1;" vertex="1" parent="1">
          <mxGeometry x="760" y="180" width="300" height="350" as="geometry" />
        </mxCell>
        <mxCell id="QS-fFT0Z4BycfrMn5x45-7" value="NEWS" style="whiteSpace=wrap;html=1;rounded=0;shadow=0;labelBackgroundColor=none;strokeWidth=1;fontFamily=Verdana;fontSize=28;align=center;comic=1;" vertex="1" parent="1">
          <mxGeometry x="140" y="230" width="190" height="50" as="geometry" />
        </mxCell>
        <mxCell id="QS-fFT0Z4BycfrMn5x45-8" value="DETAILS" style="whiteSpace=wrap;html=1;rounded=0;shadow=0;labelBackgroundColor=none;strokeWidth=1;fontFamily=Verdana;fontSize=28;align=center;comic=1;" vertex="1" parent="1">
          <mxGeometry x="60" y="450" width="190" height="50" as="geometry" />
        </mxCell>
        <mxCell id="QS-fFT0Z4BycfrMn5x45-9" value="NEWS" style="whiteSpace=wrap;html=1;rounded=0;shadow=0;labelBackgroundColor=none;strokeWidth=1;fontFamily=Verdana;fontSize=28;align=center;comic=1;" vertex="1" parent="1">
          <mxGeometry x="500" y="240" width="190" height="50" as="geometry" />
        </mxCell>
        <mxCell id="QS-fFT0Z4BycfrMn5x45-10" value="DETAILS" style="whiteSpace=wrap;html=1;rounded=0;shadow=0;labelBackgroundColor=none;strokeWidth=1;fontFamily=Verdana;fontSize=28;align=center;comic=1;" vertex="1" parent="1">
          <mxGeometry x="440" y="440" width="190" height="50" as="geometry" />
        </mxCell>
        <mxCell id="QS-fFT0Z4BycfrMn5x45-11" value="NEWS" style="whiteSpace=wrap;html=1;rounded=0;shadow=0;labelBackgroundColor=none;strokeWidth=1;fontFamily=Verdana;fontSize=28;align=center;comic=1;" vertex="1" parent="1">
          <mxGeometry x="850" y="230" width="190" height="50" as="geometry" />
        </mxCell>
        <mxCell id="QS-fFT0Z4BycfrMn5x45-12" value="DETAILS" style="whiteSpace=wrap;html=1;rounded=0;shadow=0;labelBackgroundColor=none;strokeWidth=1;fontFamily=Verdana;fontSize=28;align=center;comic=1;" vertex="1" parent="1">
          <mxGeometry x="770" y="440" width="190" height="50" as="geometry" />
        </mxCell>
        <mxCell id="QS-fFT0Z4BycfrMn5x45-13" value="LOGO" style="whiteSpace=wrap;html=1;rounded=0;shadow=0;labelBackgroundColor=none;strokeWidth=1;fontFamily=Verdana;fontSize=28;align=center;comic=1;" vertex="1" parent="1">
          <mxGeometry x="20" y="750" width="190" height="50" as="geometry" />
        </mxCell>
        <mxCell id="QS-fFT0Z4BycfrMn5x45-14" value="Lorem ipsum dolor sit amet, consectetur adipisicir incididunt ut la&amp;nbsp;" style="text;spacingTop=-5;whiteSpace=wrap;html=1;align=left;fontSize=12;fontFamily=Helvetica;fillColor=none;strokeColor=none;" vertex="1" parent="1">
          <mxGeometry x="15" y="820" width="350" height="20" as="geometry" />
        </mxCell>
        <mxCell id="QS-fFT0Z4BycfrMn5x45-15" value="Lorem ipsum dolor sit amet, consectetur adipisicir incididunt ut la&amp;nbsp;" style="text;spacingTop=-5;whiteSpace=wrap;html=1;align=left;fontSize=12;fontFamily=Helvetica;fillColor=none;strokeColor=none;" vertex="1" parent="1">
          <mxGeometry x="735" y="820" width="350" height="20" as="geometry" />
        </mxCell>
        <mxCell id="QS-fFT0Z4BycfrMn5x45-16" value="" style="whiteSpace=wrap;html=1;rounded=0;shadow=0;labelBackgroundColor=none;strokeWidth=1;fillColor=none;fontFamily=Verdana;fontSize=12;align=center;comic=1;" vertex="1" parent="1">
          <mxGeometry width="1100" height="860" as="geometry" />
        </mxCell>
        <mxCell id="QS-fFT0Z4BycfrMn5x45-17" value="" style="whiteSpace=wrap;html=1;rounded=0;shadow=0;labelBackgroundColor=none;strokeWidth=1;fillColor=none;fontFamily=Verdana;fontSize=12;align=center;comic=1;" vertex="1" parent="1">
          <mxGeometry y="880" width="1100" height="820" as="geometry" />
        </mxCell>
        <mxCell id="QS-fFT0Z4BycfrMn5x45-18" value="" style="whiteSpace=wrap;html=1;rounded=0;shadow=0;labelBackgroundColor=none;strokeWidth=1;fillColor=none;fontFamily=Verdana;fontSize=12;align=center;comic=1;" vertex="1" parent="1">
          <mxGeometry y="880" width="1100" height="100" as="geometry" />
        </mxCell>
        <mxCell id="QS-fFT0Z4BycfrMn5x45-19" value="&lt;font style=&quot;font-size: 38px;&quot;&gt;ALL NEWS&lt;/font&gt;" style="whiteSpace=wrap;html=1;rounded=0;shadow=0;labelBackgroundColor=none;strokeWidth=1;fillColor=none;fontFamily=Verdana;fontSize=12;align=center;comic=1;" vertex="1" parent="1">
          <mxGeometry x="20" y="900" width="250" height="50" as="geometry" />
        </mxCell>
        <mxCell id="QS-fFT0Z4BycfrMn5x45-20" value="&lt;font style=&quot;font-size: 38px;&quot;&gt;LOGO&lt;/font&gt;" style="whiteSpace=wrap;html=1;rounded=0;shadow=0;labelBackgroundColor=none;strokeWidth=1;fillColor=none;fontFamily=Verdana;fontSize=12;align=center;comic=1;" vertex="1" parent="1">
          <mxGeometry x="820" y="905" width="250" height="50" as="geometry" />
        </mxCell>
        <mxCell id="QS-fFT0Z4BycfrMn5x45-21" value="" style="whiteSpace=wrap;html=1;rounded=0;shadow=0;labelBackgroundColor=none;strokeWidth=1;fillColor=none;fontFamily=Verdana;fontSize=12;align=center;comic=1;" vertex="1" parent="1">
          <mxGeometry x="235" y="1050" width="720" height="470" as="geometry" />
        </mxCell>
        <mxCell id="QS-fFT0Z4BycfrMn5x45-22" value="" style="whiteSpace=wrap;html=1;rounded=0;shadow=0;labelBackgroundColor=none;strokeWidth=1;fillColor=none;fontFamily=Verdana;fontSize=12;align=center;comic=1;" vertex="1" parent="1">
          <mxGeometry x="280" y="1180" width="510" height="50" as="geometry" />
        </mxCell>
        <mxCell id="QS-fFT0Z4BycfrMn5x45-24" value="&lt;font style=&quot;font-size: 30px;&quot;&gt;LOG INTO YOUR ACCOUNT&lt;/font&gt;" style="text;html=1;strokeColor=none;fillColor=none;align=center;verticalAlign=middle;whiteSpace=wrap;rounded=0;strokeWidth=20;" vertex="1" parent="1">
          <mxGeometry x="397.5" y="1070" width="395" height="30" as="geometry" />
        </mxCell>
        <mxCell id="QS-fFT0Z4BycfrMn5x45-25" value="&lt;span style=&quot;font-size: 30px;&quot;&gt;Email addres&lt;/span&gt;" style="text;html=1;strokeColor=none;fillColor=none;align=left;verticalAlign=middle;whiteSpace=wrap;rounded=0;strokeWidth=20;" vertex="1" parent="1">
          <mxGeometry x="280" y="1130" width="395" height="30" as="geometry" />
        </mxCell>
        <mxCell id="QS-fFT0Z4BycfrMn5x45-26" value="" style="whiteSpace=wrap;html=1;rounded=0;shadow=0;labelBackgroundColor=none;strokeWidth=1;fillColor=none;fontFamily=Verdana;fontSize=12;align=center;comic=1;" vertex="1" parent="1">
          <mxGeometry x="280" y="1310" width="510" height="50" as="geometry" />
        </mxCell>
        <mxCell id="QS-fFT0Z4BycfrMn5x45-27" value="&lt;span style=&quot;font-size: 30px;&quot;&gt;Password&lt;/span&gt;" style="text;html=1;strokeColor=none;fillColor=none;align=left;verticalAlign=middle;whiteSpace=wrap;rounded=0;strokeWidth=20;" vertex="1" parent="1">
          <mxGeometry x="280" y="1260" width="395" height="30" as="geometry" />
        </mxCell>
        <mxCell id="QS-fFT0Z4BycfrMn5x45-28" value="&lt;span style=&quot;font-size: 38px;&quot;&gt;LOGIN&lt;/span&gt;" style="whiteSpace=wrap;html=1;rounded=0;shadow=0;labelBackgroundColor=none;strokeWidth=1;fillColor=none;fontFamily=Verdana;fontSize=12;align=center;comic=1;" vertex="1" parent="1">
          <mxGeometry x="330" y="1410" width="250" height="50" as="geometry" />
        </mxCell>
        <mxCell id="QS-fFT0Z4BycfrMn5x45-29" value="" style="whiteSpace=wrap;html=1;rounded=0;shadow=0;labelBackgroundColor=none;strokeWidth=1;fillColor=none;fontFamily=Verdana;fontSize=12;align=center;comic=1;" vertex="1" parent="1">
          <mxGeometry y="1580" width="1100" height="120" as="geometry" />
        </mxCell>
        <mxCell id="QS-fFT0Z4BycfrMn5x45-30" value="&lt;span style=&quot;font-size: 38px;&quot;&gt;LOGO&lt;/span&gt;" style="whiteSpace=wrap;html=1;rounded=0;shadow=0;labelBackgroundColor=none;strokeWidth=1;fillColor=none;fontFamily=Verdana;fontSize=12;align=center;comic=1;" vertex="1" parent="1">
          <mxGeometry x="30" y="1600" width="170" height="50" as="geometry" />
        </mxCell>
        <mxCell id="QS-fFT0Z4BycfrMn5x45-31" value="&lt;span style=&quot;font-size: 30px;&quot;&gt;fsdfsdf dsfsdffsd dsfsfsf fsf sfsfs&lt;/span&gt;" style="text;html=1;strokeColor=none;fillColor=none;align=left;verticalAlign=middle;whiteSpace=wrap;rounded=0;strokeWidth=20;" vertex="1" parent="1">
          <mxGeometry x="30" y="1660" width="440" height="50" as="geometry" />
        </mxCell>
        <mxCell id="QS-fFT0Z4BycfrMn5x45-32" value="&lt;span style=&quot;font-size: 30px;&quot;&gt;fsdfsdf dsfsdffsd dsfsfsf fsf sfsfs&lt;/span&gt;" style="text;html=1;strokeColor=none;fillColor=none;align=left;verticalAlign=middle;whiteSpace=wrap;rounded=0;strokeWidth=20;" vertex="1" parent="1">
          <mxGeometry x="675" y="1660" width="440" height="30" as="geometry" />
        </mxCell>
        <mxCell id="QS-fFT0Z4BycfrMn5x45-33" value="" style="whiteSpace=wrap;html=1;rounded=0;shadow=0;labelBackgroundColor=none;strokeWidth=1;fillColor=none;fontFamily=Verdana;fontSize=12;align=center;comic=1;" vertex="1" parent="1">
          <mxGeometry y="1730" width="1100" height="820" as="geometry" />
        </mxCell>
        <mxCell id="QS-fFT0Z4BycfrMn5x45-34" value="" style="whiteSpace=wrap;html=1;rounded=0;shadow=0;labelBackgroundColor=none;strokeWidth=1;fillColor=none;fontFamily=Verdana;fontSize=12;align=center;comic=1;" vertex="1" parent="1">
          <mxGeometry y="1730" width="1100" height="100" as="geometry" />
        </mxCell>
        <mxCell id="QS-fFT0Z4BycfrMn5x45-35" value="&lt;font style=&quot;font-size: 38px;&quot;&gt;ALL NEWS&lt;/font&gt;" style="whiteSpace=wrap;html=1;rounded=0;shadow=0;labelBackgroundColor=none;strokeWidth=1;fillColor=none;fontFamily=Verdana;fontSize=12;align=center;comic=1;" vertex="1" parent="1">
          <mxGeometry x="20" y="1750" width="250" height="50" as="geometry" />
        </mxCell>
        <mxCell id="QS-fFT0Z4BycfrMn5x45-36" value="&lt;font style=&quot;font-size: 38px;&quot;&gt;LOGO&lt;/font&gt;" style="whiteSpace=wrap;html=1;rounded=0;shadow=0;labelBackgroundColor=none;strokeWidth=1;fillColor=none;fontFamily=Verdana;fontSize=12;align=center;comic=1;" vertex="1" parent="1">
          <mxGeometry x="820" y="1755" width="250" height="50" as="geometry" />
        </mxCell>
        <mxCell id="QS-fFT0Z4BycfrMn5x45-37" value="" style="whiteSpace=wrap;html=1;rounded=0;shadow=0;labelBackgroundColor=none;strokeWidth=1;fillColor=none;fontFamily=Verdana;fontSize=12;align=center;comic=1;" vertex="1" parent="1">
          <mxGeometry y="2430" width="1100" height="120" as="geometry" />
        </mxCell>
        <mxCell id="QS-fFT0Z4BycfrMn5x45-38" value="&lt;span style=&quot;font-size: 38px;&quot;&gt;LOGO&lt;/span&gt;" style="whiteSpace=wrap;html=1;rounded=0;shadow=0;labelBackgroundColor=none;strokeWidth=1;fillColor=none;fontFamily=Verdana;fontSize=12;align=center;comic=1;" vertex="1" parent="1">
          <mxGeometry x="15" y="2450" width="170" height="50" as="geometry" />
        </mxCell>
        <mxCell id="QS-fFT0Z4BycfrMn5x45-39" value="&lt;span style=&quot;font-size: 30px;&quot;&gt;fsdfsdf dsfsdffsd dsfsfsf fsf sfsfs&lt;/span&gt;" style="text;html=1;strokeColor=none;fillColor=none;align=left;verticalAlign=middle;whiteSpace=wrap;rounded=0;strokeWidth=20;" vertex="1" parent="1">
          <mxGeometry x="15" y="2510" width="440" height="50" as="geometry" />
        </mxCell>
        <mxCell id="QS-fFT0Z4BycfrMn5x45-40" value="&lt;span style=&quot;font-size: 30px;&quot;&gt;fsdfsdf dsfsdffsd dsfsfsf fsf sfsfs&lt;/span&gt;" style="text;html=1;strokeColor=none;fillColor=none;align=left;verticalAlign=middle;whiteSpace=wrap;rounded=0;strokeWidth=20;" vertex="1" parent="1">
          <mxGeometry x="660" y="2510" width="440" height="30" as="geometry" />
        </mxCell>
        <mxCell id="QS-fFT0Z4BycfrMn5x45-41" value="" style="whiteSpace=wrap;html=1;rounded=0;shadow=0;labelBackgroundColor=none;strokeWidth=1;fillColor=none;fontFamily=Verdana;fontSize=12;align=center;comic=1;" vertex="1" parent="1">
          <mxGeometry x="200" y="1860" width="720" height="550" as="geometry" />
        </mxCell>
        <mxCell id="QS-fFT0Z4BycfrMn5x45-42" value="" style="whiteSpace=wrap;html=1;rounded=0;shadow=0;labelBackgroundColor=none;strokeWidth=1;fillColor=none;fontFamily=Verdana;fontSize=12;align=center;comic=1;" vertex="1" parent="1">
          <mxGeometry x="245" y="1980" width="565" height="30" as="geometry" />
        </mxCell>
        <mxCell id="QS-fFT0Z4BycfrMn5x45-43" value="&lt;span style=&quot;font-size: 30px;&quot;&gt;CREATE A NEW ACCOUNT&lt;/span&gt;" style="text;html=1;strokeColor=none;fillColor=none;align=center;verticalAlign=middle;whiteSpace=wrap;rounded=0;strokeWidth=20;" vertex="1" parent="1">
          <mxGeometry x="362.5" y="1880" width="395" height="30" as="geometry" />
        </mxCell>
        <mxCell id="QS-fFT0Z4BycfrMn5x45-44" value="&lt;font style=&quot;font-size: 23px;&quot;&gt;Name&lt;/font&gt;" style="text;html=1;strokeColor=none;fillColor=none;align=left;verticalAlign=middle;whiteSpace=wrap;rounded=0;strokeWidth=16;" vertex="1" parent="1">
          <mxGeometry x="245" y="1940" width="395" height="30" as="geometry" />
        </mxCell>
        <mxCell id="QS-fFT0Z4BycfrMn5x45-45" value="" style="whiteSpace=wrap;html=1;rounded=0;shadow=0;labelBackgroundColor=none;strokeWidth=1;fillColor=none;fontFamily=Verdana;fontSize=12;align=center;comic=1;" vertex="1" parent="1">
          <mxGeometry x="245" y="2060" width="565" height="30" as="geometry" />
        </mxCell>
        <mxCell id="QS-fFT0Z4BycfrMn5x45-46" value="&lt;font style=&quot;font-size: 23px;&quot;&gt;Password&lt;/font&gt;" style="text;html=1;strokeColor=none;fillColor=none;align=left;verticalAlign=middle;whiteSpace=wrap;rounded=0;strokeWidth=20;" vertex="1" parent="1">
          <mxGeometry x="245" y="2020" width="395" height="30" as="geometry" />
        </mxCell>
        <mxCell id="QS-fFT0Z4BycfrMn5x45-47" value="&lt;span style=&quot;font-size: 38px;&quot;&gt;SIGNUP&lt;/span&gt;" style="whiteSpace=wrap;html=1;rounded=0;shadow=0;labelBackgroundColor=none;strokeWidth=1;fillColor=none;fontFamily=Verdana;fontSize=12;align=center;comic=1;" vertex="1" parent="1">
          <mxGeometry x="245" y="2340" width="250" height="50" as="geometry" />
        </mxCell>
        <mxCell id="QS-fFT0Z4BycfrMn5x45-48" value="" style="whiteSpace=wrap;html=1;rounded=0;shadow=0;labelBackgroundColor=none;strokeWidth=1;fillColor=none;fontFamily=Verdana;fontSize=12;align=center;comic=1;" vertex="1" parent="1">
          <mxGeometry x="245" y="2140" width="565" height="30" as="geometry" />
        </mxCell>
        <mxCell id="QS-fFT0Z4BycfrMn5x45-49" value="&lt;font style=&quot;font-size: 23px;&quot;&gt;Name&lt;/font&gt;" style="text;html=1;strokeColor=none;fillColor=none;align=left;verticalAlign=middle;whiteSpace=wrap;rounded=0;strokeWidth=16;" vertex="1" parent="1">
          <mxGeometry x="245" y="2100" width="395" height="30" as="geometry" />
        </mxCell>
        <mxCell id="QS-fFT0Z4BycfrMn5x45-50" value="" style="whiteSpace=wrap;html=1;rounded=0;shadow=0;labelBackgroundColor=none;strokeWidth=1;fillColor=none;fontFamily=Verdana;fontSize=12;align=center;comic=1;" vertex="1" parent="1">
          <mxGeometry x="245" y="2220" width="565" height="30" as="geometry" />
        </mxCell>
        <mxCell id="QS-fFT0Z4BycfrMn5x45-51" value="&lt;font style=&quot;font-size: 23px;&quot;&gt;Password&lt;/font&gt;" style="text;html=1;strokeColor=none;fillColor=none;align=left;verticalAlign=middle;whiteSpace=wrap;rounded=0;strokeWidth=20;" vertex="1" parent="1">
          <mxGeometry x="245" y="2180" width="395" height="30" as="geometry" />
        </mxCell>
        <mxCell id="QS-fFT0Z4BycfrMn5x45-52" value="&lt;span style=&quot;font-size: 23px;&quot;&gt;Role&lt;/span&gt;" style="text;html=1;strokeColor=none;fillColor=none;align=left;verticalAlign=middle;whiteSpace=wrap;rounded=0;strokeWidth=20;" vertex="1" parent="1">
          <mxGeometry x="245" y="2260" width="65" height="30" as="geometry" />
        </mxCell>
        <mxCell id="QS-fFT0Z4BycfrMn5x45-53" value="" style="ellipse;whiteSpace=wrap;html=1;aspect=fixed;" vertex="1" parent="1">
          <mxGeometry x="260" y="2300" width="20" height="20" as="geometry" />
        </mxCell>
        <mxCell id="QS-fFT0Z4BycfrMn5x45-54" value="&lt;span style=&quot;font-size: 23px;&quot;&gt;User&lt;/span&gt;" style="text;html=1;strokeColor=none;fillColor=none;align=left;verticalAlign=middle;whiteSpace=wrap;rounded=0;strokeWidth=20;" vertex="1" parent="1">
          <mxGeometry x="297.5" y="2295" width="65" height="30" as="geometry" />
        </mxCell>
        <mxCell id="QS-fFT0Z4BycfrMn5x45-55" value="" style="ellipse;whiteSpace=wrap;html=1;aspect=fixed;" vertex="1" parent="1">
          <mxGeometry x="390" y="2300" width="20" height="20" as="geometry" />
        </mxCell>
        <mxCell id="QS-fFT0Z4BycfrMn5x45-56" value="&lt;span style=&quot;font-size: 23px;&quot;&gt;Subject Matter Expert&lt;/span&gt;" style="text;html=1;strokeColor=none;fillColor=none;align=left;verticalAlign=middle;whiteSpace=wrap;rounded=0;strokeWidth=20;" vertex="1" parent="1">
          <mxGeometry x="427.5" y="2295" width="226.25" height="30" as="geometry" />
        </mxCell>
        <mxCell id="QS-fFT0Z4BycfrMn5x45-58" value="" style="ellipse;whiteSpace=wrap;html=1;aspect=fixed;" vertex="1" parent="1">
          <mxGeometry x="680" y="2300" width="20" height="20" as="geometry" />
        </mxCell>
        <mxCell id="QS-fFT0Z4BycfrMn5x45-59" value="&lt;span style=&quot;font-size: 23px;&quot;&gt;Pharmacist&lt;/span&gt;" style="text;html=1;strokeColor=none;fillColor=none;align=left;verticalAlign=middle;whiteSpace=wrap;rounded=0;strokeWidth=20;" vertex="1" parent="1">
          <mxGeometry x="717.5" y="2295" width="152.5" height="30" as="geometry" />
        </mxCell>
      </root>
    </mxGraphModel>
  </diagram>
</mxfile>
