<mxfile host="app.diagrams.net" modified="2022-10-12T09:49:41.945Z" agent="5.0 (Windows NT 10.0; Win64; x64) AppleWebKit/537.36 (KHTML, like Gecko) Chrome/106.0.0.0 Safari/537.36 Edg/106.0.1370.37" etag="u8n2Kavau1kJbrzn3uzd" version="20.4.0" type="gitlab">
  <diagram id="R2lEEEUBdFMjLlhIrx00" name="Page-1">
    <mxGraphModel dx="782" dy="507" grid="1" gridSize="10" guides="1" tooltips="1" connect="1" arrows="1" fold="1" page="1" pageScale="1" pageWidth="850" pageHeight="1100" math="0" shadow="0" extFonts="Permanent Marker^https://fonts.googleapis.com/css?family=Permanent+Marker">
      <root>
        <mxCell id="0" />
        <mxCell id="1" parent="0" />
        <mxCell id="GvkB3d7uIIih-cKA2Pvt-1" value="1" style="edgeStyle=none;rounded=0;orthogonalLoop=1;jettySize=auto;html=1;entryX=0;entryY=0.5;entryDx=0;entryDy=0;endArrow=none;endFill=0;" edge="1" parent="1" source="GvkB3d7uIIih-cKA2Pvt-3" target="GvkB3d7uIIih-cKA2Pvt-15">
          <mxGeometry relative="1" as="geometry" />
        </mxCell>
        <mxCell id="GvkB3d7uIIih-cKA2Pvt-2" value="1" style="edgeStyle=none;rounded=0;orthogonalLoop=1;jettySize=auto;html=1;entryX=0.5;entryY=0;entryDx=0;entryDy=0;endArrow=none;endFill=0;" edge="1" parent="1" source="GvkB3d7uIIih-cKA2Pvt-3" target="GvkB3d7uIIih-cKA2Pvt-18">
          <mxGeometry relative="1" as="geometry" />
        </mxCell>
        <mxCell id="GvkB3d7uIIih-cKA2Pvt-3" value="Admin" style="whiteSpace=wrap;html=1;align=center;" vertex="1" parent="1">
          <mxGeometry x="140" y="170" width="100" height="40" as="geometry" />
        </mxCell>
        <mxCell id="GvkB3d7uIIih-cKA2Pvt-4" value="1" style="edgeStyle=none;rounded=0;orthogonalLoop=1;jettySize=auto;html=1;exitX=0.5;exitY=1;exitDx=0;exitDy=0;entryX=0.5;entryY=0;entryDx=0;entryDy=0;endArrow=none;endFill=0;" edge="1" parent="1" source="GvkB3d7uIIih-cKA2Pvt-6" target="GvkB3d7uIIih-cKA2Pvt-36">
          <mxGeometry relative="1" as="geometry" />
        </mxCell>
        <mxCell id="GvkB3d7uIIih-cKA2Pvt-5" style="edgeStyle=none;rounded=0;orthogonalLoop=1;jettySize=auto;html=1;exitX=0.5;exitY=0;exitDx=0;exitDy=0;endArrow=none;endFill=0;" edge="1" parent="1" source="GvkB3d7uIIih-cKA2Pvt-6" target="GvkB3d7uIIih-cKA2Pvt-39">
          <mxGeometry relative="1" as="geometry" />
        </mxCell>
        <mxCell id="GvkB3d7uIIih-cKA2Pvt-6" value="User" style="whiteSpace=wrap;html=1;align=center;" vertex="1" parent="1">
          <mxGeometry x="570" y="170" width="100" height="40" as="geometry" />
        </mxCell>
        <mxCell id="GvkB3d7uIIih-cKA2Pvt-7" style="rounded=0;orthogonalLoop=1;jettySize=auto;html=1;exitX=1;exitY=0.5;exitDx=0;exitDy=0;entryX=0.5;entryY=0;entryDx=0;entryDy=0;endArrow=none;endFill=0;" edge="1" parent="1" source="GvkB3d7uIIih-cKA2Pvt-8" target="GvkB3d7uIIih-cKA2Pvt-3">
          <mxGeometry relative="1" as="geometry" />
        </mxCell>
        <mxCell id="GvkB3d7uIIih-cKA2Pvt-8" value="Name" style="ellipse;whiteSpace=wrap;html=1;align=center;" vertex="1" parent="1">
          <mxGeometry x="50" y="110" width="100" height="40" as="geometry" />
        </mxCell>
        <mxCell id="GvkB3d7uIIih-cKA2Pvt-9" style="edgeStyle=none;rounded=0;orthogonalLoop=1;jettySize=auto;html=1;exitX=0.5;exitY=1;exitDx=0;exitDy=0;entryX=0.5;entryY=0;entryDx=0;entryDy=0;endArrow=none;endFill=0;" edge="1" parent="1" source="GvkB3d7uIIih-cKA2Pvt-10" target="GvkB3d7uIIih-cKA2Pvt-3">
          <mxGeometry relative="1" as="geometry" />
        </mxCell>
        <mxCell id="GvkB3d7uIIih-cKA2Pvt-10" value="&lt;u&gt;Admin_ID&lt;/u&gt;" style="ellipse;whiteSpace=wrap;html=1;align=center;" vertex="1" parent="1">
          <mxGeometry x="100" y="62.5" width="100" height="40" as="geometry" />
        </mxCell>
        <mxCell id="GvkB3d7uIIih-cKA2Pvt-11" style="edgeStyle=none;rounded=0;orthogonalLoop=1;jettySize=auto;html=1;exitX=0.5;exitY=1;exitDx=0;exitDy=0;endArrow=none;endFill=0;" edge="1" parent="1" source="GvkB3d7uIIih-cKA2Pvt-12">
          <mxGeometry relative="1" as="geometry">
            <mxPoint x="190" y="170" as="targetPoint" />
          </mxGeometry>
        </mxCell>
        <mxCell id="GvkB3d7uIIih-cKA2Pvt-12" value="Address" style="ellipse;whiteSpace=wrap;html=1;align=center;" vertex="1" parent="1">
          <mxGeometry x="170" y="95" width="90" height="35" as="geometry" />
        </mxCell>
        <mxCell id="GvkB3d7uIIih-cKA2Pvt-13" style="edgeStyle=none;rounded=0;orthogonalLoop=1;jettySize=auto;html=1;exitX=1;exitY=0.5;exitDx=0;exitDy=0;entryX=0;entryY=0.5;entryDx=0;entryDy=0;endArrow=none;endFill=0;" edge="1" parent="1" source="GvkB3d7uIIih-cKA2Pvt-15" target="GvkB3d7uIIih-cKA2Pvt-6">
          <mxGeometry relative="1" as="geometry" />
        </mxCell>
        <mxCell id="GvkB3d7uIIih-cKA2Pvt-14" value="N" style="edgeLabel;html=1;align=center;verticalAlign=middle;resizable=0;points=[];" vertex="1" connectable="0" parent="GvkB3d7uIIih-cKA2Pvt-13">
          <mxGeometry x="0.55" y="-1" relative="1" as="geometry">
            <mxPoint as="offset" />
          </mxGeometry>
        </mxCell>
        <mxCell id="GvkB3d7uIIih-cKA2Pvt-15" value="Contact" style="shape=rhombus;perimeter=rhombusPerimeter;whiteSpace=wrap;html=1;align=center;" vertex="1" parent="1">
          <mxGeometry x="320" y="155" width="90" height="70" as="geometry" />
        </mxCell>
        <mxCell id="GvkB3d7uIIih-cKA2Pvt-16" value="1" style="edgeStyle=none;rounded=0;orthogonalLoop=1;jettySize=auto;html=1;exitX=0.5;exitY=1;exitDx=0;exitDy=0;entryX=0.5;entryY=0;entryDx=0;entryDy=0;endArrow=none;endFill=0;" edge="1" parent="1" source="GvkB3d7uIIih-cKA2Pvt-18" target="GvkB3d7uIIih-cKA2Pvt-23">
          <mxGeometry relative="1" as="geometry" />
        </mxCell>
        <mxCell id="GvkB3d7uIIih-cKA2Pvt-17" value="N" style="edgeStyle=none;rounded=0;orthogonalLoop=1;jettySize=auto;html=1;exitX=0;exitY=0.5;exitDx=0;exitDy=0;entryX=1;entryY=0.5;entryDx=0;entryDy=0;endArrow=none;endFill=0;" edge="1" parent="1" source="GvkB3d7uIIih-cKA2Pvt-18" target="GvkB3d7uIIih-cKA2Pvt-50">
          <mxGeometry relative="1" as="geometry" />
        </mxCell>
        <mxCell id="GvkB3d7uIIih-cKA2Pvt-18" value="Manages" style="shape=rhombus;perimeter=rhombusPerimeter;whiteSpace=wrap;html=1;align=center;" vertex="1" parent="1">
          <mxGeometry x="150" y="260" width="80" height="60" as="geometry" />
        </mxCell>
        <mxCell id="GvkB3d7uIIih-cKA2Pvt-19" style="edgeStyle=none;rounded=0;orthogonalLoop=1;jettySize=auto;html=1;exitX=0.5;exitY=1;exitDx=0;exitDy=0;entryX=0.5;entryY=0;entryDx=0;entryDy=0;endArrow=none;endFill=0;" edge="1" parent="1" source="GvkB3d7uIIih-cKA2Pvt-23" target="GvkB3d7uIIih-cKA2Pvt-24">
          <mxGeometry relative="1" as="geometry" />
        </mxCell>
        <mxCell id="GvkB3d7uIIih-cKA2Pvt-20" style="edgeStyle=none;rounded=0;orthogonalLoop=1;jettySize=auto;html=1;exitX=0.5;exitY=1;exitDx=0;exitDy=0;entryX=0;entryY=0.5;entryDx=0;entryDy=0;endArrow=none;endFill=0;" edge="1" parent="1" source="GvkB3d7uIIih-cKA2Pvt-23" target="GvkB3d7uIIih-cKA2Pvt-26">
          <mxGeometry relative="1" as="geometry" />
        </mxCell>
        <mxCell id="GvkB3d7uIIih-cKA2Pvt-21" style="edgeStyle=none;rounded=0;orthogonalLoop=1;jettySize=auto;html=1;exitX=0.5;exitY=1;exitDx=0;exitDy=0;entryX=1;entryY=0.5;entryDx=0;entryDy=0;endArrow=none;endFill=0;" edge="1" parent="1" source="GvkB3d7uIIih-cKA2Pvt-23" target="GvkB3d7uIIih-cKA2Pvt-25">
          <mxGeometry relative="1" as="geometry" />
        </mxCell>
        <mxCell id="GvkB3d7uIIih-cKA2Pvt-22" style="edgeStyle=none;rounded=0;orthogonalLoop=1;jettySize=auto;html=1;exitX=1;exitY=0;exitDx=0;exitDy=0;entryX=0;entryY=0.5;entryDx=0;entryDy=0;endArrow=none;endFill=0;" edge="1" parent="1" source="GvkB3d7uIIih-cKA2Pvt-23" target="GvkB3d7uIIih-cKA2Pvt-29">
          <mxGeometry relative="1" as="geometry" />
        </mxCell>
        <mxCell id="GvkB3d7uIIih-cKA2Pvt-23" value="Blood Bank" style="whiteSpace=wrap;html=1;align=center;" vertex="1" parent="1">
          <mxGeometry x="140" y="360" width="100" height="40" as="geometry" />
        </mxCell>
        <mxCell id="GvkB3d7uIIih-cKA2Pvt-24" value="Blood_slno" style="ellipse;whiteSpace=wrap;html=1;align=center;fontStyle=4;" vertex="1" parent="1">
          <mxGeometry x="150" y="440" width="80" height="40" as="geometry" />
        </mxCell>
        <mxCell id="GvkB3d7uIIih-cKA2Pvt-25" value="Blood Type" style="ellipse;whiteSpace=wrap;html=1;align=center;" vertex="1" parent="1">
          <mxGeometry x="40" y="400" width="100" height="40" as="geometry" />
        </mxCell>
        <mxCell id="GvkB3d7uIIih-cKA2Pvt-26" value="Blood Available" style="ellipse;whiteSpace=wrap;html=1;align=center;" vertex="1" parent="1">
          <mxGeometry x="240" y="410" width="100" height="40" as="geometry" />
        </mxCell>
        <mxCell id="GvkB3d7uIIih-cKA2Pvt-27" style="edgeStyle=none;rounded=0;orthogonalLoop=1;jettySize=auto;html=1;entryX=0;entryY=0.5;entryDx=0;entryDy=0;endArrow=none;endFill=0;" edge="1" parent="1" target="GvkB3d7uIIih-cKA2Pvt-32">
          <mxGeometry relative="1" as="geometry">
            <mxPoint x="240" y="380" as="sourcePoint" />
          </mxGeometry>
        </mxCell>
        <mxCell id="GvkB3d7uIIih-cKA2Pvt-28" value="1" style="edgeLabel;html=1;align=center;verticalAlign=middle;resizable=0;points=[];" vertex="1" connectable="0" parent="GvkB3d7uIIih-cKA2Pvt-27">
          <mxGeometry x="-0.4462" y="3" relative="1" as="geometry">
            <mxPoint as="offset" />
          </mxGeometry>
        </mxCell>
        <mxCell id="GvkB3d7uIIih-cKA2Pvt-29" value="Issues" style="ellipse;whiteSpace=wrap;html=1;align=center;" vertex="1" parent="1">
          <mxGeometry x="280" y="300" width="100" height="40" as="geometry" />
        </mxCell>
        <mxCell id="GvkB3d7uIIih-cKA2Pvt-30" style="edgeStyle=none;rounded=0;orthogonalLoop=1;jettySize=auto;html=1;exitX=1;exitY=0.5;exitDx=0;exitDy=0;entryX=0;entryY=0.5;entryDx=0;entryDy=0;endArrow=none;endFill=0;" edge="1" parent="1" source="GvkB3d7uIIih-cKA2Pvt-32" target="GvkB3d7uIIih-cKA2Pvt-34">
          <mxGeometry relative="1" as="geometry" />
        </mxCell>
        <mxCell id="GvkB3d7uIIih-cKA2Pvt-31" value="N" style="edgeLabel;html=1;align=center;verticalAlign=middle;resizable=0;points=[];" vertex="1" connectable="0" parent="GvkB3d7uIIih-cKA2Pvt-30">
          <mxGeometry x="0.26" y="2" relative="1" as="geometry">
            <mxPoint as="offset" />
          </mxGeometry>
        </mxCell>
        <mxCell id="GvkB3d7uIIih-cKA2Pvt-32" value="Stored" style="shape=rhombus;perimeter=rhombusPerimeter;whiteSpace=wrap;html=1;align=center;" vertex="1" parent="1">
          <mxGeometry x="370" y="350" width="100" height="60" as="geometry" />
        </mxCell>
        <mxCell id="GvkB3d7uIIih-cKA2Pvt-33" style="edgeStyle=none;rounded=0;orthogonalLoop=1;jettySize=auto;html=1;entryX=0.5;entryY=0;entryDx=0;entryDy=0;endArrow=none;endFill=0;" edge="1" parent="1" source="GvkB3d7uIIih-cKA2Pvt-34" target="GvkB3d7uIIih-cKA2Pvt-48">
          <mxGeometry relative="1" as="geometry" />
        </mxCell>
        <mxCell id="GvkB3d7uIIih-cKA2Pvt-34" value="Blood" style="shape=ext;margin=3;double=1;whiteSpace=wrap;html=1;align=center;" vertex="1" parent="1">
          <mxGeometry x="570" y="360" width="100" height="40" as="geometry" />
        </mxCell>
        <mxCell id="GvkB3d7uIIih-cKA2Pvt-35" value="N" style="edgeStyle=none;rounded=0;orthogonalLoop=1;jettySize=auto;html=1;exitX=0.5;exitY=1;exitDx=0;exitDy=0;endArrow=none;endFill=0;" edge="1" parent="1" source="GvkB3d7uIIih-cKA2Pvt-36" target="GvkB3d7uIIih-cKA2Pvt-34">
          <mxGeometry relative="1" as="geometry" />
        </mxCell>
        <mxCell id="GvkB3d7uIIih-cKA2Pvt-36" value="Donate" style="shape=rhombus;perimeter=rhombusPerimeter;whiteSpace=wrap;html=1;align=center;" vertex="1" parent="1">
          <mxGeometry x="575" y="250" width="90" height="60" as="geometry" />
        </mxCell>
        <mxCell id="GvkB3d7uIIih-cKA2Pvt-37" style="edgeStyle=none;rounded=0;orthogonalLoop=1;jettySize=auto;html=1;exitX=1;exitY=1;exitDx=0;exitDy=0;endArrow=none;endFill=0;" edge="1" parent="1" source="GvkB3d7uIIih-cKA2Pvt-38">
          <mxGeometry relative="1" as="geometry">
            <mxPoint x="620" y="170" as="targetPoint" />
          </mxGeometry>
        </mxCell>
        <mxCell id="GvkB3d7uIIih-cKA2Pvt-38" value="Age" style="ellipse;whiteSpace=wrap;html=1;align=center;" vertex="1" parent="1">
          <mxGeometry x="495" y="100" width="75" height="30" as="geometry" />
        </mxCell>
        <mxCell id="GvkB3d7uIIih-cKA2Pvt-39" value="Name" style="ellipse;whiteSpace=wrap;html=1;align=center;" vertex="1" parent="1">
          <mxGeometry x="470" y="140" width="80" height="35" as="geometry" />
        </mxCell>
        <mxCell id="GvkB3d7uIIih-cKA2Pvt-40" style="edgeStyle=none;rounded=0;orthogonalLoop=1;jettySize=auto;html=1;exitX=0.5;exitY=1;exitDx=0;exitDy=0;endArrow=none;endFill=0;" edge="1" parent="1" source="GvkB3d7uIIih-cKA2Pvt-41">
          <mxGeometry relative="1" as="geometry">
            <mxPoint x="620" y="170" as="targetPoint" />
          </mxGeometry>
        </mxCell>
        <mxCell id="GvkB3d7uIIih-cKA2Pvt-41" value="Gender" style="ellipse;whiteSpace=wrap;html=1;align=center;" vertex="1" parent="1">
          <mxGeometry x="550" y="65" width="70" height="35" as="geometry" />
        </mxCell>
        <mxCell id="GvkB3d7uIIih-cKA2Pvt-42" style="edgeStyle=none;rounded=0;orthogonalLoop=1;jettySize=auto;html=1;entryX=0.5;entryY=0;entryDx=0;entryDy=0;endArrow=none;endFill=0;" edge="1" parent="1" source="GvkB3d7uIIih-cKA2Pvt-43" target="GvkB3d7uIIih-cKA2Pvt-6">
          <mxGeometry relative="1" as="geometry" />
        </mxCell>
        <mxCell id="GvkB3d7uIIih-cKA2Pvt-43" value="User_Id" style="ellipse;whiteSpace=wrap;html=1;align=center;fontStyle=4;" vertex="1" parent="1">
          <mxGeometry x="600" y="90" width="100" height="40" as="geometry" />
        </mxCell>
        <mxCell id="GvkB3d7uIIih-cKA2Pvt-44" style="edgeStyle=none;rounded=0;orthogonalLoop=1;jettySize=auto;html=1;exitX=0;exitY=0.5;exitDx=0;exitDy=0;endArrow=none;endFill=0;" edge="1" parent="1" source="GvkB3d7uIIih-cKA2Pvt-45">
          <mxGeometry relative="1" as="geometry">
            <mxPoint x="620" y="170" as="targetPoint" />
          </mxGeometry>
        </mxCell>
        <mxCell id="GvkB3d7uIIih-cKA2Pvt-45" value="Contact" style="ellipse;whiteSpace=wrap;html=1;align=center;" vertex="1" parent="1">
          <mxGeometry x="680" y="120" width="80" height="35" as="geometry" />
        </mxCell>
        <mxCell id="GvkB3d7uIIih-cKA2Pvt-46" style="edgeStyle=none;rounded=0;orthogonalLoop=1;jettySize=auto;html=1;exitX=0.5;exitY=0;exitDx=0;exitDy=0;endArrow=none;endFill=0;" edge="1" parent="1" source="GvkB3d7uIIih-cKA2Pvt-47">
          <mxGeometry relative="1" as="geometry">
            <mxPoint x="620" y="170" as="targetPoint" />
          </mxGeometry>
        </mxCell>
        <mxCell id="GvkB3d7uIIih-cKA2Pvt-47" value="Address" style="ellipse;whiteSpace=wrap;html=1;align=center;" vertex="1" parent="1">
          <mxGeometry x="690" y="155" width="80" height="35" as="geometry" />
        </mxCell>
        <mxCell id="GvkB3d7uIIih-cKA2Pvt-48" value="Blood Type" style="ellipse;whiteSpace=wrap;html=1;align=center;" vertex="1" parent="1">
          <mxGeometry x="580" y="430" width="80" height="35" as="geometry" />
        </mxCell>
        <mxCell id="GvkB3d7uIIih-cKA2Pvt-49" style="edgeStyle=none;rounded=0;orthogonalLoop=1;jettySize=auto;html=1;exitX=0.5;exitY=0;exitDx=0;exitDy=0;entryX=0.5;entryY=1;entryDx=0;entryDy=0;endArrow=none;endFill=0;" edge="1" parent="1" source="GvkB3d7uIIih-cKA2Pvt-50" target="GvkB3d7uIIih-cKA2Pvt-51">
          <mxGeometry relative="1" as="geometry" />
        </mxCell>
        <mxCell id="GvkB3d7uIIih-cKA2Pvt-50" value="Blood News" style="whiteSpace=wrap;html=1;align=center;" vertex="1" parent="1">
          <mxGeometry x="30" y="270" width="80" height="40" as="geometry" />
        </mxCell>
        <mxCell id="GvkB3d7uIIih-cKA2Pvt-51" value="required blood" style="ellipse;whiteSpace=wrap;html=1;align=center;" vertex="1" parent="1">
          <mxGeometry x="30" y="210" width="100" height="40" as="geometry" />
        </mxCell>
        <mxCell id="GvkB3d7uIIih-cKA2Pvt-52" style="edgeStyle=none;html=1;exitX=0;exitY=0.5;exitDx=0;exitDy=0;entryX=0.5;entryY=0;entryDx=0;entryDy=0;startArrow=none;startFill=0;endArrow=none;endFill=0;" edge="1" parent="1" source="GvkB3d7uIIih-cKA2Pvt-53" target="GvkB3d7uIIih-cKA2Pvt-3">
          <mxGeometry relative="1" as="geometry" />
        </mxCell>
        <mxCell id="GvkB3d7uIIih-cKA2Pvt-53" value="Email" style="ellipse;whiteSpace=wrap;html=1;align=center;" vertex="1" parent="1">
          <mxGeometry x="230" y="130" width="70" height="30" as="geometry" />
        </mxCell>
        <mxCell id="GvkB3d7uIIih-cKA2Pvt-54" style="edgeStyle=none;html=1;exitX=0;exitY=0;exitDx=0;exitDy=0;startArrow=none;startFill=0;endArrow=none;endFill=0;entryX=1;entryY=0.25;entryDx=0;entryDy=0;" edge="1" parent="1" source="GvkB3d7uIIih-cKA2Pvt-55" target="GvkB3d7uIIih-cKA2Pvt-6">
          <mxGeometry relative="1" as="geometry">
            <mxPoint x="680" y="190" as="targetPoint" />
          </mxGeometry>
        </mxCell>
        <mxCell id="GvkB3d7uIIih-cKA2Pvt-55" value="Email" style="ellipse;whiteSpace=wrap;html=1;align=center;" vertex="1" parent="1">
          <mxGeometry x="700" y="200" width="80" height="35" as="geometry" />
        </mxCell>
      </root>
    </mxGraphModel>
  </diagram>
</mxfile>
