<mxfile host="app.diagrams.net" modified="2022-10-22T14:40:24.492Z" agent="5.0 (Windows NT 10.0; Win64; x64) AppleWebKit/537.36 (KHTML, like Gecko) Chrome/106.0.0.0 Safari/537.36" etag="yW8WlltmnZM7zMeV-FwP" version="20.5.1" type="gitlab">
  <diagram name="Page-1" id="edf60f1a-56cd-e834-aa8a-f176f3a09ee4">
    <mxGraphModel dx="920" dy="504" grid="1" gridSize="10" guides="1" tooltips="1" connect="1" arrows="1" fold="1" page="1" pageScale="1" pageWidth="1100" pageHeight="850" background="none" math="0" shadow="0">
      <root>
        <mxCell id="0" />
        <mxCell id="1" parent="0" />
        <mxCell id="tve4OgrLAkWNDYDPcah2-6" style="edgeStyle=orthogonalEdgeStyle;rounded=0;orthogonalLoop=1;jettySize=auto;html=1;fontSize=14;" parent="1" source="tve4OgrLAkWNDYDPcah2-1" target="tve4OgrLAkWNDYDPcah2-2" edge="1">
          <mxGeometry relative="1" as="geometry">
            <Array as="points">
              <mxPoint x="560" y="150" />
              <mxPoint x="270" y="150" />
            </Array>
          </mxGeometry>
        </mxCell>
        <mxCell id="tve4OgrLAkWNDYDPcah2-7" style="edgeStyle=orthogonalEdgeStyle;rounded=0;orthogonalLoop=1;jettySize=auto;html=1;fontSize=14;" parent="1" source="tve4OgrLAkWNDYDPcah2-1" target="tve4OgrLAkWNDYDPcah2-3" edge="1">
          <mxGeometry relative="1" as="geometry" />
        </mxCell>
        <mxCell id="tve4OgrLAkWNDYDPcah2-8" style="edgeStyle=orthogonalEdgeStyle;rounded=0;orthogonalLoop=1;jettySize=auto;html=1;fontSize=14;" parent="1" source="tve4OgrLAkWNDYDPcah2-1" target="tve4OgrLAkWNDYDPcah2-4" edge="1">
          <mxGeometry relative="1" as="geometry">
            <Array as="points">
              <mxPoint x="560" y="150" />
              <mxPoint x="850" y="150" />
            </Array>
          </mxGeometry>
        </mxCell>
        <mxCell id="tve4OgrLAkWNDYDPcah2-1" value="&lt;span style=&quot;font-size: 14px;&quot;&gt;&lt;b&gt;BEAUTIFUL BLOSSOMS&lt;/b&gt;&lt;/span&gt;" style="rounded=1;whiteSpace=wrap;html=1;arcSize=28;fillColor=#cce5ff;strokeColor=#36393d;" parent="1" vertex="1">
          <mxGeometry x="465" y="80" width="190" height="40" as="geometry" />
        </mxCell>
        <mxCell id="tve4OgrLAkWNDYDPcah2-9" style="edgeStyle=orthogonalEdgeStyle;rounded=0;orthogonalLoop=1;jettySize=auto;html=1;entryX=0;entryY=0.5;entryDx=0;entryDy=0;fontSize=14;" parent="1" source="tve4OgrLAkWNDYDPcah2-2" target="aW0D4UOQ3NHyDsVJmWrY-1" edge="1">
          <mxGeometry relative="1" as="geometry">
            <Array as="points">
              <mxPoint x="230" y="610" />
            </Array>
          </mxGeometry>
        </mxCell>
        <mxCell id="tve4OgrLAkWNDYDPcah2-2" value="&lt;font style=&quot;font-size: 14px;&quot;&gt;HOME&lt;/font&gt;" style="rounded=1;whiteSpace=wrap;html=1;arcSize=28;fillColor=#cdeb8b;strokeColor=#36393d;" parent="1" vertex="1">
          <mxGeometry x="210" y="190" width="120" height="40" as="geometry" />
        </mxCell>
        <mxCell id="8I3xzlGcJTOfMhHh1ifV-8" style="edgeStyle=orthogonalEdgeStyle;rounded=0;orthogonalLoop=1;jettySize=auto;html=1;exitX=0.34;exitY=1;exitDx=0;exitDy=0;entryX=0;entryY=0.5;entryDx=0;entryDy=0;exitPerimeter=0;" edge="1" parent="1" source="tve4OgrLAkWNDYDPcah2-3" target="8I3xzlGcJTOfMhHh1ifV-10">
          <mxGeometry relative="1" as="geometry">
            <Array as="points">
              <mxPoint x="539" y="232" />
              <mxPoint x="540" y="232" />
              <mxPoint x="540" y="540" />
            </Array>
          </mxGeometry>
        </mxCell>
        <mxCell id="tve4OgrLAkWNDYDPcah2-3" value="&lt;span style=&quot;font-size: 14px;&quot;&gt;SPECIAL EVENTS&lt;/span&gt;" style="rounded=1;whiteSpace=wrap;html=1;arcSize=28;fillColor=#cdeb8b;strokeColor=#36393d;" parent="1" vertex="1">
          <mxGeometry x="495" y="190" width="130" height="40" as="geometry" />
        </mxCell>
        <mxCell id="tve4OgrLAkWNDYDPcah2-4" value="&lt;span style=&quot;font-size: 14px;&quot;&gt;ABOUT&lt;/span&gt;" style="rounded=1;whiteSpace=wrap;html=1;arcSize=28;fillColor=#cdeb8b;strokeColor=#36393d;" parent="1" vertex="1">
          <mxGeometry x="790" y="190" width="120" height="40" as="geometry" />
        </mxCell>
        <mxCell id="tve4OgrLAkWNDYDPcah2-11" style="edgeStyle=orthogonalEdgeStyle;rounded=0;orthogonalLoop=1;jettySize=auto;html=1;entryX=0;entryY=0.5;entryDx=0;entryDy=0;fontSize=14;" parent="1" source="tve4OgrLAkWNDYDPcah2-5" target="tve4OgrLAkWNDYDPcah2-10" edge="1">
          <mxGeometry relative="1" as="geometry">
            <Array as="points">
              <mxPoint x="280" y="370" />
            </Array>
          </mxGeometry>
        </mxCell>
        <mxCell id="aW0D4UOQ3NHyDsVJmWrY-2" style="edgeStyle=orthogonalEdgeStyle;rounded=0;orthogonalLoop=1;jettySize=auto;html=1;startArrow=classic;startFill=1;endArrow=none;endFill=0;" parent="1" source="tve4OgrLAkWNDYDPcah2-5" edge="1">
          <mxGeometry relative="1" as="geometry">
            <mxPoint x="230" y="290" as="targetPoint" />
          </mxGeometry>
        </mxCell>
        <mxCell id="tve4OgrLAkWNDYDPcah2-5" value="&lt;span style=&quot;font-size: 14px;&quot;&gt;CUSTOM FLORALS&lt;/span&gt;" style="rounded=1;whiteSpace=wrap;html=1;arcSize=28;fillColor=#ffcc99;strokeColor=#36393d;" parent="1" vertex="1">
          <mxGeometry x="270" y="270" width="130" height="40" as="geometry" />
        </mxCell>
        <mxCell id="tve4OgrLAkWNDYDPcah2-18" style="edgeStyle=orthogonalEdgeStyle;rounded=0;orthogonalLoop=1;jettySize=auto;html=1;entryX=0;entryY=0.5;entryDx=0;entryDy=0;fontSize=14;" parent="1" target="tve4OgrLAkWNDYDPcah2-12" edge="1">
          <mxGeometry relative="1" as="geometry">
            <mxPoint x="373" y="390" as="sourcePoint" />
            <Array as="points">
              <mxPoint x="310" y="390" />
              <mxPoint x="310" y="440" />
            </Array>
          </mxGeometry>
        </mxCell>
        <mxCell id="tve4OgrLAkWNDYDPcah2-10" value="&lt;span style=&quot;font-size: 14px;&quot;&gt;ADD TO CART&lt;/span&gt;" style="rounded=1;whiteSpace=wrap;html=1;arcSize=28;fillColor=#ffcccc;strokeColor=#36393d;" parent="1" vertex="1">
          <mxGeometry x="300" y="350" width="120" height="40" as="geometry" />
        </mxCell>
        <mxCell id="aW0D4UOQ3NHyDsVJmWrY-3" style="edgeStyle=orthogonalEdgeStyle;rounded=0;orthogonalLoop=1;jettySize=auto;html=1;startArrow=none;startFill=0;endArrow=classic;endFill=1;" parent="1" source="tve4OgrLAkWNDYDPcah2-12" edge="1">
          <mxGeometry relative="1" as="geometry">
            <mxPoint x="390" y="520" as="targetPoint" />
            <Array as="points">
              <mxPoint x="360" y="520" />
            </Array>
          </mxGeometry>
        </mxCell>
        <mxCell id="tve4OgrLAkWNDYDPcah2-12" value="&lt;span style=&quot;font-size: 14px;&quot;&gt;CHECKOUT&lt;/span&gt;" style="rounded=1;whiteSpace=wrap;html=1;arcSize=28;fillColor=#ffff88;strokeColor=#36393d;" parent="1" vertex="1">
          <mxGeometry x="345" y="420" width="120" height="40" as="geometry" />
        </mxCell>
        <mxCell id="tve4OgrLAkWNDYDPcah2-13" value="&lt;span style=&quot;font-size: 14px;&quot;&gt;CONFIRM ORDER&lt;/span&gt;" style="rounded=1;whiteSpace=wrap;html=1;arcSize=28;fillColor=#CCCCFF;" parent="1" vertex="1">
          <mxGeometry x="390" y="500" width="120" height="40" as="geometry" />
        </mxCell>
        <mxCell id="aW0D4UOQ3NHyDsVJmWrY-1" value="&lt;span style=&quot;font-size: 14px;&quot;&gt;CONTACT&lt;/span&gt;" style="rounded=1;whiteSpace=wrap;html=1;arcSize=28;fillColor=#ffcc99;strokeColor=#36393d;" parent="1" vertex="1">
          <mxGeometry x="270" y="590" width="130" height="40" as="geometry" />
        </mxCell>
        <mxCell id="8I3xzlGcJTOfMhHh1ifV-3" value="&lt;span style=&quot;font-size: 14px;&quot;&gt;WEDDINGS&lt;/span&gt;" style="rounded=1;whiteSpace=wrap;html=1;arcSize=28;fillColor=#ffcc99;strokeColor=#36393d;" vertex="1" parent="1">
          <mxGeometry x="590" y="270" width="130" height="40" as="geometry" />
        </mxCell>
        <mxCell id="8I3xzlGcJTOfMhHh1ifV-4" value="&lt;span style=&quot;font-size: 14px;&quot;&gt;BIRTHDAYS&lt;/span&gt;" style="rounded=1;whiteSpace=wrap;html=1;arcSize=28;fillColor=#ffcc99;strokeColor=#36393d;" vertex="1" parent="1">
          <mxGeometry x="590" y="350" width="130" height="40" as="geometry" />
        </mxCell>
        <mxCell id="8I3xzlGcJTOfMhHh1ifV-15" style="edgeStyle=orthogonalEdgeStyle;rounded=0;orthogonalLoop=1;jettySize=auto;html=1;startArrow=classic;startFill=1;endArrow=none;endFill=0;" edge="1" parent="1" source="8I3xzlGcJTOfMhHh1ifV-9">
          <mxGeometry relative="1" as="geometry">
            <mxPoint x="540" y="460" as="targetPoint" />
          </mxGeometry>
        </mxCell>
        <mxCell id="8I3xzlGcJTOfMhHh1ifV-9" value="&lt;span style=&quot;font-size: 14px;&quot;&gt;ANNVIERSARIES&lt;/span&gt;" style="rounded=1;whiteSpace=wrap;html=1;arcSize=28;fillColor=#ffcc99;strokeColor=#36393d;" vertex="1" parent="1">
          <mxGeometry x="590" y="440" width="130" height="40" as="geometry" />
        </mxCell>
        <mxCell id="8I3xzlGcJTOfMhHh1ifV-10" value="&lt;span style=&quot;font-size: 14px;&quot;&gt;GRADUATIONS&lt;/span&gt;" style="rounded=1;whiteSpace=wrap;html=1;arcSize=28;fillColor=#ffcc99;strokeColor=#36393d;" vertex="1" parent="1">
          <mxGeometry x="590" y="520" width="130" height="40" as="geometry" />
        </mxCell>
        <mxCell id="8I3xzlGcJTOfMhHh1ifV-16" style="edgeStyle=orthogonalEdgeStyle;rounded=0;orthogonalLoop=1;jettySize=auto;html=1;startArrow=classic;startFill=1;endArrow=none;endFill=0;exitX=0;exitY=0.5;exitDx=0;exitDy=0;" edge="1" parent="1" source="8I3xzlGcJTOfMhHh1ifV-4">
          <mxGeometry relative="1" as="geometry">
            <mxPoint x="540" y="370" as="targetPoint" />
            <mxPoint x="600" y="470" as="sourcePoint" />
          </mxGeometry>
        </mxCell>
      </root>
    </mxGraphModel>
  </diagram>
</mxfile>
