$ autocannon -w 12 -a 10000 http://localhost:8080/
Running 10000 requests test @ http://localhost:8080/
10 connections
12 workers

┌─────────┬───────┬────────┬────────┬────────┬───────────┬──────────┬────────┐
│ Stat    │ 2.5%  │ 50%    │ 97.5%  │ 99%    │ Avg       │ Stdev    │ Max    │
├─────────┼───────┼────────┼────────┼────────┼───────────┼──────────┼────────┤
│ Latency │ 18 ms │ 100 ms │ 295 ms │ 739 ms │ 114.36 ms │ 98.18 ms │ 793 ms │
└─────────┴───────┴────────┴────────┴────────┴───────────┴──────────┴────────┘
┌───────────┬────────┬────────┬────────┬────────┬────────┬────────┬────────┐
│ Stat      │ 1%     │ 2.5%   │ 50%    │ 97.5%  │ Avg    │ Stdev  │ Min    │
├───────────┼────────┼────────┼────────┼────────┼────────┼────────┼────────┤
│ Req/Sec   │ 174    │ 174    │ 516    │ 594    │ 471.43 │ 124.57 │ 174    │
├───────────┼────────┼────────┼────────┼────────┼────────┼────────┼────────┤
│ Bytes/Sec │ 151 kB │ 151 kB │ 447 kB │ 515 kB │ 408 kB │ 108 kB │ 151 kB │
└───────────┴────────┴────────┴────────┴────────┴────────┴────────┴────────┘

Req/Bytes counts sampled once per second.

10k requests in 21.02s, 8.57 MB read
23 errors (0 timeouts)