Design Route Status
                                               :      # nets :
   ------------------------------------------- : ----------- :
   # of logical nets.......................... :        2729 :
       # of nets not needing routing.......... :        1589 :
           # of internally routed nets........ :        1589 :
       # of routable nets..................... :        1140 :
           # of fully routed nets............. :        1140 :
       # of nets with routing errors.......... :           0 :
   ------------------------------------------- : ----------- :

