Design Route Status
                                               :      # nets :
   ------------------------------------------- : ----------- :
   # of logical nets.......................... :        3234 :
       # of nets not needing routing.......... :        1706 :
           # of internally routed nets........ :        1706 :
       # of routable nets..................... :        1528 :
           # of fully routed nets............. :        1528 :
       # of nets with routing errors.......... :           0 :
   ------------------------------------------- : ----------- :

