verilog xil_defaultlib --include "../../../../oefening_3.srcs/sources_1/bd/block_design/ipshared/ec67/hdl" --include "../../../../oefening_3.srcs/sources_1/bd/block_design/ipshared/5bb9/hdl/verilog" --include "../../../../oefening_3.srcs/sources_1/bd/block_design/ipshared/70fd/hdl" \
"../../../bd/block_design/ip/block_design_processing_system7_0_0/sim/block_design_processing_system7_0_0.v" \
"../../../bd/block_design/ip/block_design_auto_pc_0/sim/block_design_auto_pc_0.v" \

verilog xil_defaultlib "glbl.v"

nosort
