#-----------------------------------------------------------
# Webtalk v2014.3 (64-bit)
# SW Build 1018564 on Mon Sep 15 18:49:35 MDT 2014
# 
# Start of session at: Thu Sep 25 18:59:22 2014
# Process ID: 314004
# Log file: C:/PROJECT_FOR_RELEASE/zc702_GigE/HW/project_1/project_1.sdk/webtalk/webtalk.log
# Journal file: C:/PROJECT_FOR_RELEASE/zc702_GigE/HW/project_1/project_1.sdk/webtalk\webtalk.jou
#-----------------------------------------------------------
WARNING: [Common 17-204] Your XILINX environment variable is undefined. You will not be able to run Synthesis and Implementation using ISE based strategies, or import ngc netlists. Please set up your XILINX environment to get full functionality.
source sdk_webtalk.tcl
# webtalk_init -webtalk_dir C:\\PROJECT_FOR_RELEASE\\zc702_GigE\\HW\\project_1\\project_1.sdk\\webtalk
# webtalk_register_client -client project
# webtalk_add_data -client project -key date_generated -value "Thu Sep 25 18:59:15 2014" -context "software_version_and_target_device"
# webtalk_add_data -client project -key product_version -value "SDK v2014.3" -context "software_version_and_target_device"
# webtalk_add_data -client project -key build_version -value "2014.3" -context "software_version_and_target_device"
# webtalk_add_data -client project -key os_platform -value "amd64" -context "software_version_and_target_device"
# webtalk_add_data -client project -key registration_id -value "" -context "software_version_and_target_device"
# webtalk_add_data -client project -key tool_flow -value "SDK" -context "software_version_and_target_device"
# webtalk_add_data -client project -key beta -value "false" -context "software_version_and_target_device"
# webtalk_add_data -client project -key route_design -value "NA" -context "software_version_and_target_device"
# webtalk_add_data -client project -key target_family -value "NA" -context "software_version_and_target_device"
# webtalk_add_data -client project -key target_device -value "NA" -context "software_version_and_target_device"
# webtalk_add_data -client project -key target_package -value "NA" -context "software_version_and_target_device"
# webtalk_add_data -client project -key target_speed -value "NA" -context "software_version_and_target_device"
# webtalk_add_data -client project -key random_id -value "lpopfnh5snrcg9h92r90gksh3o" -context "software_version_and_target_device"
# webtalk_add_data -client project -key project_id -value "2014.3_11" -context "software_version_and_target_device"
# webtalk_add_data -client project -key project_iteration -value "11" -context "software_version_and_target_device"
# webtalk_add_data -client project -key os_name -value "" -context "user_environment"
# webtalk_add_data -client project -key os_release -value "" -context "user_environment"
# webtalk_add_data -client project -key cpu_name -value "" -context "user_environment"
# webtalk_add_data -client project -key cpu_speed -value "" -context "user_environment"
# webtalk_add_data -client project -key total_processors -value "" -context "user_environment"
# webtalk_add_data -client project -key system_ram -value "" -context "user_environment"
# webtalk_register_client -client sdk
# webtalk_add_data -client sdk -key uid -value "1411641662848" -context "sdk\\\\hardware/1411641662848"
# webtalk_add_data -client sdk -key isZynq -value "true" -context "sdk\\\\hardware/1411641662848"
# webtalk_add_data -client sdk -key Processors -value "2" -context "sdk\\\\hardware/1411641662848"
# webtalk_add_data -client sdk -key VivadoVersion -value "2014.3" -context "sdk\\\\hardware/1411641662848"
# webtalk_add_data -client sdk -key Arch -value "zynq" -context "sdk\\\\hardware/1411641662848"
# webtalk_add_data -client sdk -key Device -value "7z020" -context "sdk\\\\hardware/1411641662848"
# webtalk_add_data -client sdk -key IsHandoff -value "true" -context "sdk\\\\hardware/1411641662848"
# webtalk_add_data -client sdk -key uid -value "1411641721165" -context "sdk\\\\bsp/1411641721165"
# webtalk_add_data -client sdk -key hwid -value "1411641662848" -context "sdk\\\\bsp/1411641721165"
# webtalk_add_data -client sdk -key os -value "standalone" -context "sdk\\\\bsp/1411641721165"
# webtalk_add_data -client sdk -key apptemplate -value "zynq_fsbl" -context "sdk\\\\bsp/1411641721165"
# webtalk_add_data -client sdk -key uid -value "1411641726512" -context "sdk\\\\application/1411641726512"
# webtalk_add_data -client sdk -key hwid -value "1411641662848" -context "sdk\\\\application/1411641726512"
# webtalk_add_data -client sdk -key bspid -value "1411641721165" -context "sdk\\\\application/1411641726512"
# webtalk_add_data -client sdk -key newbsp -value "true" -context "sdk\\\\application/1411641726512"
# webtalk_add_data -client sdk -key os -value "standalone" -context "sdk\\\\application/1411641726512"
# webtalk_add_data -client sdk -key apptemplate -value "zynq_fsbl" -context "sdk\\\\application/1411641726512"
# webtalk_add_data -client sdk -key uid -value "1411641796309" -context "sdk\\\\bsp/1411641796309"
# webtalk_add_data -client sdk -key hwid -value "1411641662848" -context "sdk\\\\bsp/1411641796309"
# webtalk_add_data -client sdk -key os -value "standalone" -context "sdk\\\\bsp/1411641796309"
# webtalk_add_data -client sdk -key apptemplate -value "empty_application" -context "sdk\\\\bsp/1411641796309"
# webtalk_add_data -client sdk -key uid -value "1411641800561" -context "sdk\\\\application/1411641800561"
# webtalk_add_data -client sdk -key hwid -value "1411641662848" -context "sdk\\\\application/1411641800561"
# webtalk_add_data -client sdk -key bspid -value "1411641796309" -context "sdk\\\\application/1411641800561"
# webtalk_add_data -client sdk -key newbsp -value "true" -context "sdk\\\\application/1411641800561"
# webtalk_add_data -client sdk -key os -value "standalone" -context "sdk\\\\application/1411641800561"
# webtalk_add_data -client sdk -key apptemplate -value "empty_application" -context "sdk\\\\application/1411641800561"
# webtalk_add_data -client sdk -key uid -value "1411642570843" -context "sdk\\\\bsp/1411642570843"
# webtalk_add_data -client sdk -key hwid -value "1411641662848" -context "sdk\\\\bsp/1411642570843"
# webtalk_add_data -client sdk -key os -value "freertos_zynq" -context "sdk\\\\bsp/1411642570843"
# webtalk_add_data -client sdk -key apptemplate -value "null" -context "sdk\\\\bsp/1411642570843"
# webtalk_add_data -client sdk -key uid -value "1411642577482" -context "sdk\\\\application/1411642577482"
# webtalk_add_data -client sdk -key hwid -value "1411641662848" -context "sdk\\\\application/1411642577482"
# webtalk_add_data -client sdk -key bspid -value "1411642570843" -context "sdk\\\\application/1411642577482"
# webtalk_add_data -client sdk -key newbsp -value "true" -context "sdk\\\\application/1411642577482"
# webtalk_add_data -client sdk -key os -value "freertos_zynq" -context "sdk\\\\application/1411642577482"
# webtalk_add_data -client sdk -key apptemplate -value "freertos_lwip_socket_apps" -context "sdk\\\\application/1411642577482"
# webtalk_transmit -clientid 2274547090 -regid "" -xml C:\\PROJECT_FOR_RELEASE\\zc702_GigE\\HW\\project_1\\project_1.sdk\\webtalk\\usage_statistics_ext_sdk.xml -html C:\\PROJECT_FOR_RELEASE\\zc702_GigE\\HW\\project_1\\project_1.sdk\\webtalk\\usage_statistics_ext_sdk.html -wdm C:\\PROJECT_FOR_RELEASE\\zc702_GigE\\HW\\project_1\\project_1.sdk\\webtalk\\sdk_webtalk.wdm -intro "<H3>SDK Usage Report</H3><BR>"
INFO: [Common 17-186] 'C:\PROJECT_FOR_RELEASE\zc702_GigE\HW\project_1\project_1.sdk\webtalk\usage_statistics_ext_sdk.xml' has been successfully sent to Xilinx on Thu Sep 25 18:59:31 2014. For additional details about this file, please refer to the WebTalk help file at /doc/webtalk_introduction.html.
# webtalk_terminate
INFO: [Common 17-206] Exiting Webtalk at Thu Sep 25 18:59:31 2014...
