
*** Running vivado
    with args -log block_design_axi_gpio_0_1.vds -m64 -product Vivado -mode batch -messageDb vivado.pb -notrace -source block_design_axi_gpio_0_1.tcl


****** Vivado v2018.2.2 (64-bit)
  **** SW Build 2348494 on Mon Oct  1 18:25:39 MDT 2018
  **** IP Build 2318053 on Mon Oct  1 21:44:26 MDT 2018
    ** Copyright 1986-2018 Xilinx, Inc. All Rights Reserved.

source block_design_axi_gpio_0_1.tcl -notrace
Command: synth_design -top block_design_axi_gpio_0_1 -part xc7z010clg400-1 -mode out_of_context
Starting synth_design
Attempting to get a license for feature 'Synthesis' and/or device 'xc7z010'
INFO: [Common 17-349] Got license for feature 'Synthesis' and/or device 'xc7z010'
INFO: Launching helper process for spawning children vivado processes
INFO: Helper process launched with PID 32603 
---------------------------------------------------------------------------------
Starting RTL Elaboration : Time (s): cpu = 00:00:02 ; elapsed = 00:00:02 . Memory (MB): peak = 1279.262 ; gain = 81.578 ; free physical = 10024 ; free virtual = 20613
---------------------------------------------------------------------------------
INFO: [Synth 8-638] synthesizing module 'block_design_axi_gpio_0_1' [/home/bryan/Documents/PXL/Embedded_Operating_Systems/oefeningenbundel/oefening_14/oefening_14.srcs/sources_1/bd/block_design/ip/block_design_axi_gpio_0_1/synth/block_design_axi_gpio_0_1.vhd:85]
	Parameter C_FAMILY bound to: zynq - type: string 
	Parameter C_S_AXI_ADDR_WIDTH bound to: 9 - type: integer 
	Parameter C_S_AXI_DATA_WIDTH bound to: 32 - type: integer 
	Parameter C_GPIO_WIDTH bound to: 4 - type: integer 
	Parameter C_GPIO2_WIDTH bound to: 4 - type: integer 
	Parameter C_ALL_INPUTS bound to: 1 - type: integer 
	Parameter C_ALL_INPUTS_2 bound to: 1 - type: integer 
	Parameter C_ALL_OUTPUTS bound to: 0 - type: integer 
	Parameter C_ALL_OUTPUTS_2 bound to: 0 - type: integer 
	Parameter C_INTERRUPT_PRESENT bound to: 0 - type: integer 
	Parameter C_DOUT_DEFAULT bound to: 32'b00000000000000000000000000000000 
	Parameter C_TRI_DEFAULT bound to: 32'b11111111111111111111111111111111 
	Parameter C_IS_DUAL bound to: 1 - type: integer 
	Parameter C_DOUT_DEFAULT_2 bound to: 32'b00000000000000000000000000000000 
	Parameter C_TRI_DEFAULT_2 bound to: 32'b11111111111111111111111111111111 
INFO: [Synth 8-3491] module 'axi_gpio' declared at '/home/bryan/Documents/PXL/Embedded_Operating_Systems/oefeningenbundel/oefening_14/oefening_14.srcs/sources_1/bd/block_design/ipshared/c193/hdl/axi_gpio_v2_0_vh_rfs.vhd:1265' bound to instance 'U0' of component 'axi_gpio' [/home/bryan/Documents/PXL/Embedded_Operating_Systems/oefeningenbundel/oefening_14/oefening_14.srcs/sources_1/bd/block_design/ip/block_design_axi_gpio_0_1/synth/block_design_axi_gpio_0_1.vhd:171]
INFO: [Synth 8-638] synthesizing module 'axi_gpio' [/home/bryan/Documents/PXL/Embedded_Operating_Systems/oefeningenbundel/oefening_14/oefening_14.srcs/sources_1/bd/block_design/ipshared/c193/hdl/axi_gpio_v2_0_vh_rfs.vhd:1358]
	Parameter C_FAMILY bound to: zynq - type: string 
	Parameter C_S_AXI_ADDR_WIDTH bound to: 9 - type: integer 
	Parameter C_S_AXI_DATA_WIDTH bound to: 32 - type: integer 
	Parameter C_GPIO_WIDTH bound to: 4 - type: integer 
	Parameter C_GPIO2_WIDTH bound to: 4 - type: integer 
	Parameter C_ALL_INPUTS bound to: 1 - type: integer 
	Parameter C_ALL_INPUTS_2 bound to: 1 - type: integer 
	Parameter C_ALL_OUTPUTS bound to: 0 - type: integer 
	Parameter C_ALL_OUTPUTS_2 bound to: 0 - type: integer 
	Parameter C_INTERRUPT_PRESENT bound to: 0 - type: integer 
	Parameter C_DOUT_DEFAULT bound to: 0 - type: integer 
	Parameter C_TRI_DEFAULT bound to: -1 - type: integer 
	Parameter C_IS_DUAL bound to: 1 - type: integer 
	Parameter C_DOUT_DEFAULT_2 bound to: 0 - type: integer 
	Parameter C_TRI_DEFAULT_2 bound to: -1 - type: integer 
INFO: [Synth 8-5534] Detected attribute (* max_fanout = "10000" *) [/home/bryan/Documents/PXL/Embedded_Operating_Systems/oefeningenbundel/oefening_14/oefening_14.srcs/sources_1/bd/block_design/ipshared/c193/hdl/axi_gpio_v2_0_vh_rfs.vhd:1295]
INFO: [Synth 8-5534] Detected attribute (* max_fanout = "10000" *) [/home/bryan/Documents/PXL/Embedded_Operating_Systems/oefeningenbundel/oefening_14/oefening_14.srcs/sources_1/bd/block_design/ipshared/c193/hdl/axi_gpio_v2_0_vh_rfs.vhd:1296]
INFO: [Synth 8-638] synthesizing module 'axi_lite_ipif' [/home/bryan/Documents/PXL/Embedded_Operating_Systems/oefeningenbundel/oefening_14/oefening_14.srcs/sources_1/bd/block_design/ipshared/cced/hdl/axi_lite_ipif_v3_0_vh_rfs.vhd:2948]
	Parameter C_S_AXI_DATA_WIDTH bound to: 32 - type: integer 
	Parameter C_S_AXI_ADDR_WIDTH bound to: 9 - type: integer 
	Parameter C_S_AXI_MIN_SIZE bound to: 32'b00000000000000000000000111111111 
	Parameter C_USE_WSTRB bound to: 0 - type: integer 
	Parameter C_DPHASE_TIMEOUT bound to: 8 - type: integer 
	Parameter C_ARD_ADDR_RANGE_ARRAY bound to: 128'b00000000000000000000000000000000000000000000000000000000000000000000000000000000000000000000000000000000000000000000000000001111 
	Parameter C_ARD_NUM_CE_ARRAY bound to: 32'b00000000000000000000000000000100 
	Parameter C_FAMILY bound to: zynq - type: string 
INFO: [Synth 8-638] synthesizing module 'slave_attachment' [/home/bryan/Documents/PXL/Embedded_Operating_Systems/oefeningenbundel/oefening_14/oefening_14.srcs/sources_1/bd/block_design/ipshared/cced/hdl/axi_lite_ipif_v3_0_vh_rfs.vhd:2341]
	Parameter C_ARD_ADDR_RANGE_ARRAY bound to: 128'b00000000000000000000000000000000000000000000000000000000000000000000000000000000000000000000000000000000000000000000000000001111 
	Parameter C_ARD_NUM_CE_ARRAY bound to: 32'b00000000000000000000000000000100 
	Parameter C_IPIF_ABUS_WIDTH bound to: 9 - type: integer 
	Parameter C_IPIF_DBUS_WIDTH bound to: 32 - type: integer 
	Parameter C_S_AXI_MIN_SIZE bound to: 511 - type: integer 
	Parameter C_USE_WSTRB bound to: 0 - type: integer 
	Parameter C_DPHASE_TIMEOUT bound to: 8 - type: integer 
	Parameter C_FAMILY bound to: zynq - type: string 
INFO: [Synth 8-638] synthesizing module 'address_decoder' [/home/bryan/Documents/PXL/Embedded_Operating_Systems/oefeningenbundel/oefening_14/oefening_14.srcs/sources_1/bd/block_design/ipshared/cced/hdl/axi_lite_ipif_v3_0_vh_rfs.vhd:1775]
	Parameter C_BUS_AWIDTH bound to: 9 - type: integer 
	Parameter C_S_AXI_MIN_SIZE bound to: 511 - type: integer 
	Parameter C_ARD_ADDR_RANGE_ARRAY bound to: 128'b00000000000000000000000000000000000000000000000000000000000000000000000000000000000000000000000000000000000000000000000000001111 
	Parameter C_ARD_NUM_CE_ARRAY bound to: 32'b00000000000000000000000000000100 
	Parameter C_FAMILY bound to: nofamily - type: string 
INFO: [Synth 8-638] synthesizing module 'pselect_f' [/home/bryan/Documents/PXL/Embedded_Operating_Systems/oefeningenbundel/oefening_14/oefening_14.srcs/sources_1/bd/block_design/ipshared/cced/hdl/axi_lite_ipif_v3_0_vh_rfs.vhd:1534]
	Parameter C_AB bound to: 2 - type: integer 
	Parameter C_AW bound to: 2 - type: integer 
	Parameter C_BAR bound to: 2'b00 
	Parameter C_FAMILY bound to: nofamily - type: string 
INFO: [Synth 8-256] done synthesizing module 'pselect_f' (1#1) [/home/bryan/Documents/PXL/Embedded_Operating_Systems/oefeningenbundel/oefening_14/oefening_14.srcs/sources_1/bd/block_design/ipshared/cced/hdl/axi_lite_ipif_v3_0_vh_rfs.vhd:1534]
INFO: [Synth 8-638] synthesizing module 'pselect_f__parameterized0' [/home/bryan/Documents/PXL/Embedded_Operating_Systems/oefeningenbundel/oefening_14/oefening_14.srcs/sources_1/bd/block_design/ipshared/cced/hdl/axi_lite_ipif_v3_0_vh_rfs.vhd:1534]
	Parameter C_AB bound to: 2 - type: integer 
	Parameter C_AW bound to: 2 - type: integer 
	Parameter C_BAR bound to: 2'b01 
	Parameter C_FAMILY bound to: nofamily - type: string 
INFO: [Synth 8-256] done synthesizing module 'pselect_f__parameterized0' (1#1) [/home/bryan/Documents/PXL/Embedded_Operating_Systems/oefeningenbundel/oefening_14/oefening_14.srcs/sources_1/bd/block_design/ipshared/cced/hdl/axi_lite_ipif_v3_0_vh_rfs.vhd:1534]
INFO: [Synth 8-638] synthesizing module 'pselect_f__parameterized1' [/home/bryan/Documents/PXL/Embedded_Operating_Systems/oefeningenbundel/oefening_14/oefening_14.srcs/sources_1/bd/block_design/ipshared/cced/hdl/axi_lite_ipif_v3_0_vh_rfs.vhd:1534]
	Parameter C_AB bound to: 2 - type: integer 
	Parameter C_AW bound to: 2 - type: integer 
	Parameter C_BAR bound to: 2'b10 
	Parameter C_FAMILY bound to: nofamily - type: string 
INFO: [Synth 8-256] done synthesizing module 'pselect_f__parameterized1' (1#1) [/home/bryan/Documents/PXL/Embedded_Operating_Systems/oefeningenbundel/oefening_14/oefening_14.srcs/sources_1/bd/block_design/ipshared/cced/hdl/axi_lite_ipif_v3_0_vh_rfs.vhd:1534]
INFO: [Synth 8-638] synthesizing module 'pselect_f__parameterized2' [/home/bryan/Documents/PXL/Embedded_Operating_Systems/oefeningenbundel/oefening_14/oefening_14.srcs/sources_1/bd/block_design/ipshared/cced/hdl/axi_lite_ipif_v3_0_vh_rfs.vhd:1534]
	Parameter C_AB bound to: 2 - type: integer 
	Parameter C_AW bound to: 2 - type: integer 
	Parameter C_BAR bound to: 2'b11 
	Parameter C_FAMILY bound to: nofamily - type: string 
INFO: [Synth 8-256] done synthesizing module 'pselect_f__parameterized2' (1#1) [/home/bryan/Documents/PXL/Embedded_Operating_Systems/oefeningenbundel/oefening_14/oefening_14.srcs/sources_1/bd/block_design/ipshared/cced/hdl/axi_lite_ipif_v3_0_vh_rfs.vhd:1534]
INFO: [Synth 8-256] done synthesizing module 'address_decoder' (2#1) [/home/bryan/Documents/PXL/Embedded_Operating_Systems/oefeningenbundel/oefening_14/oefening_14.srcs/sources_1/bd/block_design/ipshared/cced/hdl/axi_lite_ipif_v3_0_vh_rfs.vhd:1775]
INFO: [Synth 8-226] default block is never used [/home/bryan/Documents/PXL/Embedded_Operating_Systems/oefeningenbundel/oefening_14/oefening_14.srcs/sources_1/bd/block_design/ipshared/cced/hdl/axi_lite_ipif_v3_0_vh_rfs.vhd:2550]
INFO: [Synth 8-256] done synthesizing module 'slave_attachment' (3#1) [/home/bryan/Documents/PXL/Embedded_Operating_Systems/oefeningenbundel/oefening_14/oefening_14.srcs/sources_1/bd/block_design/ipshared/cced/hdl/axi_lite_ipif_v3_0_vh_rfs.vhd:2341]
INFO: [Synth 8-256] done synthesizing module 'axi_lite_ipif' (4#1) [/home/bryan/Documents/PXL/Embedded_Operating_Systems/oefeningenbundel/oefening_14/oefening_14.srcs/sources_1/bd/block_design/ipshared/cced/hdl/axi_lite_ipif_v3_0_vh_rfs.vhd:2948]
INFO: [Synth 8-638] synthesizing module 'GPIO_Core' [/home/bryan/Documents/PXL/Embedded_Operating_Systems/oefeningenbundel/oefening_14/oefening_14.srcs/sources_1/bd/block_design/ipshared/c193/hdl/axi_gpio_v2_0_vh_rfs.vhd:178]
	Parameter C_DW bound to: 32 - type: integer 
	Parameter C_AW bound to: 9 - type: integer 
	Parameter C_GPIO_WIDTH bound to: 4 - type: integer 
	Parameter C_GPIO2_WIDTH bound to: 4 - type: integer 
	Parameter C_MAX_GPIO_WIDTH bound to: 4 - type: integer 
	Parameter C_INTERRUPT_PRESENT bound to: 0 - type: integer 
	Parameter C_DOUT_DEFAULT bound to: 0 - type: integer 
	Parameter C_TRI_DEFAULT bound to: -1 - type: integer 
	Parameter C_IS_DUAL bound to: 1 - type: integer 
	Parameter C_ALL_OUTPUTS bound to: 0 - type: integer 
	Parameter C_ALL_OUTPUTS_2 bound to: 0 - type: integer 
	Parameter C_ALL_INPUTS bound to: 1 - type: integer 
	Parameter C_ALL_INPUTS_2 bound to: 1 - type: integer 
	Parameter C_DOUT_DEFAULT_2 bound to: 0 - type: integer 
	Parameter C_TRI_DEFAULT_2 bound to: -1 - type: integer 
	Parameter C_FAMILY bound to: zynq - type: string 
INFO: [Synth 8-226] default block is never used [/home/bryan/Documents/PXL/Embedded_Operating_Systems/oefeningenbundel/oefening_14/oefening_14.srcs/sources_1/bd/block_design/ipshared/c193/hdl/axi_gpio_v2_0_vh_rfs.vhd:835]
INFO: [Synth 8-638] synthesizing module 'cdc_sync' [/home/bryan/Documents/PXL/Embedded_Operating_Systems/oefeningenbundel/oefening_14/oefening_14.srcs/sources_1/bd/block_design/ipshared/ef1e/hdl/lib_cdc_v1_0_rfs.vhd:106]
	Parameter C_CDC_TYPE bound to: 1 - type: integer 
	Parameter C_RESET_STATE bound to: 0 - type: integer 
	Parameter C_SINGLE_BIT bound to: 0 - type: integer 
	Parameter C_FLOP_INPUT bound to: 0 - type: integer 
	Parameter C_VECTOR_WIDTH bound to: 4 - type: integer 
	Parameter C_MTBF_STAGES bound to: 4 - type: integer 
	Parameter INIT bound to: 1'b0 
INFO: [Synth 8-113] binding component instance 'CROSS2_PLEVEL_IN2SCNDRY_IN_cdc_to' to cell 'FDR' [/home/bryan/Documents/PXL/Embedded_Operating_Systems/oefeningenbundel/oefening_14/oefening_14.srcs/sources_1/bd/block_design/ipshared/ef1e/hdl/lib_cdc_v1_0_rfs.vhd:736]
	Parameter INIT bound to: 1'b0 
INFO: [Synth 8-113] binding component instance 'CROSS2_PLEVEL_IN2SCNDRY_IN_cdc_to' to cell 'FDR' [/home/bryan/Documents/PXL/Embedded_Operating_Systems/oefeningenbundel/oefening_14/oefening_14.srcs/sources_1/bd/block_design/ipshared/ef1e/hdl/lib_cdc_v1_0_rfs.vhd:736]
	Parameter INIT bound to: 1'b0 
INFO: [Synth 8-113] binding component instance 'CROSS2_PLEVEL_IN2SCNDRY_IN_cdc_to' to cell 'FDR' [/home/bryan/Documents/PXL/Embedded_Operating_Systems/oefeningenbundel/oefening_14/oefening_14.srcs/sources_1/bd/block_design/ipshared/ef1e/hdl/lib_cdc_v1_0_rfs.vhd:736]
	Parameter INIT bound to: 1'b0 
INFO: [Synth 8-113] binding component instance 'CROSS2_PLEVEL_IN2SCNDRY_IN_cdc_to' to cell 'FDR' [/home/bryan/Documents/PXL/Embedded_Operating_Systems/oefeningenbundel/oefening_14/oefening_14.srcs/sources_1/bd/block_design/ipshared/ef1e/hdl/lib_cdc_v1_0_rfs.vhd:736]
	Parameter INIT bound to: 1'b0 
INFO: [Synth 8-113] binding component instance 'CROSS2_PLEVEL_IN2SCNDRY_s_level_out_bus_d2' to cell 'FDR' [/home/bryan/Documents/PXL/Embedded_Operating_Systems/oefeningenbundel/oefening_14/oefening_14.srcs/sources_1/bd/block_design/ipshared/ef1e/hdl/lib_cdc_v1_0_rfs.vhd:772]
	Parameter INIT bound to: 1'b0 
INFO: [Synth 8-113] binding component instance 'CROSS2_PLEVEL_IN2SCNDRY_s_level_out_bus_d2' to cell 'FDR' [/home/bryan/Documents/PXL/Embedded_Operating_Systems/oefeningenbundel/oefening_14/oefening_14.srcs/sources_1/bd/block_design/ipshared/ef1e/hdl/lib_cdc_v1_0_rfs.vhd:772]
	Parameter INIT bound to: 1'b0 
INFO: [Synth 8-113] binding component instance 'CROSS2_PLEVEL_IN2SCNDRY_s_level_out_bus_d2' to cell 'FDR' [/home/bryan/Documents/PXL/Embedded_Operating_Systems/oefeningenbundel/oefening_14/oefening_14.srcs/sources_1/bd/block_design/ipshared/ef1e/hdl/lib_cdc_v1_0_rfs.vhd:772]
	Parameter INIT bound to: 1'b0 
INFO: [Synth 8-113] binding component instance 'CROSS2_PLEVEL_IN2SCNDRY_s_level_out_bus_d2' to cell 'FDR' [/home/bryan/Documents/PXL/Embedded_Operating_Systems/oefeningenbundel/oefening_14/oefening_14.srcs/sources_1/bd/block_design/ipshared/ef1e/hdl/lib_cdc_v1_0_rfs.vhd:772]
	Parameter INIT bound to: 1'b0 
INFO: [Synth 8-113] binding component instance 'CROSS2_PLEVEL_IN2SCNDRY_s_level_out_bus_d3' to cell 'FDR' [/home/bryan/Documents/PXL/Embedded_Operating_Systems/oefeningenbundel/oefening_14/oefening_14.srcs/sources_1/bd/block_design/ipshared/ef1e/hdl/lib_cdc_v1_0_rfs.vhd:788]
	Parameter INIT bound to: 1'b0 
INFO: [Synth 8-113] binding component instance 'CROSS2_PLEVEL_IN2SCNDRY_s_level_out_bus_d3' to cell 'FDR' [/home/bryan/Documents/PXL/Embedded_Operating_Systems/oefeningenbundel/oefening_14/oefening_14.srcs/sources_1/bd/block_design/ipshared/ef1e/hdl/lib_cdc_v1_0_rfs.vhd:788]
	Parameter INIT bound to: 1'b0 
INFO: [Synth 8-113] binding component instance 'CROSS2_PLEVEL_IN2SCNDRY_s_level_out_bus_d3' to cell 'FDR' [/home/bryan/Documents/PXL/Embedded_Operating_Systems/oefeningenbundel/oefening_14/oefening_14.srcs/sources_1/bd/block_design/ipshared/ef1e/hdl/lib_cdc_v1_0_rfs.vhd:788]
	Parameter INIT bound to: 1'b0 
INFO: [Synth 8-113] binding component instance 'CROSS2_PLEVEL_IN2SCNDRY_s_level_out_bus_d3' to cell 'FDR' [/home/bryan/Documents/PXL/Embedded_Operating_Systems/oefeningenbundel/oefening_14/oefening_14.srcs/sources_1/bd/block_design/ipshared/ef1e/hdl/lib_cdc_v1_0_rfs.vhd:788]
	Parameter INIT bound to: 1'b0 
INFO: [Synth 8-113] binding component instance 'CROSS2_PLEVEL_IN2SCNDRY_s_level_out_bus_d4' to cell 'FDR' [/home/bryan/Documents/PXL/Embedded_Operating_Systems/oefeningenbundel/oefening_14/oefening_14.srcs/sources_1/bd/block_design/ipshared/ef1e/hdl/lib_cdc_v1_0_rfs.vhd:804]
	Parameter INIT bound to: 1'b0 
INFO: [Synth 8-113] binding component instance 'CROSS2_PLEVEL_IN2SCNDRY_s_level_out_bus_d4' to cell 'FDR' [/home/bryan/Documents/PXL/Embedded_Operating_Systems/oefeningenbundel/oefening_14/oefening_14.srcs/sources_1/bd/block_design/ipshared/ef1e/hdl/lib_cdc_v1_0_rfs.vhd:804]
	Parameter INIT bound to: 1'b0 
INFO: [Synth 8-113] binding component instance 'CROSS2_PLEVEL_IN2SCNDRY_s_level_out_bus_d4' to cell 'FDR' [/home/bryan/Documents/PXL/Embedded_Operating_Systems/oefeningenbundel/oefening_14/oefening_14.srcs/sources_1/bd/block_design/ipshared/ef1e/hdl/lib_cdc_v1_0_rfs.vhd:804]
	Parameter INIT bound to: 1'b0 
INFO: [Synth 8-113] binding component instance 'CROSS2_PLEVEL_IN2SCNDRY_s_level_out_bus_d4' to cell 'FDR' [/home/bryan/Documents/PXL/Embedded_Operating_Systems/oefeningenbundel/oefening_14/oefening_14.srcs/sources_1/bd/block_design/ipshared/ef1e/hdl/lib_cdc_v1_0_rfs.vhd:804]
	Parameter INIT bound to: 1'b0 
INFO: [Synth 8-113] binding component instance 'CROSS2_PLEVEL_IN2SCNDRY_s_level_out_bus_d5' to cell 'FDR' [/home/bryan/Documents/PXL/Embedded_Operating_Systems/oefeningenbundel/oefening_14/oefening_14.srcs/sources_1/bd/block_design/ipshared/ef1e/hdl/lib_cdc_v1_0_rfs.vhd:821]
	Parameter INIT bound to: 1'b0 
INFO: [Synth 8-113] binding component instance 'CROSS2_PLEVEL_IN2SCNDRY_s_level_out_bus_d5' to cell 'FDR' [/home/bryan/Documents/PXL/Embedded_Operating_Systems/oefeningenbundel/oefening_14/oefening_14.srcs/sources_1/bd/block_design/ipshared/ef1e/hdl/lib_cdc_v1_0_rfs.vhd:821]
	Parameter INIT bound to: 1'b0 
INFO: [Synth 8-113] binding component instance 'CROSS2_PLEVEL_IN2SCNDRY_s_level_out_bus_d5' to cell 'FDR' [/home/bryan/Documents/PXL/Embedded_Operating_Systems/oefeningenbundel/oefening_14/oefening_14.srcs/sources_1/bd/block_design/ipshared/ef1e/hdl/lib_cdc_v1_0_rfs.vhd:821]
	Parameter INIT bound to: 1'b0 
INFO: [Synth 8-113] binding component instance 'CROSS2_PLEVEL_IN2SCNDRY_s_level_out_bus_d5' to cell 'FDR' [/home/bryan/Documents/PXL/Embedded_Operating_Systems/oefeningenbundel/oefening_14/oefening_14.srcs/sources_1/bd/block_design/ipshared/ef1e/hdl/lib_cdc_v1_0_rfs.vhd:821]
	Parameter INIT bound to: 1'b0 
INFO: [Synth 8-113] binding component instance 'CROSS2_PLEVEL_IN2SCNDRY_s_level_out_bus_d6' to cell 'FDR' [/home/bryan/Documents/PXL/Embedded_Operating_Systems/oefeningenbundel/oefening_14/oefening_14.srcs/sources_1/bd/block_design/ipshared/ef1e/hdl/lib_cdc_v1_0_rfs.vhd:837]
	Parameter INIT bound to: 1'b0 
INFO: [Synth 8-113] binding component instance 'CROSS2_PLEVEL_IN2SCNDRY_s_level_out_bus_d6' to cell 'FDR' [/home/bryan/Documents/PXL/Embedded_Operating_Systems/oefeningenbundel/oefening_14/oefening_14.srcs/sources_1/bd/block_design/ipshared/ef1e/hdl/lib_cdc_v1_0_rfs.vhd:837]
	Parameter INIT bound to: 1'b0 
INFO: [Synth 8-113] binding component instance 'CROSS2_PLEVEL_IN2SCNDRY_s_level_out_bus_d6' to cell 'FDR' [/home/bryan/Documents/PXL/Embedded_Operating_Systems/oefeningenbundel/oefening_14/oefening_14.srcs/sources_1/bd/block_design/ipshared/ef1e/hdl/lib_cdc_v1_0_rfs.vhd:837]
	Parameter INIT bound to: 1'b0 
INFO: [Synth 8-113] binding component instance 'CROSS2_PLEVEL_IN2SCNDRY_s_level_out_bus_d6' to cell 'FDR' [/home/bryan/Documents/PXL/Embedded_Operating_Systems/oefeningenbundel/oefening_14/oefening_14.srcs/sources_1/bd/block_design/ipshared/ef1e/hdl/lib_cdc_v1_0_rfs.vhd:837]
INFO: [Synth 8-256] done synthesizing module 'cdc_sync' (5#1) [/home/bryan/Documents/PXL/Embedded_Operating_Systems/oefeningenbundel/oefening_14/oefening_14.srcs/sources_1/bd/block_design/ipshared/ef1e/hdl/lib_cdc_v1_0_rfs.vhd:106]
WARNING: [Synth 8-6014] Unused sequential element Dual.ALLIN0_ND_G0.READ_REG_GEN[0].GPIO_DBus_i_reg was removed.  [/home/bryan/Documents/PXL/Embedded_Operating_Systems/oefeningenbundel/oefening_14/oefening_14.srcs/sources_1/bd/block_design/ipshared/c193/hdl/axi_gpio_v2_0_vh_rfs.vhd:658]
WARNING: [Synth 8-6014] Unused sequential element Dual.ALLIN0_ND_G0.READ_REG_GEN[1].GPIO_DBus_i_reg was removed.  [/home/bryan/Documents/PXL/Embedded_Operating_Systems/oefeningenbundel/oefening_14/oefening_14.srcs/sources_1/bd/block_design/ipshared/c193/hdl/axi_gpio_v2_0_vh_rfs.vhd:658]
WARNING: [Synth 8-6014] Unused sequential element Dual.ALLIN0_ND_G0.READ_REG_GEN[2].GPIO_DBus_i_reg was removed.  [/home/bryan/Documents/PXL/Embedded_Operating_Systems/oefeningenbundel/oefening_14/oefening_14.srcs/sources_1/bd/block_design/ipshared/c193/hdl/axi_gpio_v2_0_vh_rfs.vhd:658]
WARNING: [Synth 8-6014] Unused sequential element Dual.ALLIN0_ND_G0.READ_REG_GEN[3].GPIO_DBus_i_reg was removed.  [/home/bryan/Documents/PXL/Embedded_Operating_Systems/oefeningenbundel/oefening_14/oefening_14.srcs/sources_1/bd/block_design/ipshared/c193/hdl/axi_gpio_v2_0_vh_rfs.vhd:658]
WARNING: [Synth 8-6014] Unused sequential element Dual.ALLIN0_ND_G2.READ_REG2_GEN[0].GPIO2_DBus_i_reg was removed.  [/home/bryan/Documents/PXL/Embedded_Operating_Systems/oefeningenbundel/oefening_14/oefening_14.srcs/sources_1/bd/block_design/ipshared/c193/hdl/axi_gpio_v2_0_vh_rfs.vhd:719]
WARNING: [Synth 8-6014] Unused sequential element Dual.ALLIN0_ND_G2.READ_REG2_GEN[1].GPIO2_DBus_i_reg was removed.  [/home/bryan/Documents/PXL/Embedded_Operating_Systems/oefeningenbundel/oefening_14/oefening_14.srcs/sources_1/bd/block_design/ipshared/c193/hdl/axi_gpio_v2_0_vh_rfs.vhd:719]
WARNING: [Synth 8-6014] Unused sequential element Dual.ALLIN0_ND_G2.READ_REG2_GEN[2].GPIO2_DBus_i_reg was removed.  [/home/bryan/Documents/PXL/Embedded_Operating_Systems/oefeningenbundel/oefening_14/oefening_14.srcs/sources_1/bd/block_design/ipshared/c193/hdl/axi_gpio_v2_0_vh_rfs.vhd:719]
WARNING: [Synth 8-6014] Unused sequential element Dual.ALLIN0_ND_G2.READ_REG2_GEN[3].GPIO2_DBus_i_reg was removed.  [/home/bryan/Documents/PXL/Embedded_Operating_Systems/oefeningenbundel/oefening_14/oefening_14.srcs/sources_1/bd/block_design/ipshared/c193/hdl/axi_gpio_v2_0_vh_rfs.vhd:719]
INFO: [Synth 8-256] done synthesizing module 'GPIO_Core' (6#1) [/home/bryan/Documents/PXL/Embedded_Operating_Systems/oefeningenbundel/oefening_14/oefening_14.srcs/sources_1/bd/block_design/ipshared/c193/hdl/axi_gpio_v2_0_vh_rfs.vhd:178]
INFO: [Synth 8-256] done synthesizing module 'axi_gpio' (7#1) [/home/bryan/Documents/PXL/Embedded_Operating_Systems/oefeningenbundel/oefening_14/oefening_14.srcs/sources_1/bd/block_design/ipshared/c193/hdl/axi_gpio_v2_0_vh_rfs.vhd:1358]
INFO: [Synth 8-256] done synthesizing module 'block_design_axi_gpio_0_1' (8#1) [/home/bryan/Documents/PXL/Embedded_Operating_Systems/oefeningenbundel/oefening_14/oefening_14.srcs/sources_1/bd/block_design/ip/block_design_axi_gpio_0_1/synth/block_design_axi_gpio_0_1.vhd:85]
WARNING: [Synth 8-3331] design cdc_sync has unconnected port prmry_aclk
WARNING: [Synth 8-3331] design cdc_sync has unconnected port prmry_resetn
WARNING: [Synth 8-3331] design cdc_sync has unconnected port prmry_in
WARNING: [Synth 8-3331] design cdc_sync has unconnected port scndry_resetn
WARNING: [Synth 8-3331] design GPIO_Core has unconnected port ABus_Reg[1]
WARNING: [Synth 8-3331] design GPIO_Core has unconnected port ABus_Reg[2]
WARNING: [Synth 8-3331] design GPIO_Core has unconnected port ABus_Reg[3]
WARNING: [Synth 8-3331] design GPIO_Core has unconnected port ABus_Reg[4]
WARNING: [Synth 8-3331] design GPIO_Core has unconnected port ABus_Reg[7]
WARNING: [Synth 8-3331] design GPIO_Core has unconnected port ABus_Reg[8]
WARNING: [Synth 8-3331] design GPIO_Core has unconnected port BE_Reg[0]
WARNING: [Synth 8-3331] design GPIO_Core has unconnected port BE_Reg[1]
WARNING: [Synth 8-3331] design GPIO_Core has unconnected port BE_Reg[2]
WARNING: [Synth 8-3331] design GPIO_Core has unconnected port BE_Reg[3]
WARNING: [Synth 8-3331] design address_decoder has unconnected port Address_In_Erly[0]
WARNING: [Synth 8-3331] design address_decoder has unconnected port Address_In_Erly[1]
WARNING: [Synth 8-3331] design address_decoder has unconnected port Address_In_Erly[2]
WARNING: [Synth 8-3331] design address_decoder has unconnected port Address_In_Erly[3]
WARNING: [Synth 8-3331] design address_decoder has unconnected port Address_In_Erly[4]
WARNING: [Synth 8-3331] design address_decoder has unconnected port Address_In_Erly[7]
WARNING: [Synth 8-3331] design address_decoder has unconnected port Address_In_Erly[8]
WARNING: [Synth 8-3331] design address_decoder has unconnected port Bus_RNW
WARNING: [Synth 8-3331] design slave_attachment has unconnected port S_AXI_WSTRB[3]
WARNING: [Synth 8-3331] design slave_attachment has unconnected port S_AXI_WSTRB[2]
WARNING: [Synth 8-3331] design slave_attachment has unconnected port S_AXI_WSTRB[1]
WARNING: [Synth 8-3331] design slave_attachment has unconnected port S_AXI_WSTRB[0]
---------------------------------------------------------------------------------
Finished RTL Elaboration : Time (s): cpu = 00:00:03 ; elapsed = 00:00:03 . Memory (MB): peak = 1325.887 ; gain = 128.203 ; free physical = 10008 ; free virtual = 20607
---------------------------------------------------------------------------------

Report Check Netlist: 
+------+------------------+-------+---------+-------+------------------+
|      |Item              |Errors |Warnings |Status |Description       |
+------+------------------+-------+---------+-------+------------------+
|1     |multi_driven_nets |      0|        0|Passed |Multi driven nets |
+------+------------------+-------+---------+-------+------------------+
---------------------------------------------------------------------------------
Start Handling Custom Attributes
---------------------------------------------------------------------------------
---------------------------------------------------------------------------------
Finished Handling Custom Attributes : Time (s): cpu = 00:00:03 ; elapsed = 00:00:03 . Memory (MB): peak = 1325.887 ; gain = 128.203 ; free physical = 9992 ; free virtual = 20590
---------------------------------------------------------------------------------
---------------------------------------------------------------------------------
Finished RTL Optimization Phase 1 : Time (s): cpu = 00:00:03 ; elapsed = 00:00:03 . Memory (MB): peak = 1325.887 ; gain = 128.203 ; free physical = 9992 ; free virtual = 20590
---------------------------------------------------------------------------------
INFO: [Netlist 29-17] Analyzing 48 Unisim elements for replacement
INFO: [Netlist 29-28] Unisim Transformation completed in 0 CPU seconds
INFO: [Device 21-403] Loading part xc7z010clg400-1
INFO: [Project 1-570] Preparing netlist for logic optimization

Processing XDC Constraints
Initializing timing engine
Parsing XDC File [/home/bryan/Documents/PXL/Embedded_Operating_Systems/oefeningenbundel/oefening_14/oefening_14.srcs/sources_1/bd/block_design/ip/block_design_axi_gpio_0_1/block_design_axi_gpio_0_1_ooc.xdc] for cell 'U0'
Finished Parsing XDC File [/home/bryan/Documents/PXL/Embedded_Operating_Systems/oefeningenbundel/oefening_14/oefening_14.srcs/sources_1/bd/block_design/ip/block_design_axi_gpio_0_1/block_design_axi_gpio_0_1_ooc.xdc] for cell 'U0'
Parsing XDC File [/home/bryan/Documents/PXL/Embedded_Operating_Systems/oefeningenbundel/oefening_14/oefening_14.srcs/sources_1/bd/block_design/ip/block_design_axi_gpio_0_1/block_design_axi_gpio_0_1_board.xdc] for cell 'U0'
Finished Parsing XDC File [/home/bryan/Documents/PXL/Embedded_Operating_Systems/oefeningenbundel/oefening_14/oefening_14.srcs/sources_1/bd/block_design/ip/block_design_axi_gpio_0_1/block_design_axi_gpio_0_1_board.xdc] for cell 'U0'
Parsing XDC File [/home/bryan/Documents/PXL/Embedded_Operating_Systems/oefeningenbundel/oefening_14/oefening_14.srcs/sources_1/bd/block_design/ip/block_design_axi_gpio_0_1/block_design_axi_gpio_0_1.xdc] for cell 'U0'
Finished Parsing XDC File [/home/bryan/Documents/PXL/Embedded_Operating_Systems/oefeningenbundel/oefening_14/oefening_14.srcs/sources_1/bd/block_design/ip/block_design_axi_gpio_0_1/block_design_axi_gpio_0_1.xdc] for cell 'U0'
Parsing XDC File [/home/bryan/Documents/PXL/Embedded_Operating_Systems/oefeningenbundel/oefening_14/oefening_14.runs/block_design_axi_gpio_0_1_synth_1/dont_touch.xdc]
Finished Parsing XDC File [/home/bryan/Documents/PXL/Embedded_Operating_Systems/oefeningenbundel/oefening_14/oefening_14.runs/block_design_axi_gpio_0_1_synth_1/dont_touch.xdc]
Completed Processing XDC Constraints

INFO: [Project 1-111] Unisim Transformation Summary:
  A total of 48 instances were transformed.
  FDR => FDRE: 48 instances

Constraint Validation Runtime : Time (s): cpu = 00:00:00.03 ; elapsed = 00:00:00.03 . Memory (MB): peak = 1678.520 ; gain = 0.000 ; free physical = 9231 ; free virtual = 19845
---------------------------------------------------------------------------------
Finished Constraint Validation : Time (s): cpu = 00:00:12 ; elapsed = 00:00:23 . Memory (MB): peak = 1678.520 ; gain = 480.836 ; free physical = 9369 ; free virtual = 19987
---------------------------------------------------------------------------------
---------------------------------------------------------------------------------
Start Loading Part and Timing Information
---------------------------------------------------------------------------------
Loading part: xc7z010clg400-1
---------------------------------------------------------------------------------
Finished Loading Part and Timing Information : Time (s): cpu = 00:00:12 ; elapsed = 00:00:23 . Memory (MB): peak = 1678.520 ; gain = 480.836 ; free physical = 9366 ; free virtual = 19984
---------------------------------------------------------------------------------
---------------------------------------------------------------------------------
Start Applying 'set_property' XDC Constraints
---------------------------------------------------------------------------------
Applied set_property DONT_TOUCH = true for U0. (constraint file  /home/bryan/Documents/PXL/Embedded_Operating_Systems/oefeningenbundel/oefening_14/oefening_14.runs/block_design_axi_gpio_0_1_synth_1/dont_touch.xdc, line 9).
---------------------------------------------------------------------------------
Finished applying 'set_property' XDC Constraints : Time (s): cpu = 00:00:12 ; elapsed = 00:00:23 . Memory (MB): peak = 1678.520 ; gain = 480.836 ; free physical = 9369 ; free virtual = 19987
---------------------------------------------------------------------------------
INFO: [Synth 8-802] inferred FSM for state register 'state_reg' in module 'slave_attachment'
INFO: [Synth 8-5544] ROM "s_axi_rresp_i" won't be mapped to Block RAM because address size (2) smaller than threshold (5)
INFO: [Synth 8-5544] ROM "s_axi_rresp_i" won't be mapped to Block RAM because address size (2) smaller than threshold (5)
INFO: [Synth 8-5544] ROM "s_axi_bresp_i" won't be mapped to Block RAM because address size (2) smaller than threshold (5)
INFO: [Synth 8-5544] ROM "s_axi_bresp_i" won't be mapped to Block RAM because address size (2) smaller than threshold (5)
INFO: [Synth 8-5544] ROM "state" won't be mapped to Block RAM because address size (1) smaller than threshold (5)
INFO: [Synth 8-5544] ROM "state" won't be mapped to Block RAM because address size (1) smaller than threshold (5)
INFO: [Synth 8-5544] ROM "state" won't be mapped to Block RAM because address size (1) smaller than threshold (5)
INFO: [Synth 8-5544] ROM "state" won't be mapped to Block RAM because address size (1) smaller than threshold (5)
---------------------------------------------------------------------------------------------------
                   State |                     New Encoding |                Previous Encoding 
---------------------------------------------------------------------------------------------------
                 iSTATE2 |                             0001 |                               00
                  iSTATE |                             0010 |                               01
                 iSTATE0 |                             0100 |                               10
                 iSTATE1 |                             1000 |                               11
---------------------------------------------------------------------------------------------------
INFO: [Synth 8-3354] encoded FSM with state register 'state_reg' using encoding 'one-hot' in module 'slave_attachment'
---------------------------------------------------------------------------------
Finished RTL Optimization Phase 2 : Time (s): cpu = 00:00:12 ; elapsed = 00:00:24 . Memory (MB): peak = 1678.520 ; gain = 480.836 ; free physical = 9322 ; free virtual = 19950
---------------------------------------------------------------------------------

Report RTL Partitions: 
+-+--------------+------------+----------+
| |RTL Partition |Replication |Instances |
+-+--------------+------------+----------+
+-+--------------+------------+----------+
---------------------------------------------------------------------------------
Start RTL Component Statistics 
---------------------------------------------------------------------------------
Detailed RTL Component Info : 
+---Adders : 
	   2 Input      4 Bit       Adders := 1     
+---Registers : 
	               32 Bit    Registers := 2     
	                9 Bit    Registers := 1     
	                4 Bit    Registers := 7     
	                2 Bit    Registers := 3     
	                1 Bit    Registers := 18    
+---Muxes : 
	   5 Input     32 Bit        Muxes := 1     
	   2 Input     32 Bit        Muxes := 1     
	   2 Input      9 Bit        Muxes := 1     
	   4 Input      4 Bit        Muxes := 1     
	   2 Input      4 Bit        Muxes := 10    
	   7 Input      2 Bit        Muxes := 1     
	   2 Input      2 Bit        Muxes := 2     
	   4 Input      2 Bit        Muxes := 2     
	   2 Input      1 Bit        Muxes := 12    
	   4 Input      1 Bit        Muxes := 3     
---------------------------------------------------------------------------------
Finished RTL Component Statistics 
---------------------------------------------------------------------------------
---------------------------------------------------------------------------------
Start RTL Hierarchical Component Statistics 
---------------------------------------------------------------------------------
Hierarchical RTL Component report 
Module pselect_f 
Detailed RTL Component Info : 
+---Muxes : 
	   2 Input      1 Bit        Muxes := 1     
Module pselect_f__parameterized0 
Detailed RTL Component Info : 
+---Muxes : 
	   2 Input      1 Bit        Muxes := 1     
Module pselect_f__parameterized1 
Detailed RTL Component Info : 
+---Muxes : 
	   2 Input      1 Bit        Muxes := 1     
Module pselect_f__parameterized2 
Detailed RTL Component Info : 
+---Muxes : 
	   2 Input      1 Bit        Muxes := 1     
Module address_decoder 
Detailed RTL Component Info : 
+---Registers : 
	                1 Bit    Registers := 6     
Module slave_attachment 
Detailed RTL Component Info : 
+---Adders : 
	   2 Input      4 Bit       Adders := 1     
+---Registers : 
	               32 Bit    Registers := 1     
	                9 Bit    Registers := 1     
	                4 Bit    Registers := 1     
	                2 Bit    Registers := 3     
	                1 Bit    Registers := 7     
+---Muxes : 
	   2 Input      9 Bit        Muxes := 1     
	   4 Input      4 Bit        Muxes := 1     
	   2 Input      4 Bit        Muxes := 5     
	   7 Input      2 Bit        Muxes := 1     
	   2 Input      2 Bit        Muxes := 2     
	   2 Input      1 Bit        Muxes := 4     
	   4 Input      1 Bit        Muxes := 3     
Module GPIO_Core 
Detailed RTL Component Info : 
+---Registers : 
	                4 Bit    Registers := 6     
	                1 Bit    Registers := 2     
+---Muxes : 
	   5 Input     32 Bit        Muxes := 1     
	   2 Input      4 Bit        Muxes := 5     
	   4 Input      2 Bit        Muxes := 2     
	   2 Input      1 Bit        Muxes := 4     
Module axi_gpio 
Detailed RTL Component Info : 
+---Registers : 
	               32 Bit    Registers := 1     
	                1 Bit    Registers := 3     
+---Muxes : 
	   2 Input     32 Bit        Muxes := 1     
---------------------------------------------------------------------------------
Finished RTL Hierarchical Component Statistics
---------------------------------------------------------------------------------
---------------------------------------------------------------------------------
Start Part Resource Summary
---------------------------------------------------------------------------------
Part Resources:
DSPs: 80 (col length:40)
BRAMs: 120 (col length: RAMB18 40 RAMB36 20)
---------------------------------------------------------------------------------
Finished Part Resource Summary
---------------------------------------------------------------------------------
---------------------------------------------------------------------------------
Start Cross Boundary and Area Optimization
---------------------------------------------------------------------------------
Warning: Parallel synthesis criteria is not met 
INFO: [Synth 8-4471] merging register 'bus2ip_reset_reg' into 'AXI_LITE_IPIF_I/I_SLAVE_ATTACHMENT/rst_reg' [/home/bryan/Documents/PXL/Embedded_Operating_Systems/oefeningenbundel/oefening_14/oefening_14.srcs/sources_1/bd/block_design/ipshared/c193/hdl/axi_gpio_v2_0_vh_rfs.vhd:1684]
WARNING: [Synth 8-6014] Unused sequential element bus2ip_reset_reg was removed.  [/home/bryan/Documents/PXL/Embedded_Operating_Systems/oefeningenbundel/oefening_14/oefening_14.srcs/sources_1/bd/block_design/ipshared/c193/hdl/axi_gpio_v2_0_vh_rfs.vhd:1684]
WARNING: [Synth 8-3331] design axi_gpio has unconnected port s_axi_wdata[31]
WARNING: [Synth 8-3331] design axi_gpio has unconnected port s_axi_wdata[30]
WARNING: [Synth 8-3331] design axi_gpio has unconnected port s_axi_wdata[29]
WARNING: [Synth 8-3331] design axi_gpio has unconnected port s_axi_wdata[28]
WARNING: [Synth 8-3331] design axi_gpio has unconnected port s_axi_wdata[27]
WARNING: [Synth 8-3331] design axi_gpio has unconnected port s_axi_wdata[26]
WARNING: [Synth 8-3331] design axi_gpio has unconnected port s_axi_wdata[25]
WARNING: [Synth 8-3331] design axi_gpio has unconnected port s_axi_wdata[24]
WARNING: [Synth 8-3331] design axi_gpio has unconnected port s_axi_wdata[23]
WARNING: [Synth 8-3331] design axi_gpio has unconnected port s_axi_wdata[22]
WARNING: [Synth 8-3331] design axi_gpio has unconnected port s_axi_wdata[21]
WARNING: [Synth 8-3331] design axi_gpio has unconnected port s_axi_wdata[20]
WARNING: [Synth 8-3331] design axi_gpio has unconnected port s_axi_wdata[19]
WARNING: [Synth 8-3331] design axi_gpio has unconnected port s_axi_wdata[18]
WARNING: [Synth 8-3331] design axi_gpio has unconnected port s_axi_wdata[17]
WARNING: [Synth 8-3331] design axi_gpio has unconnected port s_axi_wdata[16]
WARNING: [Synth 8-3331] design axi_gpio has unconnected port s_axi_wdata[15]
WARNING: [Synth 8-3331] design axi_gpio has unconnected port s_axi_wdata[14]
WARNING: [Synth 8-3331] design axi_gpio has unconnected port s_axi_wdata[13]
WARNING: [Synth 8-3331] design axi_gpio has unconnected port s_axi_wdata[12]
WARNING: [Synth 8-3331] design axi_gpio has unconnected port s_axi_wdata[11]
WARNING: [Synth 8-3331] design axi_gpio has unconnected port s_axi_wdata[10]
WARNING: [Synth 8-3331] design axi_gpio has unconnected port s_axi_wdata[9]
WARNING: [Synth 8-3331] design axi_gpio has unconnected port s_axi_wdata[8]
WARNING: [Synth 8-3331] design axi_gpio has unconnected port s_axi_wdata[7]
WARNING: [Synth 8-3331] design axi_gpio has unconnected port s_axi_wdata[6]
WARNING: [Synth 8-3331] design axi_gpio has unconnected port s_axi_wdata[5]
WARNING: [Synth 8-3331] design axi_gpio has unconnected port s_axi_wdata[4]
WARNING: [Synth 8-3331] design axi_gpio has unconnected port s_axi_wstrb[3]
WARNING: [Synth 8-3331] design axi_gpio has unconnected port s_axi_wstrb[2]
WARNING: [Synth 8-3331] design axi_gpio has unconnected port s_axi_wstrb[1]
WARNING: [Synth 8-3331] design axi_gpio has unconnected port s_axi_wstrb[0]
INFO: [Synth 8-3886] merging instance 'U0/ip2bus_data_i_D1_reg[27]' (FDR) to 'U0/ip2bus_data_i_D1_reg[26]'
INFO: [Synth 8-3886] merging instance 'U0/ip2bus_data_i_D1_reg[26]' (FDR) to 'U0/ip2bus_data_i_D1_reg[25]'
INFO: [Synth 8-3886] merging instance 'U0/ip2bus_data_i_D1_reg[25]' (FDR) to 'U0/ip2bus_data_i_D1_reg[24]'
INFO: [Synth 8-3886] merging instance 'U0/ip2bus_data_i_D1_reg[24]' (FDR) to 'U0/ip2bus_data_i_D1_reg[23]'
INFO: [Synth 8-3886] merging instance 'U0/ip2bus_data_i_D1_reg[23]' (FDR) to 'U0/ip2bus_data_i_D1_reg[22]'
INFO: [Synth 8-3886] merging instance 'U0/ip2bus_data_i_D1_reg[22]' (FDR) to 'U0/ip2bus_data_i_D1_reg[21]'
INFO: [Synth 8-3886] merging instance 'U0/ip2bus_data_i_D1_reg[21]' (FDR) to 'U0/ip2bus_data_i_D1_reg[20]'
INFO: [Synth 8-3886] merging instance 'U0/ip2bus_data_i_D1_reg[20]' (FDR) to 'U0/ip2bus_data_i_D1_reg[19]'
INFO: [Synth 8-3886] merging instance 'U0/ip2bus_data_i_D1_reg[19]' (FDR) to 'U0/ip2bus_data_i_D1_reg[18]'
INFO: [Synth 8-3886] merging instance 'U0/ip2bus_data_i_D1_reg[18]' (FDR) to 'U0/ip2bus_data_i_D1_reg[17]'
INFO: [Synth 8-3886] merging instance 'U0/ip2bus_data_i_D1_reg[17]' (FDR) to 'U0/ip2bus_data_i_D1_reg[16]'
INFO: [Synth 8-3886] merging instance 'U0/ip2bus_data_i_D1_reg[16]' (FDR) to 'U0/ip2bus_data_i_D1_reg[15]'
INFO: [Synth 8-3886] merging instance 'U0/ip2bus_data_i_D1_reg[15]' (FDR) to 'U0/ip2bus_data_i_D1_reg[14]'
INFO: [Synth 8-3886] merging instance 'U0/ip2bus_data_i_D1_reg[14]' (FDR) to 'U0/ip2bus_data_i_D1_reg[13]'
INFO: [Synth 8-3886] merging instance 'U0/ip2bus_data_i_D1_reg[13]' (FDR) to 'U0/ip2bus_data_i_D1_reg[12]'
INFO: [Synth 8-3886] merging instance 'U0/ip2bus_data_i_D1_reg[12]' (FDR) to 'U0/ip2bus_data_i_D1_reg[11]'
INFO: [Synth 8-3886] merging instance 'U0/ip2bus_data_i_D1_reg[11]' (FDR) to 'U0/ip2bus_data_i_D1_reg[10]'
INFO: [Synth 8-3886] merging instance 'U0/ip2bus_data_i_D1_reg[10]' (FDR) to 'U0/ip2bus_data_i_D1_reg[9]'
INFO: [Synth 8-3886] merging instance 'U0/ip2bus_data_i_D1_reg[9]' (FDR) to 'U0/ip2bus_data_i_D1_reg[8]'
INFO: [Synth 8-3886] merging instance 'U0/ip2bus_data_i_D1_reg[8]' (FDR) to 'U0/ip2bus_data_i_D1_reg[7]'
INFO: [Synth 8-3886] merging instance 'U0/ip2bus_data_i_D1_reg[7]' (FDR) to 'U0/ip2bus_data_i_D1_reg[6]'
INFO: [Synth 8-3886] merging instance 'U0/ip2bus_data_i_D1_reg[6]' (FDR) to 'U0/ip2bus_data_i_D1_reg[5]'
INFO: [Synth 8-3886] merging instance 'U0/ip2bus_data_i_D1_reg[5]' (FDR) to 'U0/ip2bus_data_i_D1_reg[4]'
INFO: [Synth 8-3886] merging instance 'U0/ip2bus_data_i_D1_reg[4]' (FDR) to 'U0/ip2bus_data_i_D1_reg[3]'
INFO: [Synth 8-3886] merging instance 'U0/ip2bus_data_i_D1_reg[3]' (FDR) to 'U0/ip2bus_data_i_D1_reg[2]'
INFO: [Synth 8-3886] merging instance 'U0/ip2bus_data_i_D1_reg[2]' (FDR) to 'U0/ip2bus_data_i_D1_reg[1]'
INFO: [Synth 8-3886] merging instance 'U0/ip2bus_data_i_D1_reg[1]' (FDR) to 'U0/ip2bus_data_i_D1_reg[0]'
INFO: [Synth 8-3333] propagating constant 0 across sequential element (U0/\AXI_LITE_IPIF_I/I_SLAVE_ATTACHMENT/s_axi_rresp_i_reg[0] )
INFO: [Synth 8-3333] propagating constant 0 across sequential element (U0/\AXI_LITE_IPIF_I/I_SLAVE_ATTACHMENT/s_axi_rresp_i_reg[1] )
INFO: [Synth 8-3886] merging instance 'U0/AXI_LITE_IPIF_I/I_SLAVE_ATTACHMENT/s_axi_rdata_i_reg[4]' (FDRE) to 'U0/AXI_LITE_IPIF_I/I_SLAVE_ATTACHMENT/s_axi_rdata_i_reg[5]'
INFO: [Synth 8-3886] merging instance 'U0/AXI_LITE_IPIF_I/I_SLAVE_ATTACHMENT/s_axi_rdata_i_reg[5]' (FDRE) to 'U0/AXI_LITE_IPIF_I/I_SLAVE_ATTACHMENT/s_axi_rdata_i_reg[6]'
INFO: [Synth 8-3886] merging instance 'U0/AXI_LITE_IPIF_I/I_SLAVE_ATTACHMENT/s_axi_rdata_i_reg[6]' (FDRE) to 'U0/AXI_LITE_IPIF_I/I_SLAVE_ATTACHMENT/s_axi_rdata_i_reg[7]'
INFO: [Synth 8-3886] merging instance 'U0/AXI_LITE_IPIF_I/I_SLAVE_ATTACHMENT/s_axi_rdata_i_reg[7]' (FDRE) to 'U0/AXI_LITE_IPIF_I/I_SLAVE_ATTACHMENT/s_axi_rdata_i_reg[8]'
INFO: [Synth 8-3886] merging instance 'U0/AXI_LITE_IPIF_I/I_SLAVE_ATTACHMENT/s_axi_rdata_i_reg[8]' (FDRE) to 'U0/AXI_LITE_IPIF_I/I_SLAVE_ATTACHMENT/s_axi_rdata_i_reg[9]'
INFO: [Synth 8-3886] merging instance 'U0/AXI_LITE_IPIF_I/I_SLAVE_ATTACHMENT/s_axi_rdata_i_reg[9]' (FDRE) to 'U0/AXI_LITE_IPIF_I/I_SLAVE_ATTACHMENT/s_axi_rdata_i_reg[10]'
INFO: [Synth 8-3886] merging instance 'U0/AXI_LITE_IPIF_I/I_SLAVE_ATTACHMENT/s_axi_rdata_i_reg[10]' (FDRE) to 'U0/AXI_LITE_IPIF_I/I_SLAVE_ATTACHMENT/s_axi_rdata_i_reg[11]'
INFO: [Synth 8-3886] merging instance 'U0/AXI_LITE_IPIF_I/I_SLAVE_ATTACHMENT/s_axi_rdata_i_reg[11]' (FDRE) to 'U0/AXI_LITE_IPIF_I/I_SLAVE_ATTACHMENT/s_axi_rdata_i_reg[12]'
INFO: [Synth 8-3886] merging instance 'U0/AXI_LITE_IPIF_I/I_SLAVE_ATTACHMENT/s_axi_rdata_i_reg[12]' (FDRE) to 'U0/AXI_LITE_IPIF_I/I_SLAVE_ATTACHMENT/s_axi_rdata_i_reg[13]'
INFO: [Synth 8-3886] merging instance 'U0/AXI_LITE_IPIF_I/I_SLAVE_ATTACHMENT/s_axi_rdata_i_reg[13]' (FDRE) to 'U0/AXI_LITE_IPIF_I/I_SLAVE_ATTACHMENT/s_axi_rdata_i_reg[14]'
INFO: [Synth 8-3886] merging instance 'U0/AXI_LITE_IPIF_I/I_SLAVE_ATTACHMENT/s_axi_rdata_i_reg[14]' (FDRE) to 'U0/AXI_LITE_IPIF_I/I_SLAVE_ATTACHMENT/s_axi_rdata_i_reg[15]'
INFO: [Synth 8-3886] merging instance 'U0/AXI_LITE_IPIF_I/I_SLAVE_ATTACHMENT/s_axi_rdata_i_reg[15]' (FDRE) to 'U0/AXI_LITE_IPIF_I/I_SLAVE_ATTACHMENT/s_axi_rdata_i_reg[16]'
INFO: [Synth 8-3886] merging instance 'U0/AXI_LITE_IPIF_I/I_SLAVE_ATTACHMENT/s_axi_rdata_i_reg[16]' (FDRE) to 'U0/AXI_LITE_IPIF_I/I_SLAVE_ATTACHMENT/s_axi_rdata_i_reg[17]'
INFO: [Synth 8-3886] merging instance 'U0/AXI_LITE_IPIF_I/I_SLAVE_ATTACHMENT/s_axi_rdata_i_reg[17]' (FDRE) to 'U0/AXI_LITE_IPIF_I/I_SLAVE_ATTACHMENT/s_axi_rdata_i_reg[18]'
INFO: [Synth 8-3886] merging instance 'U0/AXI_LITE_IPIF_I/I_SLAVE_ATTACHMENT/s_axi_rdata_i_reg[18]' (FDRE) to 'U0/AXI_LITE_IPIF_I/I_SLAVE_ATTACHMENT/s_axi_rdata_i_reg[19]'
INFO: [Synth 8-3886] merging instance 'U0/AXI_LITE_IPIF_I/I_SLAVE_ATTACHMENT/s_axi_rdata_i_reg[19]' (FDRE) to 'U0/AXI_LITE_IPIF_I/I_SLAVE_ATTACHMENT/s_axi_rdata_i_reg[20]'
INFO: [Synth 8-3886] merging instance 'U0/AXI_LITE_IPIF_I/I_SLAVE_ATTACHMENT/s_axi_rdata_i_reg[20]' (FDRE) to 'U0/AXI_LITE_IPIF_I/I_SLAVE_ATTACHMENT/s_axi_rdata_i_reg[21]'
INFO: [Synth 8-3886] merging instance 'U0/AXI_LITE_IPIF_I/I_SLAVE_ATTACHMENT/s_axi_rdata_i_reg[21]' (FDRE) to 'U0/AXI_LITE_IPIF_I/I_SLAVE_ATTACHMENT/s_axi_rdata_i_reg[22]'
INFO: [Synth 8-3886] merging instance 'U0/AXI_LITE_IPIF_I/I_SLAVE_ATTACHMENT/s_axi_rdata_i_reg[22]' (FDRE) to 'U0/AXI_LITE_IPIF_I/I_SLAVE_ATTACHMENT/s_axi_rdata_i_reg[23]'
INFO: [Synth 8-3886] merging instance 'U0/AXI_LITE_IPIF_I/I_SLAVE_ATTACHMENT/s_axi_rdata_i_reg[23]' (FDRE) to 'U0/AXI_LITE_IPIF_I/I_SLAVE_ATTACHMENT/s_axi_rdata_i_reg[24]'
INFO: [Synth 8-3886] merging instance 'U0/AXI_LITE_IPIF_I/I_SLAVE_ATTACHMENT/s_axi_rdata_i_reg[24]' (FDRE) to 'U0/AXI_LITE_IPIF_I/I_SLAVE_ATTACHMENT/s_axi_rdata_i_reg[25]'
INFO: [Synth 8-3886] merging instance 'U0/AXI_LITE_IPIF_I/I_SLAVE_ATTACHMENT/s_axi_rdata_i_reg[25]' (FDRE) to 'U0/AXI_LITE_IPIF_I/I_SLAVE_ATTACHMENT/s_axi_rdata_i_reg[26]'
INFO: [Synth 8-3886] merging instance 'U0/AXI_LITE_IPIF_I/I_SLAVE_ATTACHMENT/s_axi_rdata_i_reg[26]' (FDRE) to 'U0/AXI_LITE_IPIF_I/I_SLAVE_ATTACHMENT/s_axi_rdata_i_reg[27]'
INFO: [Synth 8-3886] merging instance 'U0/AXI_LITE_IPIF_I/I_SLAVE_ATTACHMENT/s_axi_rdata_i_reg[27]' (FDRE) to 'U0/AXI_LITE_IPIF_I/I_SLAVE_ATTACHMENT/s_axi_rdata_i_reg[28]'
INFO: [Synth 8-3886] merging instance 'U0/AXI_LITE_IPIF_I/I_SLAVE_ATTACHMENT/s_axi_rdata_i_reg[28]' (FDRE) to 'U0/AXI_LITE_IPIF_I/I_SLAVE_ATTACHMENT/s_axi_rdata_i_reg[29]'
INFO: [Synth 8-3886] merging instance 'U0/AXI_LITE_IPIF_I/I_SLAVE_ATTACHMENT/s_axi_rdata_i_reg[29]' (FDRE) to 'U0/AXI_LITE_IPIF_I/I_SLAVE_ATTACHMENT/s_axi_rdata_i_reg[30]'
INFO: [Synth 8-3886] merging instance 'U0/AXI_LITE_IPIF_I/I_SLAVE_ATTACHMENT/s_axi_rdata_i_reg[30]' (FDRE) to 'U0/AXI_LITE_IPIF_I/I_SLAVE_ATTACHMENT/s_axi_rdata_i_reg[31]'
INFO: [Synth 8-3333] propagating constant 0 across sequential element (U0/\AXI_LITE_IPIF_I/I_SLAVE_ATTACHMENT/s_axi_bresp_i_reg[0] )
INFO: [Synth 8-3333] propagating constant 0 across sequential element (U0/\AXI_LITE_IPIF_I/I_SLAVE_ATTACHMENT/s_axi_bresp_i_reg[1] )
INFO: [Synth 8-3332] Sequential element (gpio_core_1/Dual.INPUT_DOUBLE_REGS4/GENERATE_LEVEL_P_S_CDC.MULTI_BIT.FOR_CROSS_PLEVEL_IN2SCNDRY_bus_d5[0].CROSS2_PLEVEL_IN2SCNDRY_s_level_out_bus_d5) is unused and will be removed from module axi_gpio.
INFO: [Synth 8-3332] Sequential element (gpio_core_1/Dual.INPUT_DOUBLE_REGS4/GENERATE_LEVEL_P_S_CDC.MULTI_BIT.FOR_CROSS_PLEVEL_IN2SCNDRY_bus_d5[1].CROSS2_PLEVEL_IN2SCNDRY_s_level_out_bus_d5) is unused and will be removed from module axi_gpio.
INFO: [Synth 8-3332] Sequential element (gpio_core_1/Dual.INPUT_DOUBLE_REGS4/GENERATE_LEVEL_P_S_CDC.MULTI_BIT.FOR_CROSS_PLEVEL_IN2SCNDRY_bus_d5[2].CROSS2_PLEVEL_IN2SCNDRY_s_level_out_bus_d5) is unused and will be removed from module axi_gpio.
INFO: [Synth 8-3332] Sequential element (gpio_core_1/Dual.INPUT_DOUBLE_REGS4/GENERATE_LEVEL_P_S_CDC.MULTI_BIT.FOR_CROSS_PLEVEL_IN2SCNDRY_bus_d5[3].CROSS2_PLEVEL_IN2SCNDRY_s_level_out_bus_d5) is unused and will be removed from module axi_gpio.
INFO: [Synth 8-3332] Sequential element (gpio_core_1/Dual.INPUT_DOUBLE_REGS4/GENERATE_LEVEL_P_S_CDC.MULTI_BIT.FOR_CROSS_PLEVEL_IN2SCNDRY_bus_d6[0].CROSS2_PLEVEL_IN2SCNDRY_s_level_out_bus_d6) is unused and will be removed from module axi_gpio.
INFO: [Synth 8-3332] Sequential element (gpio_core_1/Dual.INPUT_DOUBLE_REGS4/GENERATE_LEVEL_P_S_CDC.MULTI_BIT.FOR_CROSS_PLEVEL_IN2SCNDRY_bus_d6[1].CROSS2_PLEVEL_IN2SCNDRY_s_level_out_bus_d6) is unused and will be removed from module axi_gpio.
INFO: [Synth 8-3332] Sequential element (gpio_core_1/Dual.INPUT_DOUBLE_REGS4/GENERATE_LEVEL_P_S_CDC.MULTI_BIT.FOR_CROSS_PLEVEL_IN2SCNDRY_bus_d6[2].CROSS2_PLEVEL_IN2SCNDRY_s_level_out_bus_d6) is unused and will be removed from module axi_gpio.
INFO: [Synth 8-3332] Sequential element (gpio_core_1/Dual.INPUT_DOUBLE_REGS4/GENERATE_LEVEL_P_S_CDC.MULTI_BIT.FOR_CROSS_PLEVEL_IN2SCNDRY_bus_d6[3].CROSS2_PLEVEL_IN2SCNDRY_s_level_out_bus_d6) is unused and will be removed from module axi_gpio.
INFO: [Synth 8-3332] Sequential element (gpio_core_1/Dual.INPUT_DOUBLE_REGS5/GENERATE_LEVEL_P_S_CDC.MULTI_BIT.FOR_CROSS_PLEVEL_IN2SCNDRY_bus_d5[0].CROSS2_PLEVEL_IN2SCNDRY_s_level_out_bus_d5) is unused and will be removed from module axi_gpio.
INFO: [Synth 8-3332] Sequential element (gpio_core_1/Dual.INPUT_DOUBLE_REGS5/GENERATE_LEVEL_P_S_CDC.MULTI_BIT.FOR_CROSS_PLEVEL_IN2SCNDRY_bus_d5[1].CROSS2_PLEVEL_IN2SCNDRY_s_level_out_bus_d5) is unused and will be removed from module axi_gpio.
INFO: [Synth 8-3332] Sequential element (gpio_core_1/Dual.INPUT_DOUBLE_REGS5/GENERATE_LEVEL_P_S_CDC.MULTI_BIT.FOR_CROSS_PLEVEL_IN2SCNDRY_bus_d5[2].CROSS2_PLEVEL_IN2SCNDRY_s_level_out_bus_d5) is unused and will be removed from module axi_gpio.
INFO: [Synth 8-3332] Sequential element (gpio_core_1/Dual.INPUT_DOUBLE_REGS5/GENERATE_LEVEL_P_S_CDC.MULTI_BIT.FOR_CROSS_PLEVEL_IN2SCNDRY_bus_d5[3].CROSS2_PLEVEL_IN2SCNDRY_s_level_out_bus_d5) is unused and will be removed from module axi_gpio.
INFO: [Synth 8-3332] Sequential element (gpio_core_1/Dual.INPUT_DOUBLE_REGS5/GENERATE_LEVEL_P_S_CDC.MULTI_BIT.FOR_CROSS_PLEVEL_IN2SCNDRY_bus_d6[0].CROSS2_PLEVEL_IN2SCNDRY_s_level_out_bus_d6) is unused and will be removed from module axi_gpio.
INFO: [Synth 8-3332] Sequential element (gpio_core_1/Dual.INPUT_DOUBLE_REGS5/GENERATE_LEVEL_P_S_CDC.MULTI_BIT.FOR_CROSS_PLEVEL_IN2SCNDRY_bus_d6[1].CROSS2_PLEVEL_IN2SCNDRY_s_level_out_bus_d6) is unused and will be removed from module axi_gpio.
INFO: [Synth 8-3332] Sequential element (gpio_core_1/Dual.INPUT_DOUBLE_REGS5/GENERATE_LEVEL_P_S_CDC.MULTI_BIT.FOR_CROSS_PLEVEL_IN2SCNDRY_bus_d6[2].CROSS2_PLEVEL_IN2SCNDRY_s_level_out_bus_d6) is unused and will be removed from module axi_gpio.
INFO: [Synth 8-3332] Sequential element (gpio_core_1/Dual.INPUT_DOUBLE_REGS5/GENERATE_LEVEL_P_S_CDC.MULTI_BIT.FOR_CROSS_PLEVEL_IN2SCNDRY_bus_d6[3].CROSS2_PLEVEL_IN2SCNDRY_s_level_out_bus_d6) is unused and will be removed from module axi_gpio.
INFO: [Synth 8-3332] Sequential element (AXI_LITE_IPIF_I/I_SLAVE_ATTACHMENT/s_axi_bresp_i_reg[1]) is unused and will be removed from module axi_gpio.
INFO: [Synth 8-3332] Sequential element (AXI_LITE_IPIF_I/I_SLAVE_ATTACHMENT/s_axi_bresp_i_reg[0]) is unused and will be removed from module axi_gpio.
INFO: [Synth 8-3332] Sequential element (AXI_LITE_IPIF_I/I_SLAVE_ATTACHMENT/s_axi_rresp_i_reg[1]) is unused and will be removed from module axi_gpio.
INFO: [Synth 8-3332] Sequential element (AXI_LITE_IPIF_I/I_SLAVE_ATTACHMENT/s_axi_rresp_i_reg[0]) is unused and will be removed from module axi_gpio.
INFO: [Synth 8-3332] Sequential element (AXI_LITE_IPIF_I/I_SLAVE_ATTACHMENT/bus2ip_addr_i_reg[7]) is unused and will be removed from module axi_gpio.
INFO: [Synth 8-3332] Sequential element (AXI_LITE_IPIF_I/I_SLAVE_ATTACHMENT/bus2ip_addr_i_reg[6]) is unused and will be removed from module axi_gpio.
INFO: [Synth 8-3332] Sequential element (AXI_LITE_IPIF_I/I_SLAVE_ATTACHMENT/bus2ip_addr_i_reg[5]) is unused and will be removed from module axi_gpio.
INFO: [Synth 8-3332] Sequential element (AXI_LITE_IPIF_I/I_SLAVE_ATTACHMENT/bus2ip_addr_i_reg[4]) is unused and will be removed from module axi_gpio.
INFO: [Synth 8-3332] Sequential element (AXI_LITE_IPIF_I/I_SLAVE_ATTACHMENT/bus2ip_addr_i_reg[1]) is unused and will be removed from module axi_gpio.
INFO: [Synth 8-3332] Sequential element (AXI_LITE_IPIF_I/I_SLAVE_ATTACHMENT/bus2ip_addr_i_reg[0]) is unused and will be removed from module axi_gpio.
---------------------------------------------------------------------------------
Finished Cross Boundary and Area Optimization : Time (s): cpu = 00:00:13 ; elapsed = 00:00:24 . Memory (MB): peak = 1678.520 ; gain = 480.836 ; free physical = 9285 ; free virtual = 19915
---------------------------------------------------------------------------------

Report RTL Partitions: 
+-+--------------+------------+----------+
| |RTL Partition |Replication |Instances |
+-+--------------+------------+----------+
+-+--------------+------------+----------+
---------------------------------------------------------------------------------
Start Applying XDC Timing Constraints
---------------------------------------------------------------------------------
---------------------------------------------------------------------------------
Finished Applying XDC Timing Constraints : Time (s): cpu = 00:00:18 ; elapsed = 00:00:32 . Memory (MB): peak = 1678.520 ; gain = 480.836 ; free physical = 8884 ; free virtual = 19499
---------------------------------------------------------------------------------
---------------------------------------------------------------------------------
Start Timing Optimization
---------------------------------------------------------------------------------
---------------------------------------------------------------------------------
Finished Timing Optimization : Time (s): cpu = 00:00:18 ; elapsed = 00:00:32 . Memory (MB): peak = 1678.520 ; gain = 480.836 ; free physical = 8881 ; free virtual = 19497
---------------------------------------------------------------------------------

Report RTL Partitions: 
+-+--------------+------------+----------+
| |RTL Partition |Replication |Instances |
+-+--------------+------------+----------+
+-+--------------+------------+----------+
---------------------------------------------------------------------------------
Start Technology Mapping
---------------------------------------------------------------------------------
---------------------------------------------------------------------------------
Finished Technology Mapping : Time (s): cpu = 00:00:18 ; elapsed = 00:00:32 . Memory (MB): peak = 1678.520 ; gain = 480.836 ; free physical = 8881 ; free virtual = 19496
---------------------------------------------------------------------------------

Report RTL Partitions: 
+-+--------------+------------+----------+
| |RTL Partition |Replication |Instances |
+-+--------------+------------+----------+
+-+--------------+------------+----------+
---------------------------------------------------------------------------------
Start IO Insertion
---------------------------------------------------------------------------------
---------------------------------------------------------------------------------
Start Flattening Before IO Insertion
---------------------------------------------------------------------------------
---------------------------------------------------------------------------------
Finished Flattening Before IO Insertion
---------------------------------------------------------------------------------
---------------------------------------------------------------------------------
Start Final Netlist Cleanup
---------------------------------------------------------------------------------
---------------------------------------------------------------------------------
Finished Final Netlist Cleanup
---------------------------------------------------------------------------------
---------------------------------------------------------------------------------
Finished IO Insertion : Time (s): cpu = 00:00:19 ; elapsed = 00:00:33 . Memory (MB): peak = 1678.520 ; gain = 480.836 ; free physical = 8859 ; free virtual = 19502
---------------------------------------------------------------------------------

Report Check Netlist: 
+------+------------------+-------+---------+-------+------------------+
|      |Item              |Errors |Warnings |Status |Description       |
+------+------------------+-------+---------+-------+------------------+
|1     |multi_driven_nets |      0|        0|Passed |Multi driven nets |
+------+------------------+-------+---------+-------+------------------+
---------------------------------------------------------------------------------
Start Renaming Generated Instances
---------------------------------------------------------------------------------
---------------------------------------------------------------------------------
Finished Renaming Generated Instances : Time (s): cpu = 00:00:19 ; elapsed = 00:00:33 . Memory (MB): peak = 1678.520 ; gain = 480.836 ; free physical = 8859 ; free virtual = 19502
---------------------------------------------------------------------------------

Report RTL Partitions: 
+-+--------------+------------+----------+
| |RTL Partition |Replication |Instances |
+-+--------------+------------+----------+
+-+--------------+------------+----------+
---------------------------------------------------------------------------------
Start Rebuilding User Hierarchy
---------------------------------------------------------------------------------
---------------------------------------------------------------------------------
Finished Rebuilding User Hierarchy : Time (s): cpu = 00:00:19 ; elapsed = 00:00:33 . Memory (MB): peak = 1678.520 ; gain = 480.836 ; free physical = 8856 ; free virtual = 19498
---------------------------------------------------------------------------------
---------------------------------------------------------------------------------
Start Renaming Generated Ports
---------------------------------------------------------------------------------
---------------------------------------------------------------------------------
Finished Renaming Generated Ports : Time (s): cpu = 00:00:19 ; elapsed = 00:00:33 . Memory (MB): peak = 1678.520 ; gain = 480.836 ; free physical = 8855 ; free virtual = 19497
---------------------------------------------------------------------------------
---------------------------------------------------------------------------------
Start Handling Custom Attributes
---------------------------------------------------------------------------------
---------------------------------------------------------------------------------
Finished Handling Custom Attributes : Time (s): cpu = 00:00:19 ; elapsed = 00:00:33 . Memory (MB): peak = 1678.520 ; gain = 480.836 ; free physical = 8854 ; free virtual = 19496
---------------------------------------------------------------------------------
---------------------------------------------------------------------------------
Start Renaming Generated Nets
---------------------------------------------------------------------------------
---------------------------------------------------------------------------------
Finished Renaming Generated Nets : Time (s): cpu = 00:00:19 ; elapsed = 00:00:33 . Memory (MB): peak = 1678.520 ; gain = 480.836 ; free physical = 8852 ; free virtual = 19495
---------------------------------------------------------------------------------
---------------------------------------------------------------------------------
Start Writing Synthesis Report
---------------------------------------------------------------------------------

Report BlackBoxes: 
+-+--------------+----------+
| |BlackBox name |Instances |
+-+--------------+----------+
+-+--------------+----------+

Report Cell Usage: 
+------+-----+------+
|      |Cell |Count |
+------+-----+------+
|1     |LUT1 |     2|
|2     |LUT2 |     9|
|3     |LUT3 |     7|
|4     |LUT4 |     4|
|5     |LUT5 |    26|
|6     |LUT6 |     8|
|7     |FDR  |    32|
|8     |FDRE |    63|
|9     |FDSE |     9|
+------+-----+------+

Report Instance Areas: 
+------+--------------------------------------------------------------------------+--------------------------+------+
|      |Instance                                                                  |Module                    |Cells |
+------+--------------------------------------------------------------------------+--------------------------+------+
|1     |top                                                                       |                          |   160|
|2     |  U0                                                                      |axi_gpio                  |   160|
|3     |    AXI_LITE_IPIF_I                                                       |axi_lite_ipif             |    76|
|4     |      I_SLAVE_ATTACHMENT                                                  |slave_attachment          |    76|
|5     |        I_DECODER                                                         |address_decoder           |    27|
|6     |          \MEM_DECODE_GEN[0].PER_CE_GEN[0].MULTIPLE_CES_THIS_CS_GEN.CE_I  |pselect_f                 |     1|
|7     |          \MEM_DECODE_GEN[0].PER_CE_GEN[2].MULTIPLE_CES_THIS_CS_GEN.CE_I  |pselect_f__parameterized1 |     1|
|8     |    gpio_core_1                                                           |GPIO_Core                 |    77|
|9     |      \Dual.INPUT_DOUBLE_REGS4                                            |cdc_sync                  |    16|
|10    |      \Dual.INPUT_DOUBLE_REGS5                                            |cdc_sync_0                |    16|
+------+--------------------------------------------------------------------------+--------------------------+------+
---------------------------------------------------------------------------------
Finished Writing Synthesis Report : Time (s): cpu = 00:00:19 ; elapsed = 00:00:33 . Memory (MB): peak = 1678.520 ; gain = 480.836 ; free physical = 8849 ; free virtual = 19495
---------------------------------------------------------------------------------
Synthesis finished with 0 errors, 0 critical warnings and 33 warnings.
Synthesis Optimization Runtime : Time (s): cpu = 00:00:12 ; elapsed = 00:00:15 . Memory (MB): peak = 1678.520 ; gain = 128.203 ; free physical = 8932 ; free virtual = 19578
Synthesis Optimization Complete : Time (s): cpu = 00:00:19 ; elapsed = 00:00:33 . Memory (MB): peak = 1678.520 ; gain = 480.836 ; free physical = 8932 ; free virtual = 19578
INFO: [Project 1-571] Translating synthesized netlist
INFO: [Netlist 29-17] Analyzing 32 Unisim elements for replacement
INFO: [Netlist 29-28] Unisim Transformation completed in 0 CPU seconds
INFO: [Project 1-570] Preparing netlist for logic optimization
INFO: [Opt 31-138] Pushed 0 inverter(s) to 0 load pin(s).
INFO: [Project 1-111] Unisim Transformation Summary:
  A total of 32 instances were transformed.
  FDR => FDRE: 32 instances

INFO: [Common 17-83] Releasing license: Synthesis
159 Infos, 67 Warnings, 0 Critical Warnings and 0 Errors encountered.
synth_design completed successfully
synth_design: Time (s): cpu = 00:00:21 ; elapsed = 00:00:34 . Memory (MB): peak = 1678.520 ; gain = 492.711 ; free physical = 9243 ; free virtual = 19895
WARNING: [Constraints 18-5210] No constraint will be written out.
INFO: [Common 17-1381] The checkpoint '/home/bryan/Documents/PXL/Embedded_Operating_Systems/oefeningenbundel/oefening_14/oefening_14.runs/block_design_axi_gpio_0_1_synth_1/block_design_axi_gpio_0_1.dcp' has been generated.
