
*** Running vivado
    with args -log block_design_my_pwm_core_0_0.vds -m64 -product Vivado -mode batch -messageDb vivado.pb -notrace -source block_design_my_pwm_core_0_0.tcl


****** Vivado v2018.2.2 (64-bit)
  **** SW Build 2348494 on Mon Oct  1 18:25:39 MDT 2018
  **** IP Build 2318053 on Mon Oct  1 21:44:26 MDT 2018
    ** Copyright 1986-2018 Xilinx, Inc. All Rights Reserved.

source block_design_my_pwm_core_0_0.tcl -notrace
Command: synth_design -top block_design_my_pwm_core_0_0 -part xc7z010clg400-1 -mode out_of_context
Starting synth_design
Attempting to get a license for feature 'Synthesis' and/or device 'xc7z010'
INFO: [Common 17-349] Got license for feature 'Synthesis' and/or device 'xc7z010'
INFO: Launching helper process for spawning children vivado processes
INFO: Helper process launched with PID 7907 
---------------------------------------------------------------------------------
Starting RTL Elaboration : Time (s): cpu = 00:00:02 ; elapsed = 00:00:02 . Memory (MB): peak = 1273.523 ; gain = 81.586 ; free physical = 7395 ; free virtual = 19493
---------------------------------------------------------------------------------
INFO: [Synth 8-6157] synthesizing module 'block_design_my_pwm_core_0_0' [/home/bryan/Documents/PXL/Embedded_Operating_Systems/oefeningenbundel/oefening_4/oefening_4.srcs/sources_1/bd/block_design/ip/block_design_my_pwm_core_0_0/synth/block_design_my_pwm_core_0_0.v:56]
INFO: [Synth 8-6157] synthesizing module 'my_pwm_core_v1_0' [/home/bryan/Documents/PXL/Embedded_Operating_Systems/oefeningenbundel/oefening_4/oefening_4.srcs/sources_1/bd/block_design/ipshared/1422/hdl/my_pwm_core_v1_0.v:4]
	Parameter PWM_COUNTER_MAX bound to: 128 - type: integer 
	Parameter C_S00_AXI_DATA_WIDTH bound to: 32 - type: integer 
	Parameter C_S00_AXI_ADDR_WIDTH bound to: 4 - type: integer 
INFO: [Synth 8-6157] synthesizing module 'my_pwm_core_v1_0_S00_AXI' [/home/bryan/Documents/PXL/Embedded_Operating_Systems/oefeningenbundel/oefening_4/oefening_4.srcs/sources_1/bd/block_design/ipshared/1422/hdl/my_pwm_core_v1_0_S00_AXI.v:4]
	Parameter PWM_COUNTER_MAX bound to: 128 - type: integer 
	Parameter C_S_AXI_DATA_WIDTH bound to: 32 - type: integer 
	Parameter C_S_AXI_ADDR_WIDTH bound to: 4 - type: integer 
	Parameter ADDR_LSB bound to: 2 - type: integer 
	Parameter OPT_MEM_ADDR_BITS bound to: 1 - type: integer 
INFO: [Synth 8-226] default block is never used [/home/bryan/Documents/PXL/Embedded_Operating_Systems/oefeningenbundel/oefening_4/oefening_4.srcs/sources_1/bd/block_design/ipshared/1422/hdl/my_pwm_core_v1_0_S00_AXI.v:234]
INFO: [Synth 8-226] default block is never used [/home/bryan/Documents/PXL/Embedded_Operating_Systems/oefeningenbundel/oefening_4/oefening_4.srcs/sources_1/bd/block_design/ipshared/1422/hdl/my_pwm_core_v1_0_S00_AXI.v:375]
INFO: [Synth 8-6155] done synthesizing module 'my_pwm_core_v1_0_S00_AXI' (1#1) [/home/bryan/Documents/PXL/Embedded_Operating_Systems/oefeningenbundel/oefening_4/oefening_4.srcs/sources_1/bd/block_design/ipshared/1422/hdl/my_pwm_core_v1_0_S00_AXI.v:4]
INFO: [Synth 8-6155] done synthesizing module 'my_pwm_core_v1_0' (2#1) [/home/bryan/Documents/PXL/Embedded_Operating_Systems/oefeningenbundel/oefening_4/oefening_4.srcs/sources_1/bd/block_design/ipshared/1422/hdl/my_pwm_core_v1_0.v:4]
INFO: [Synth 8-6155] done synthesizing module 'block_design_my_pwm_core_0_0' (3#1) [/home/bryan/Documents/PXL/Embedded_Operating_Systems/oefeningenbundel/oefening_4/oefening_4.srcs/sources_1/bd/block_design/ip/block_design_my_pwm_core_0_0/synth/block_design_my_pwm_core_0_0.v:56]
WARNING: [Synth 8-3331] design my_pwm_core_v1_0_S00_AXI has unconnected port S_AXI_AWPROT[2]
WARNING: [Synth 8-3331] design my_pwm_core_v1_0_S00_AXI has unconnected port S_AXI_AWPROT[1]
WARNING: [Synth 8-3331] design my_pwm_core_v1_0_S00_AXI has unconnected port S_AXI_AWPROT[0]
WARNING: [Synth 8-3331] design my_pwm_core_v1_0_S00_AXI has unconnected port S_AXI_ARPROT[2]
WARNING: [Synth 8-3331] design my_pwm_core_v1_0_S00_AXI has unconnected port S_AXI_ARPROT[1]
WARNING: [Synth 8-3331] design my_pwm_core_v1_0_S00_AXI has unconnected port S_AXI_ARPROT[0]
---------------------------------------------------------------------------------
Finished RTL Elaboration : Time (s): cpu = 00:00:03 ; elapsed = 00:00:03 . Memory (MB): peak = 1318.148 ; gain = 126.211 ; free physical = 7393 ; free virtual = 19491
---------------------------------------------------------------------------------

Report Check Netlist: 
+------+------------------+-------+---------+-------+------------------+
|      |Item              |Errors |Warnings |Status |Description       |
+------+------------------+-------+---------+-------+------------------+
|1     |multi_driven_nets |      0|        0|Passed |Multi driven nets |
+------+------------------+-------+---------+-------+------------------+
---------------------------------------------------------------------------------
Start Handling Custom Attributes
---------------------------------------------------------------------------------
---------------------------------------------------------------------------------
Finished Handling Custom Attributes : Time (s): cpu = 00:00:03 ; elapsed = 00:00:03 . Memory (MB): peak = 1318.148 ; gain = 126.211 ; free physical = 7355 ; free virtual = 19454
---------------------------------------------------------------------------------
---------------------------------------------------------------------------------
Finished RTL Optimization Phase 1 : Time (s): cpu = 00:00:03 ; elapsed = 00:00:03 . Memory (MB): peak = 1318.148 ; gain = 126.211 ; free physical = 7355 ; free virtual = 19454
---------------------------------------------------------------------------------
INFO: [Device 21-403] Loading part xc7z010clg400-1
INFO: [Project 1-570] Preparing netlist for logic optimization

Processing XDC Constraints
Initializing timing engine
Completed Processing XDC Constraints

INFO: [Project 1-111] Unisim Transformation Summary:
No Unisim elements were transformed.

WARNING: [Constraints 18-5210] No constraint will be written out.
Constraint Validation Runtime : Time (s): cpu = 00:00:00.07 ; elapsed = 00:00:00.11 . Memory (MB): peak = 1657.789 ; gain = 2.000 ; free physical = 6752 ; free virtual = 18872
---------------------------------------------------------------------------------
Finished Constraint Validation : Time (s): cpu = 00:00:12 ; elapsed = 00:00:23 . Memory (MB): peak = 1657.789 ; gain = 465.852 ; free physical = 6787 ; free virtual = 18903
---------------------------------------------------------------------------------
---------------------------------------------------------------------------------
Start Loading Part and Timing Information
---------------------------------------------------------------------------------
Loading part: xc7z010clg400-1
---------------------------------------------------------------------------------
Finished Loading Part and Timing Information : Time (s): cpu = 00:00:12 ; elapsed = 00:00:23 . Memory (MB): peak = 1657.789 ; gain = 465.852 ; free physical = 6787 ; free virtual = 18903
---------------------------------------------------------------------------------
---------------------------------------------------------------------------------
Start Applying 'set_property' XDC Constraints
---------------------------------------------------------------------------------
---------------------------------------------------------------------------------
Finished applying 'set_property' XDC Constraints : Time (s): cpu = 00:00:12 ; elapsed = 00:00:23 . Memory (MB): peak = 1657.789 ; gain = 465.852 ; free physical = 6789 ; free virtual = 18905
---------------------------------------------------------------------------------
---------------------------------------------------------------------------------
Finished RTL Optimization Phase 2 : Time (s): cpu = 00:00:12 ; elapsed = 00:00:24 . Memory (MB): peak = 1657.789 ; gain = 465.852 ; free physical = 6764 ; free virtual = 18881
---------------------------------------------------------------------------------

Report RTL Partitions: 
+-+--------------+------------+----------+
| |RTL Partition |Replication |Instances |
+-+--------------+------------+----------+
+-+--------------+------------+----------+
---------------------------------------------------------------------------------
Start RTL Component Statistics 
---------------------------------------------------------------------------------
Detailed RTL Component Info : 
+---Adders : 
	   2 Input      7 Bit       Adders := 1     
+---Registers : 
	               32 Bit    Registers := 5     
	                7 Bit    Registers := 1     
	                4 Bit    Registers := 2     
	                2 Bit    Registers := 2     
	                1 Bit    Registers := 6     
+---Muxes : 
	   2 Input     32 Bit        Muxes := 4     
	   4 Input     32 Bit        Muxes := 5     
	   2 Input      1 Bit        Muxes := 5     
---------------------------------------------------------------------------------
Finished RTL Component Statistics 
---------------------------------------------------------------------------------
---------------------------------------------------------------------------------
Start RTL Hierarchical Component Statistics 
---------------------------------------------------------------------------------
Hierarchical RTL Component report 
Module my_pwm_core_v1_0_S00_AXI 
Detailed RTL Component Info : 
+---Adders : 
	   2 Input      7 Bit       Adders := 1     
+---Registers : 
	               32 Bit    Registers := 5     
	                7 Bit    Registers := 1     
	                4 Bit    Registers := 2     
	                2 Bit    Registers := 2     
	                1 Bit    Registers := 6     
+---Muxes : 
	   2 Input     32 Bit        Muxes := 4     
	   4 Input     32 Bit        Muxes := 5     
	   2 Input      1 Bit        Muxes := 5     
---------------------------------------------------------------------------------
Finished RTL Hierarchical Component Statistics
---------------------------------------------------------------------------------
---------------------------------------------------------------------------------
Start Part Resource Summary
---------------------------------------------------------------------------------
Part Resources:
DSPs: 80 (col length:40)
BRAMs: 120 (col length: RAMB18 40 RAMB36 20)
---------------------------------------------------------------------------------
Finished Part Resource Summary
---------------------------------------------------------------------------------
---------------------------------------------------------------------------------
Start Cross Boundary and Area Optimization
---------------------------------------------------------------------------------
Warning: Parallel synthesis criteria is not met 
WARNING: [Synth 8-3331] design block_design_my_pwm_core_0_0 has unconnected port s00_axi_awprot[2]
WARNING: [Synth 8-3331] design block_design_my_pwm_core_0_0 has unconnected port s00_axi_awprot[1]
WARNING: [Synth 8-3331] design block_design_my_pwm_core_0_0 has unconnected port s00_axi_awprot[0]
WARNING: [Synth 8-3331] design block_design_my_pwm_core_0_0 has unconnected port s00_axi_arprot[2]
WARNING: [Synth 8-3331] design block_design_my_pwm_core_0_0 has unconnected port s00_axi_arprot[1]
WARNING: [Synth 8-3331] design block_design_my_pwm_core_0_0 has unconnected port s00_axi_arprot[0]
INFO: [Synth 8-3886] merging instance 'inst/my_pwm_core_v1_0_S00_AXI_inst/axi_rresp_reg[0]' (FDRE) to 'inst/my_pwm_core_v1_0_S00_AXI_inst/axi_rresp_reg[1]'
INFO: [Synth 8-3333] propagating constant 0 across sequential element (\inst/my_pwm_core_v1_0_S00_AXI_inst/axi_rresp_reg[1] )
INFO: [Synth 8-3886] merging instance 'inst/my_pwm_core_v1_0_S00_AXI_inst/axi_bresp_reg[0]' (FDRE) to 'inst/my_pwm_core_v1_0_S00_AXI_inst/axi_bresp_reg[1]'
INFO: [Synth 8-3333] propagating constant 0 across sequential element (\inst/my_pwm_core_v1_0_S00_AXI_inst/axi_bresp_reg[1] )
INFO: [Synth 8-3332] Sequential element (inst/my_pwm_core_v1_0_S00_AXI_inst/axi_awaddr_reg[1]) is unused and will be removed from module block_design_my_pwm_core_0_0.
INFO: [Synth 8-3332] Sequential element (inst/my_pwm_core_v1_0_S00_AXI_inst/axi_awaddr_reg[0]) is unused and will be removed from module block_design_my_pwm_core_0_0.
INFO: [Synth 8-3332] Sequential element (inst/my_pwm_core_v1_0_S00_AXI_inst/axi_bresp_reg[1]) is unused and will be removed from module block_design_my_pwm_core_0_0.
INFO: [Synth 8-3332] Sequential element (inst/my_pwm_core_v1_0_S00_AXI_inst/axi_araddr_reg[1]) is unused and will be removed from module block_design_my_pwm_core_0_0.
INFO: [Synth 8-3332] Sequential element (inst/my_pwm_core_v1_0_S00_AXI_inst/axi_araddr_reg[0]) is unused and will be removed from module block_design_my_pwm_core_0_0.
INFO: [Synth 8-3332] Sequential element (inst/my_pwm_core_v1_0_S00_AXI_inst/axi_rresp_reg[1]) is unused and will be removed from module block_design_my_pwm_core_0_0.
---------------------------------------------------------------------------------
Finished Cross Boundary and Area Optimization : Time (s): cpu = 00:00:13 ; elapsed = 00:00:24 . Memory (MB): peak = 1657.789 ; gain = 465.852 ; free physical = 6759 ; free virtual = 18878
---------------------------------------------------------------------------------

Report RTL Partitions: 
+-+--------------+------------+----------+
| |RTL Partition |Replication |Instances |
+-+--------------+------------+----------+
+-+--------------+------------+----------+
---------------------------------------------------------------------------------
Start Applying XDC Timing Constraints
---------------------------------------------------------------------------------
---------------------------------------------------------------------------------
Finished Applying XDC Timing Constraints : Time (s): cpu = 00:00:19 ; elapsed = 00:00:32 . Memory (MB): peak = 1657.789 ; gain = 465.852 ; free physical = 6450 ; free virtual = 18564
---------------------------------------------------------------------------------
---------------------------------------------------------------------------------
Start Timing Optimization
---------------------------------------------------------------------------------
---------------------------------------------------------------------------------
Finished Timing Optimization : Time (s): cpu = 00:00:19 ; elapsed = 00:00:32 . Memory (MB): peak = 1657.789 ; gain = 465.852 ; free physical = 6463 ; free virtual = 18577
---------------------------------------------------------------------------------

Report RTL Partitions: 
+-+--------------+------------+----------+
| |RTL Partition |Replication |Instances |
+-+--------------+------------+----------+
+-+--------------+------------+----------+
---------------------------------------------------------------------------------
Start Technology Mapping
---------------------------------------------------------------------------------
---------------------------------------------------------------------------------
Finished Technology Mapping : Time (s): cpu = 00:00:19 ; elapsed = 00:00:32 . Memory (MB): peak = 1657.789 ; gain = 465.852 ; free physical = 6506 ; free virtual = 18620
---------------------------------------------------------------------------------

Report RTL Partitions: 
+-+--------------+------------+----------+
| |RTL Partition |Replication |Instances |
+-+--------------+------------+----------+
+-+--------------+------------+----------+
---------------------------------------------------------------------------------
Start IO Insertion
---------------------------------------------------------------------------------
---------------------------------------------------------------------------------
Start Flattening Before IO Insertion
---------------------------------------------------------------------------------
---------------------------------------------------------------------------------
Finished Flattening Before IO Insertion
---------------------------------------------------------------------------------
---------------------------------------------------------------------------------
Start Final Netlist Cleanup
---------------------------------------------------------------------------------
---------------------------------------------------------------------------------
Finished Final Netlist Cleanup
---------------------------------------------------------------------------------
---------------------------------------------------------------------------------
Finished IO Insertion : Time (s): cpu = 00:00:19 ; elapsed = 00:00:33 . Memory (MB): peak = 1657.789 ; gain = 465.852 ; free physical = 6449 ; free virtual = 18563
---------------------------------------------------------------------------------

Report Check Netlist: 
+------+------------------+-------+---------+-------+------------------+
|      |Item              |Errors |Warnings |Status |Description       |
+------+------------------+-------+---------+-------+------------------+
|1     |multi_driven_nets |      0|        0|Passed |Multi driven nets |
+------+------------------+-------+---------+-------+------------------+
---------------------------------------------------------------------------------
Start Renaming Generated Instances
---------------------------------------------------------------------------------
---------------------------------------------------------------------------------
Finished Renaming Generated Instances : Time (s): cpu = 00:00:19 ; elapsed = 00:00:33 . Memory (MB): peak = 1657.789 ; gain = 465.852 ; free physical = 6452 ; free virtual = 18566
---------------------------------------------------------------------------------

Report RTL Partitions: 
+-+--------------+------------+----------+
| |RTL Partition |Replication |Instances |
+-+--------------+------------+----------+
+-+--------------+------------+----------+
---------------------------------------------------------------------------------
Start Rebuilding User Hierarchy
---------------------------------------------------------------------------------
---------------------------------------------------------------------------------
Finished Rebuilding User Hierarchy : Time (s): cpu = 00:00:19 ; elapsed = 00:00:33 . Memory (MB): peak = 1657.789 ; gain = 465.852 ; free physical = 6466 ; free virtual = 18580
---------------------------------------------------------------------------------
---------------------------------------------------------------------------------
Start Renaming Generated Ports
---------------------------------------------------------------------------------
---------------------------------------------------------------------------------
Finished Renaming Generated Ports : Time (s): cpu = 00:00:19 ; elapsed = 00:00:33 . Memory (MB): peak = 1657.789 ; gain = 465.852 ; free physical = 6470 ; free virtual = 18584
---------------------------------------------------------------------------------
---------------------------------------------------------------------------------
Start Handling Custom Attributes
---------------------------------------------------------------------------------
---------------------------------------------------------------------------------
Finished Handling Custom Attributes : Time (s): cpu = 00:00:19 ; elapsed = 00:00:33 . Memory (MB): peak = 1657.789 ; gain = 465.852 ; free physical = 6480 ; free virtual = 18594
---------------------------------------------------------------------------------
---------------------------------------------------------------------------------
Start Renaming Generated Nets
---------------------------------------------------------------------------------
---------------------------------------------------------------------------------
Finished Renaming Generated Nets : Time (s): cpu = 00:00:19 ; elapsed = 00:00:33 . Memory (MB): peak = 1657.789 ; gain = 465.852 ; free physical = 6484 ; free virtual = 18598
---------------------------------------------------------------------------------
---------------------------------------------------------------------------------
Start Writing Synthesis Report
---------------------------------------------------------------------------------

Report BlackBoxes: 
+-+--------------+----------+
| |BlackBox name |Instances |
+-+--------------+----------+
+-+--------------+----------+

Report Cell Usage: 
+------+-------+------+
|      |Cell   |Count |
+------+-------+------+
|1     |CARRY4 |    20|
|2     |LUT1   |     2|
|3     |LUT2   |    51|
|4     |LUT3   |    10|
|5     |LUT4   |    47|
|6     |LUT5   |     1|
|7     |LUT6   |    39|
|8     |FDRE   |   176|
|9     |FDSE   |     1|
+------+-------+------+

Report Instance Areas: 
+------+----------------------------------+-------------------------+------+
|      |Instance                          |Module                   |Cells |
+------+----------------------------------+-------------------------+------+
|1     |top                               |                         |   347|
|2     |  inst                            |my_pwm_core_v1_0         |   347|
|3     |    my_pwm_core_v1_0_S00_AXI_inst |my_pwm_core_v1_0_S00_AXI |   347|
+------+----------------------------------+-------------------------+------+
---------------------------------------------------------------------------------
Finished Writing Synthesis Report : Time (s): cpu = 00:00:19 ; elapsed = 00:00:33 . Memory (MB): peak = 1657.789 ; gain = 465.852 ; free physical = 6487 ; free virtual = 18601
---------------------------------------------------------------------------------
Synthesis finished with 0 errors, 0 critical warnings and 6 warnings.
Synthesis Optimization Runtime : Time (s): cpu = 00:00:12 ; elapsed = 00:00:15 . Memory (MB): peak = 1657.789 ; gain = 126.211 ; free physical = 6553 ; free virtual = 18667
Synthesis Optimization Complete : Time (s): cpu = 00:00:19 ; elapsed = 00:00:33 . Memory (MB): peak = 1657.789 ; gain = 465.852 ; free physical = 6553 ; free virtual = 18667
INFO: [Project 1-571] Translating synthesized netlist
INFO: [Netlist 29-17] Analyzing 20 Unisim elements for replacement
INFO: [Netlist 29-28] Unisim Transformation completed in 0 CPU seconds
INFO: [Project 1-570] Preparing netlist for logic optimization
INFO: [Opt 31-138] Pushed 0 inverter(s) to 0 load pin(s).
INFO: [Project 1-111] Unisim Transformation Summary:
No Unisim elements were transformed.

INFO: [Common 17-83] Releasing license: Synthesis
29 Infos, 13 Warnings, 0 Critical Warnings and 0 Errors encountered.
synth_design completed successfully
synth_design: Time (s): cpu = 00:00:21 ; elapsed = 00:00:34 . Memory (MB): peak = 1665.797 ; gain = 485.727 ; free physical = 7054 ; free virtual = 19166
WARNING: [Constraints 18-5210] No constraint will be written out.
INFO: [Common 17-1381] The checkpoint '/home/bryan/Documents/PXL/Embedded_Operating_Systems/oefeningenbundel/oefening_4/oefening_4.runs/block_design_my_pwm_core_0_0_synth_1/block_design_my_pwm_core_0_0.dcp' has been generated.
INFO: [Coretcl 2-1482] Added synthesis output to IP cache for IP /home/bryan/Documents/PXL/Embedded_Operating_Systems/oefeningenbundel/oefening_4/oefening_4.srcs/sources_1/bd/block_design/ip/block_design_my_pwm_core_0_0/block_design_my_pwm_core_0_0.xci
INFO: [Coretcl 2-1174] Renamed 2 cell refs.
WARNING: [Constraints 18-5210] No constraint will be written out.
INFO: [Common 17-1381] The checkpoint '/home/bryan/Documents/PXL/Embedded_Operating_Systems/oefeningenbundel/oefening_4/oefening_4.runs/block_design_my_pwm_core_0_0_synth_1/block_design_my_pwm_core_0_0.dcp' has been generated.
INFO: [runtcl-4] Executing : report_utilization -file block_design_my_pwm_core_0_0_utilization_synth.rpt -pb block_design_my_pwm_core_0_0_utilization_synth.pb
report_utilization: Time (s): cpu = 00:00:00.01 ; elapsed = 00:00:00.02 . Memory (MB): peak = 1689.809 ; gain = 0.000 ; free physical = 6923 ; free virtual = 19036
INFO: [Common 17-206] Exiting Vivado at Sun Dec 16 19:22:17 2018...
