21:16:08 INFO  : Registering command handlers for SDK TCF services
21:16:09 INFO  : Launching XSCT server: xsct -n -interactive /home/bryan/Documents/PXL/Embedded_Operating_Systems/oefeningenbundel/oefening_10/oefening_10.sdk/temp_xsdb_launch_script.tcl
21:16:11 INFO  : XSCT server has started successfully.
21:16:11 INFO  : Successfully done setting XSCT server connection channel  
21:16:11 INFO  : Successfully done setting SDK workspace  
21:16:11 INFO  : Processing command line option -hwspec /home/bryan/Documents/PXL/Embedded_Operating_Systems/oefeningenbundel/oefening_10/oefening_10.sdk/block_design_wrapper.hdf.
21:17:29 INFO  : Connected to target on host '127.0.0.1' and port '3121'.
21:17:29 INFO  : 'targets -set -filter {jtag_cable_name =~ "Digilent Zybo 210279A42EEAA" && level==0} -index 1' command is executed.
21:17:30 INFO  : FPGA configured successfully with bitstream "/home/bryan/Documents/PXL/Embedded_Operating_Systems/oefeningenbundel/oefening_10/oefening_10.sdk/block_design_wrapper_hw_platform_0/block_design_wrapper.bit"
21:17:42 INFO  : 'targets -set -filter {jtag_cable_name =~ "Digilent Zybo 210279A42EEAA" && level==0} -index 1' command is executed.
21:17:42 INFO  : 'fpga -state' command is executed.
21:17:42 INFO  : Connected to target on host '127.0.0.1' and port '3121'.
21:17:42 INFO  : Jtag cable 'Digilent Zybo 210279A42EEAA' is selected.
21:17:42 INFO  : 'jtag frequency' command is executed.
21:17:42 INFO  : Sourcing of '/home/bryan/Documents/PXL/Embedded_Operating_Systems/oefeningenbundel/oefening_10/oefening_10.sdk/block_design_wrapper_hw_platform_0/ps7_init.tcl' is done.
21:17:42 INFO  : Context for 'APU' is selected.
21:17:42 INFO  : Hardware design information is loaded from '/home/bryan/Documents/PXL/Embedded_Operating_Systems/oefeningenbundel/oefening_10/oefening_10.sdk/block_design_wrapper_hw_platform_0/system.hdf'.
21:17:42 INFO  : 'configparams force-mem-access 1' command is executed.
21:17:43 INFO  : Context for 'APU' is selected.
21:17:43 INFO  : 'stop' command is executed.
21:17:43 INFO  : 'ps7_init' command is executed.
21:17:43 INFO  : 'ps7_post_config' command is executed.
21:17:43 INFO  : Context for processor 'ps7_cortexa9_0' is selected.
21:17:43 INFO  : Processor reset is completed for 'ps7_cortexa9_0'.
21:17:43 INFO  : Context for processor 'ps7_cortexa9_0' is selected.
21:17:43 INFO  : The application '/home/bryan/Documents/PXL/Embedded_Operating_Systems/oefeningenbundel/oefening_10/oefening_10.sdk/freertos_hello_world/Debug/freertos_hello_world.elf' is downloaded to processor 'ps7_cortexa9_0'.
21:17:43 INFO  : 'configparams force-mem-access 0' command is executed.
21:17:43 INFO  : ----------------XSDB Script----------------
connect -url tcp:127.0.0.1:3121
source /home/bryan/Documents/PXL/Embedded_Operating_Systems/oefeningenbundel/oefening_10/oefening_10.sdk/block_design_wrapper_hw_platform_0/ps7_init.tcl
targets -set -nocase -filter {name =~"APU*" && jtag_cable_name =~ "Digilent Zybo 210279A42EEAA"} -index 0
loadhw -hw /home/bryan/Documents/PXL/Embedded_Operating_Systems/oefeningenbundel/oefening_10/oefening_10.sdk/block_design_wrapper_hw_platform_0/system.hdf -mem-ranges [list {0x40000000 0xbfffffff}]
configparams force-mem-access 1
targets -set -nocase -filter {name =~"APU*" && jtag_cable_name =~ "Digilent Zybo 210279A42EEAA"} -index 0
stop
ps7_init
ps7_post_config
targets -set -nocase -filter {name =~ "ARM*#0" && jtag_cable_name =~ "Digilent Zybo 210279A42EEAA"} -index 0
rst -processor
targets -set -nocase -filter {name =~ "ARM*#0" && jtag_cable_name =~ "Digilent Zybo 210279A42EEAA"} -index 0
dow /home/bryan/Documents/PXL/Embedded_Operating_Systems/oefeningenbundel/oefening_10/oefening_10.sdk/freertos_hello_world/Debug/freertos_hello_world.elf
configparams force-mem-access 0
----------------End of Script----------------

21:18:00 INFO  : Disconnected from the channel tcfchan#1.
20:13:47 INFO  : Registering command handlers for SDK TCF services
20:13:48 INFO  : Launching XSCT server: xsct -n -interactive /home/bryan/Documents/PXL/Embedded_Operating_Systems/oefeningenbundel/oefening_10/oefening_10.sdk/temp_xsdb_launch_script.tcl
20:13:49 INFO  : XSCT server has started successfully.
20:13:49 INFO  : Successfully done setting XSCT server connection channel  
20:13:49 INFO  : Successfully done setting SDK workspace  
20:13:49 INFO  : Processing command line option -hwspec /home/bryan/Documents/PXL/Embedded_Operating_Systems/oefeningenbundel/oefening_10/oefening_10.sdk/block_design_wrapper.hdf.
20:13:49 INFO  : Checking for hwspec changes in the project block_design_wrapper_hw_platform_0.
20:19:00 INFO  : Registering command handlers for SDK TCF services
20:19:01 INFO  : Launching XSCT server: xsct -n -interactive /home/bryan/Documents/PXL/Embedded_Operating_Systems/oefeningenbundel/oefening_10/oefening_10.sdk/temp_xsdb_launch_script.tcl
20:19:02 INFO  : XSCT server has started successfully.
20:19:02 INFO  : Successfully done setting XSCT server connection channel  
20:19:02 INFO  : Successfully done setting SDK workspace  
20:19:02 INFO  : Processing command line option -hwspec /home/bryan/Documents/PXL/Embedded_Operating_Systems/oefeningenbundel/oefening_10/oefening_10.sdk/block_design_wrapper.hdf.
20:19:02 INFO  : Checking for hwspec changes in the project block_design_wrapper_hw_platform_0.
23:21:01 INFO  : Registering command handlers for SDK TCF services
23:21:02 INFO  : Launching XSCT server: xsct -n -interactive /home/bryan/Documents/PXL/Embedded_Operating_Systems/oefeningenbundel/oefening_10/oefening_10.sdk/temp_xsdb_launch_script.tcl
23:21:04 INFO  : XSCT server has started successfully.
23:21:05 INFO  : Successfully done setting XSCT server connection channel  
23:21:05 INFO  : Successfully done setting SDK workspace  
23:21:05 INFO  : Processing command line option -hwspec /home/bryan/Documents/PXL/Embedded_Operating_Systems/oefeningenbundel/oefening_10/oefening_10.sdk/block_design_wrapper.hdf.
23:21:05 INFO  : Checking for hwspec changes in the project block_design_wrapper_hw_platform_0.
