vhdl xil_defaultlib  \
"../../../bd/block_design/ipshared/4674/hdl/myip_vga_dobbelsteen_v1_0_S00_AXI.vhd" \
"../../../bd/block_design/ipshared/4674/src/PXL_VGA.vhd" \
"../../../bd/block_design/ipshared/4674/hdl/myip_vga_dobbelsteen_v1_0.vhd" \
"../../../bd/block_design/ip/block_design_myip_vga_dobbelsteen_0_0/sim/block_design_myip_vga_dobbelsteen_0_0.vhd" \
"../../../bd/block_design/ip/block_design_rst_ps7_0_100M_0/sim/block_design_rst_ps7_0_100M_0.vhd" \
"../../../bd/block_design/ip/block_design_axi_gpio_0_0/sim/block_design_axi_gpio_0_0.vhd" \
"../../../bd/block_design/sim/block_design.vhd" \

nosort
