{
    "grade_5": [
        {
            "year": "2022",
            "held": "1",
            "data": [
                {
                    "name": "2022\u5e74\u5ea6 \u7b2c3\u56de \u554f\u984c\u518a\u5b50",
                    "type": "\u89e3\u7b54",
                    "link": "https://www.eiken.or.jp/eiken/exam/grade_5/pdf/202203/2022-3-1ji-5kyu.pdf"
                },
                {
                    "name": "2022\u5e74\u5ea6 \u7b2c3\u56de \u30ea\u30b9\u30cb\u30f3\u30b0\u539f\u7a3f",
                    "type": "\u89e3\u7b54",
                    "link": "https://www.eiken.or.jp/eiken/exam/grade_5/pdf/202203/2022-3-1ji-5kyu-script.pdf"
                },
                {
                    "name": "\u30ea\u30b9\u30cb\u30f3\u30b0\u97f3\u6e90\uff08\u7b2c1\u90e8\uff09",
                    "type": "\u89e3\u7b54",
                    "link": "http://media.eiken.or.jp/listening/grade_5/202203/5Q-part1.mp3"
                },
                {
                    "name": "\u30ea\u30b9\u30cb\u30f3\u30b0\u97f3\u6e90\uff08\u7b2c2\u90e8\uff09",
                    "type": "\u89e3\u7b54",
                    "link": "http://media.eiken.or.jp/listening/grade_5/202203/5Q-part2.mp3"
                },
                {
                    "name": "\u30ea\u30b9\u30cb\u30f3\u30b0\u97f3\u6e90\uff08\u7b2c3\u90e8\uff09",
                    "type": "\u89e3\u7b54",
                    "link": "http://media.eiken.or.jp/listening/grade_5/202203/5Q-part3.mp3"
                },
                {
                    "name": "2022\u5e74\u5ea6 \u7b2c3\u56de \u89e3\u7b54",
                    "type": "\u89e3\u7b54",
                    "link": "https://www.eiken.or.jp/eiken/exam/grade_5/pdf/202203/5kyu-sun.pdf"
                },
                {
                    "name": "2022\u5e74\u5ea6 \u7b2c2\u56de \u554f\u984c\u518a\u5b50",
                    "type": "\u89e3\u7b54",
                    "link": "https://www.eiken.or.jp/eiken/exam/grade_5/pdf/202202/2022-2-1ji-5kyu.pdf"
                },
                {
                    "name": "2022\u5e74\u5ea6 \u7b2c2\u56de \u30ea\u30b9\u30cb\u30f3\u30b0\u539f\u7a3f",
                    "type": "\u89e3\u7b54",
                    "link": "https://www.eiken.or.jp/eiken/exam/grade_5/pdf/202202/2022-2-1ji-5kyu-script.pdf"
                },
                {
                    "name": "\u30ea\u30b9\u30cb\u30f3\u30b0\u97f3\u6e90\uff08\u7b2c1\u90e8\uff09",
                    "type": "\u89e3\u7b54",
                    "link": "http://media.eiken.or.jp/listening/grade_5/202202/5Q-part1.mp3"
                },
                {
                    "name": "\u30ea\u30b9\u30cb\u30f3\u30b0\u97f3\u6e90\uff08\u7b2c2\u90e8\uff09",
                    "type": "\u89e3\u7b54",
                    "link": "http://media.eiken.or.jp/listening/grade_5/202202/5Q-part2.mp3"
                },
                {
                    "name": "\u30ea\u30b9\u30cb\u30f3\u30b0\u97f3\u6e90\uff08\u7b2c3\u90e8\uff09",
                    "type": "\u89e3\u7b54",
                    "link": "http://media.eiken.or.jp/listening/grade_5/202202/5Q-part3.mp3"
                },
                {
                    "name": "2022\u5e74\u5ea6 \u7b2c2\u56de \u89e3\u7b54",
                    "type": "\u89e3\u7b54",
                    "link": "https://www.eiken.or.jp/eiken/exam/grade_5/pdf/202202/5kyu-sun.pdf"
                },
                {
                    "name": "2022\u5e74\u5ea6 \u7b2c1\u56de \u554f\u984c\u518a\u5b50",
                    "type": "\u89e3\u7b54",
                    "link": "https://www.eiken.or.jp/eiken/exam/grade_5/pdf/202201/2022-1-1ji-5kyu.pdf"
                },
                {
                    "name": "2022\u5e74\u5ea6 \u7b2c1\u56de \u30ea\u30b9\u30cb\u30f3\u30b0\u539f\u7a3f",
                    "type": "\u89e3\u7b54",
                    "link": "https://www.eiken.or.jp/eiken/exam/grade_5/pdf/202201/2022-1-1ji-5kyu-script.pdf"
                },
                {
                    "name": "\u30ea\u30b9\u30cb\u30f3\u30b0\u97f3\u6e90\uff08\u7b2c1\u90e8\uff09",
                    "type": "\u89e3\u7b54",
                    "link": "http://media.eiken.or.jp/listening/grade_5/202201/5Q-part1.mp3"
                },
                {
                    "name": "\u30ea\u30b9\u30cb\u30f3\u30b0\u97f3\u6e90\uff08\u7b2c2\u90e8\uff09",
                    "type": "\u89e3\u7b54",
                    "link": "http://media.eiken.or.jp/listening/grade_5/202201/5Q-part2.mp3"
                },
                {
                    "name": "\u30ea\u30b9\u30cb\u30f3\u30b0\u97f3\u6e90\uff08\u7b2c3\u90e8\uff09",
                    "type": "\u89e3\u7b54",
                    "link": "http://media.eiken.or.jp/listening/grade_5/202201/5Q-part3.mp3"
                },
                {
                    "name": "2022\u5e74\u5ea6 \u7b2c1\u56de \u89e3\u7b54",
                    "type": "\u89e3\u7b54",
                    "link": "https://www.eiken.or.jp/eiken/exam/grade_5/pdf/202201/5kyu-sun.pdf"
                }
            ]
        }
    ]
}