[
  "Flake8ReportEntryImpl(line=5, column=5, text='PGN014 Move function def [x] here')",
  "Flake8ReportEntryImpl(line=9, column=5, text='PGN014 Move function def [y] here')",
  "Flake8ReportEntryImpl(line=12, column=5, text='PGN014 Move function def [z] here')",
  "Flake8ReportEntryImpl(line=15, column=5, text='PGN014 Move function def [_x] here')",
  "Flake8ReportEntryImpl(line=18, column=5, text='PGN014 Move function def [_y] here')",
  "Flake8ReportEntryImpl(line=21, column=5, text='PGN014 Move function def [_z] here')",
  "Flake8ReportEntryImpl(line=24, column=5, text='PGN014 Move function def [__init__] here')",
  "Flake8ReportEntryImpl(line=27, column=5, text='PGN014 Move function def [__eq__] here')",
  "Flake8ReportEntryImpl(line=30, column=5, text='PGN014 Move function def [__str__] here')",
  "Flake8ReportEntryImpl(line=33, column=5, text='PGN014 Move function def [a] here')",
  "Flake8ReportEntryImpl(line=37, column=5, text='PGN014 Move function def [b] here')",
  "Flake8ReportEntryImpl(line=41, column=5, text='PGN014 Move function def [c] here')",
  "Flake8ReportEntryImpl(line=45, column=5, text='PGN014 Move function def [_a] here')",
  "Flake8ReportEntryImpl(line=49, column=5, text='PGN014 Move function def [_b] here')",
  "Flake8ReportEntryImpl(line=53, column=5, text='PGN014 Move function def [_c] here')"
]
