[
  "Flake8ReportEntryImpl(line=11, column=9, text='PGN013 Invalid indent')",
  "Flake8ReportEntryImpl(line=15, column=9, text='PGN013 Invalid indent')",
  "Flake8ReportEntryImpl(line=20, column=5, text='PGN013 Invalid indent')",
  "Flake8ReportEntryImpl(line=23, column=9, text='PGN013 Invalid indent')",
  "Flake8ReportEntryImpl(line=27, column=9, text='PGN013 Invalid indent')",
  "Flake8ReportEntryImpl(line=35, column=9, text='PGN013 Invalid indent')",
  "Flake8ReportEntryImpl(line=41, column=9, text='PGN013 Invalid indent')"
]
