[
  "Flake8ReportEntryImpl(line=13, column=12, text='PGN007 Move element to new line')",
  "Flake8ReportEntryImpl(line=17, column=12, text='PGN007 Move element to new line')",
  "Flake8ReportEntryImpl(line=22, column=13, text='PGN007 Move element to new line')",
  "Flake8ReportEntryImpl(line=25, column=12, text='PGN007 Move element to new line')",
  "Flake8ReportEntryImpl(line=28, column=10, text='PGN007 Move element to new line')",
  "Flake8ReportEntryImpl(line=35, column=12, text='PGN007 Move element to new line')"
]
