<?xml version="1.0" encoding="UTF-8"?>
<svg width="28px" height="29px" viewBox="0 0 28 29" version="1.1" xmlns="http://www.w3.org/2000/svg" xmlns:xlink="http://www.w3.org/1999/xlink">
    <title>子组-默认</title>
    <g id="iPad" stroke="none" stroke-width="1" fill="none" fill-rule="evenodd">
        <g id="iPad--Starred-有数据" transform="translate(-17.000000, -486.000000)">
            <g id="项目备份-11" transform="translate(17.000000, 486.000000)">
                <rect id="矩形" fill="#000000" fill-rule="nonzero" opacity="0" x="0" y="0" width="28" height="28.0086984"></rect>
                <g id="编组-4" transform="translate(2.000000, 2.000000)">
                    <rect id="矩形" fill-opacity="0.16" fill="#787880" x="0" y="0" width="24.4913043" height="24.4989126" rx="12"></rect>
                    <path d="M12.25,11 C13.7856408,11 15.1510796,11.7287213 16.0193741,12.8592215 C16.2504664,12.7879383 16.4958027,12.75 16.75,12.75 C18.1307119,12.75 19.25,13.8692881 19.25,15.25 C19.25,16.6307119 18.1307119,17.75 16.75,17.75 C15.3692881,17.75 14.25,16.6307119 14.25,15.25 C14.25,14.6698728 14.4475979,14.135897 14.7791611,13.7117053 C14.1855333,12.9726169 13.2729595,12.5 12.25,12.5 C11.2270405,12.5 10.3144667,12.9726169 9.71872041,13.7114088 C10.0524021,14.135897 10.25,14.6698728 10.25,15.25 C10.25,16.6307119 9.13071187,17.75 7.75,17.75 C6.36928813,17.75 5.25,16.6307119 5.25,15.25 C5.25,13.8692881 6.36928813,12.75 7.75,12.75 C8.00419729,12.75 8.24953361,12.7879383 8.48065567,12.8584615 C9.34892038,11.7287213 10.7143592,11 12.25,11 Z M7.75,14.25 C7.19771525,14.25 6.75,14.6977153 6.75,15.25 C6.75,15.8022847 7.19771525,16.25 7.75,16.25 C8.30228475,16.25 8.75,15.8022847 8.75,15.25 C8.75,14.6977153 8.30228475,14.25 7.75,14.25 Z M16.75,14.25 C16.1977153,14.25 15.75,14.6977153 15.75,15.25 C15.75,15.8022847 16.1977153,16.25 16.75,16.25 C17.3022847,16.25 17.75,15.8022847 17.75,15.25 C17.75,14.6977153 17.3022847,14.25 16.75,14.25 Z M12.25,4.75 C13.6307119,4.75 14.75,5.86928813 14.75,7.25 C14.75,8.63071187 13.6307119,9.75 12.25,9.75 C10.8692881,9.75 9.75,8.63071187 9.75,7.25 C9.75,5.86928813 10.8692881,4.75 12.25,4.75 Z M12.25,6.25 C11.6977153,6.25 11.25,6.69771525 11.25,7.25 C11.25,7.80228475 11.6977153,8.25 12.25,8.25 C12.8022847,8.25 13.25,7.80228475 13.25,7.25 C13.25,6.69771525 12.8022847,6.25 12.25,6.25 Z" id="形状" fill="#87878C" fill-rule="nonzero"></path>
                </g>
            </g>
        </g>
    </g>
</svg>