<svg xmlns="http://www.w3.org/2000/svg" viewBox="0 0 18 18" class="design-iconfont">
  <g stroke="#66696D" stroke-width="1.5" fill="none" fill-rule="evenodd">
    <path d="M2,0 L12,0 C13.1045695,-2.02906125e-16 14,0.8954305 14,2 L14,13 C14,14.1045695 13.1045695,15 12,15 L2,15 C0.8954305,15 1.3527075e-16,14.1045695 0,13 L0,2 C-1.3527075e-16,0.8954305 0.8954305,-2.41183085e-16 2,0 Z" transform="translate(2 1.5)"/>
    <path stroke-linecap="round" stroke-linejoin="round" d="M5 11L9 11" transform="translate(2 1.5)"/>
  </g>
</svg>
