<?xml version="1.0" encoding="UTF-8"?>
<svg width="18px" height="18px" viewBox="0 0 18 18" version="1.1"
    xmlns="http://www.w3.org/2000/svg">
    <title>编组</title>
    <g id="MR页面" stroke="none" stroke-width="1" fill="none" fill-rule="evenodd">
        <g id="MR-MWPS2" transform="translate(-16.000000, -633.000000)" stroke="#0063E9">
            <g id="branches备份-2"
                transform="translate(25.000000, 642.000000) scale(1, -1) translate(-25.000000, -642.000000) translate(15.000000, 632.000000)">
                <g id="编组" transform="translate(0.995562, 1.000000)">
                    <circle id="椭圆形" stroke-width="1.5" cx="9" cy="9" r="8.25"></circle>
                    <circle id="椭圆形备份-10" stroke-width="1.5" cx="9.00591716" cy="9.02380952"
                        r="5.25"></circle>
                    <path d="M8.50443787,11 L8.50443787,8.5 L11.0044379,8.5" id="路径-3"
                        stroke-width="1.65"></path>
                </g>
            </g>
        </g>
    </g>
</svg>