<?xml version="1.0" encoding="UTF-8"?>
<svg width="16px" height="16px" viewBox="0 0 16 16" version="1.1" xmlns="http://www.w3.org/2000/svg"
    xmlns:xlink="http://www.w3.org/1999/xlink">
    <title>avatar</title>
    <g id="议题页面" stroke="none" stroke-width="1" fill="none" fill-rule="evenodd">
        <g id="项目议题列表-自定义字段icon" transform="translate(-23.000000, -361.000000)" fill="#ACACAC"
            fill-rule="nonzero" stroke="#ACACAC" stroke-width="0.4">
            <g id="目录树备份-6" transform="translate(23.000000, 361.000000)">
                <path
                    d="M8,0.666666672 C3.86579546,0.666666672 0.5,4.03246213 0.5,8.16666667 C0.5,12.3008712 3.86579546,15.6666667 8,15.6666667 C12.1342045,15.6666667 15.5,12.3008712 15.5,8.16666667 C15.5,4.03246213 12.1342045,0.666666672 8,0.666666672 Z M8,9.41882576 C10.1504546,9.41882576 11.8931818,11.161553 11.8795455,13.3392803 C10.78625,14.1683712 9.4140909,14.6323485 8,14.6323485 C6.58590908,14.6323485 5.21375,14.1687121 4.10681817,13.3120076 C4.10681817,11.161553 5.84954545,9.41882576 8,9.41882576 Z M7.92636364,1.70098485 C11.4871591,1.70098485 14.4656818,4.63314394 14.4656818,8.16666667 C14.4656818,9.69530304 13.9417046,11.1032576 12.9752273,12.2637121 L12.8770455,12.3785985 L12.8177273,12.3629167 C12.5000986,10.7725734 11.4223866,9.43928864 9.93397727,8.79530304 L9.82488636,8.74962122 L9.81431818,8.69303031 C10.3754546,8.16939395 10.6856818,7.4739394 10.6856818,6.69666668 C10.6856818,5.20859849 9.45125,3.97416667 7.96318182,3.97416667 C6.47511364,3.97416667 5.24102272,5.20859849 5.24102272,6.69666668 C5.24102272,7.43848485 5.52363635,8.10598486 6.03738636,8.62041668 L6.11238636,8.69303031 L6.10181818,8.74962122 C4.59855943,9.3577001 3.48927548,10.6645836 3.13352273,12.2466667 L3.10863635,12.3629167 L3.04931817,12.3782576 C2.02999999,11.1629167 1.46068181,9.71234849 1.46068181,8.16666667 C1.46068181,4.61984849 4.37954545,1.70098485 7.92636364,1.70098485 L7.92636364,1.70098485 Z M8,5.00882576 C8.93750001,5.00882576 9.6878409,5.75882575 9.6878409,6.69632576 C9.6878409,7.63416667 8.93784091,8.38450758 8,8.38450758 C7.06249999,8.38450758 6.3121591,7.63450759 6.3121591,6.69666668 C6.3121591,5.75916667 7.06215909,5.00882576 8,5.00882576 L8,5.00882576 Z"
                    id="形状"></path>
            </g>
        </g>
    </g>
</svg>