<svg xmlns="http://www.w3.org/2000/svg" viewBox="0 0 18 18" class="design-iconfont">
    <path d="M10.5701203,7.01250789 C10.8799295,7.0145529 11.1305753,7.26519874 11.1326203,7.57500789 C11.1305753,7.88481704 10.8799295,8.13546288 10.5701203,8.13750789 L8.69512033,8.13750789 C6.72770364,8.13764609 5.13287057,9.73259119 5.13287057,11.7000079 C5.13287057,13.6674246 6.72770364,15.2623697 8.69512033,15.2625079 L12.4451203,15.2625079 C13.8246087,15.2643673 15.0808509,14.4686634 15.6686975,13.2206939 C16.2565442,11.9727244 16.0700405,10.4974259 15.1901203,9.43500788 C14.9934741,9.19409809 15.0268898,8.83989156 15.2651203,8.64000788 C15.3801773,8.54378204 15.5289383,8.4975656 15.678267,8.51165321 C15.8275957,8.52574082 15.965089,8.59896239 16.0601203,8.71500788 C17.2213551,10.1132257 17.4683483,12.0572032 16.693668,13.7013898 C15.9189877,15.3455765 14.2626603,16.3927793 12.4451203,16.3875277 L8.69512033,16.3875277 C6.10639767,16.3873494 4.00790738,14.2887306 4.00790738,11.7000079 C4.00790738,9.11128522 6.10639767,7.01266642 8.69512033,7.01250789 L10.5701203,7.01250789 Z M9.43762033,1.70000394 C12.026455,1.69793689 14.1267991,3.79492318 14.1288717,6.38375789 C14.1309413,8.97259261 12.033955,11.0729368 9.44512032,11.0750079 L7.57012033,11.0750079 C7.25946016,11.0750079 7.00762033,10.8231681 7.00762033,10.5125079 C7.00762033,10.2018477 7.25946016,9.95000788 7.57012033,9.95000788 L9.44512032,9.95000788 C11.412537,9.94986969 13.0073701,8.35492459 13.0073701,6.38750789 C13.0073701,4.42009119 11.412537,2.82514609 9.44512032,2.82500789 L5.69512033,2.82500789 C4.31563198,2.82314849 3.05938976,3.6188524 2.47154311,4.86682191 C1.88369647,6.11479142 2.07020012,7.5900899 2.95012033,8.65250789 C3.14169799,8.89326268 3.105306,9.24307025 2.86827372,9.4392349 C2.63124144,9.63539954 2.28079965,9.60573028 2.08012033,9.37250789 C0.91976183,7.97533276 0.672205532,6.03310483 1.44499033,4.38953133 C2.21777513,2.74595783 3.87143623,1.69765518 5.68762032,1.70000394 L9.43762033,1.70000394 Z"
          stroke="#66696D" stroke-width=".4" fill="#66696D" fill-rule="nonzero"/>
</svg>
