<svg xmlns="http://www.w3.org/2000/svg" viewBox="0 0 18 18" class="design-iconfont">
  <g fill="none" fill-rule="evenodd">
    <path stroke-opacity=".5" stroke="#E24329" stroke-width="2" fill="#E24329"
        d="M7 -1A8 8 0 1 0 7 15A8 8 0 1 0 7 -1Z" transform="translate(2 2)" />
    <path
        d="M10,6 C10.5522847,6 11,6.44771525 11,7 C11,7.51283584 10.6139598,7.93550716 10.1166211,7.99327227 L10,8 L4,8 C3.44771525,8 3,7.55228475 3,7 C3,6.48716416 3.38604019,6.06449284 3.88337887,6.00672773 L4,6 L10,6 Z"
        fill="#FFF" fill-rule="nonzero" transform="translate(2 2)" />
  </g>
</svg>
