<?xml version="1.0" encoding="UTF-8"?>
<svg width="16px" height="16px" viewBox="0 0 16 16" version="1.1" xmlns="http://www.w3.org/2000/svg">
    <title>Create release</title>
    <g id="Projects" stroke="none" stroke-width="1" fill="none" fill-rule="evenodd">
        <g id="release-no-data-create" transform="translate(-234.000000, -134.000000)" fill="#66696D">
            <g id="rocket" transform="translate(234.000000, 134.000000)">
                <path d="M14.9764148,1.70144132 L15,1 L14.2985587,1.0235852 L13.1551132,1.06376739 C10.3490441,1.16041676 7.73344429,2.5076333 6.02539465,4.73607038 L4.20321957,4.73607038 C3.04359955,4.73602821 2.04948522,5.56439557 1.84033194,6.70499782 L1.1415112,10.5135708 L1,11.2875148 L3.34978474,11.2875148 L4.71248518,12.6502153 L4.71248518,15 L5.48555562,14.8584888 L9.29412866,14.1596681 C10.4350782,13.950887 11.2638945,12.956675 11.2639296,11.7967804 L11.2639296,9.97460535 C13.4923667,8.26655571 14.8395832,5.65095594 14.9362326,2.84488675 L14.9764148,1.70056779 L14.9764148,1.70144132 Z M9.16572035,9.74836214 L5.49691146,11.5827666 L4.41810694,10.5030885 L6.25251139,6.83427965 C7.57654281,4.18683261 10.2422246,2.47528661 13.2005366,2.37318275 L13.6425407,2.35745929 L13.6268172,2.79946341 C13.5250285,5.758093 11.813436,8.42418237 9.16572035,9.74836214 L9.16572035,9.74836214 Z M6.02277407,13.4276533 L6.02277407,12.7847383 L9.75098272,10.9197604 L9.95364079,10.8184314 L9.95364079,11.7967804 C9.95381655,12.3241549 9.57703736,12.7762899 9.05827666,12.8712173 L6.02277407,13.4276533 Z M3.21526175,9.97722593 L5.0802396,6.24901728 L5.18069508,6.04635927 L4.20234604,6.04635927 C3.67530092,6.0466052 3.22365075,6.42328659 3.12878268,6.94172334 L2.57234667,9.97722593 L3.21526175,9.97722593 Z M10.1720222,6.26474075 C10.1720222,6.50595827 9.97647677,6.70150371 9.73525925,6.70150371 C9.49404173,6.70150371 9.29849629,6.50595827 9.29849629,6.26474075 C9.29849629,6.02352323 9.49404173,5.82797779 9.73525925,5.82797779 C9.97647677,5.82797779 10.1720222,6.02352323 10.1720222,6.26474075 Z M11.4823111,6.26474075 C11.4823111,7.22961084 10.7001293,8.0117926 9.73525925,8.0117926 C8.77038916,8.0117926 7.9882074,7.22961084 7.9882074,6.26474075 C7.9882074,5.29987066 8.77038916,4.5176889 9.73525925,4.5176889 C10.7001293,4.5176889 11.4823111,5.29987066 11.4823111,6.26474075 L11.4823111,6.26474075 Z" id="形状"></path>
            </g>
        </g>
    </g>
</svg>