<svg xmlns="http://www.w3.org/2000/svg" viewBox="0 0 18 18" class="design-iconfont">
  <g transform="translate(1 1)" fill="none" fill-rule="evenodd">
    <rect stroke="#87878C" stroke-width="1.5" x=".75" y=".75" width="10.5" height="11.5" rx="2" />
    <g transform="translate(4 3)">
      <rect stroke="#87878C" stroke-width="1.5" fill="#F8F8FA" x=".75" y=".75" width="10.5"
          height="11.5" rx="2" />
      <path
          d="M8,4.25 C8.41421356,4.25 8.75,4.58578644 8.75,5 C8.75,5.37969577 8.46784612,5.69349096 8.10177056,5.74315338 L8,5.75 L4,5.75 C3.58578644,5.75 3.25,5.41421356 3.25,5 C3.25,4.62030423 3.53215388,4.30650904 3.89822944,4.25684662 L4,4.25 L8,4.25 Z M8,7.25 C8.41421356,7.25 8.75,7.58578644 8.75,8 C8.75,8.37969577 8.46784612,8.69349096 8.10177056,8.74315338 L8,8.75 L4,8.75 C3.58578644,8.75 3.25,8.41421356 3.25,8 C3.25,7.62030423 3.53215388,7.30650904 3.89822944,7.25684662 L4,7.25 L8,7.25 Z"
          fill="#87878C" fill-rule="nonzero" />
    </g>
  </g>
</svg>
