<?xml version="1.0" encoding="UTF-8"?>
<svg width="16px" height="13px" viewBox="0 0 16 13" version="1.1" xmlns="http://www.w3.org/2000/svg">
    <title>iteration</title>
    <g id="icon" stroke="none" stroke-width="1" fill="none" fill-rule="evenodd">
        <g id="第一批" transform="translate(-222.000000, -25.000000)" fill="#000000">
            <g id="iteration" transform="translate(222.000000, 25.000000)">
                <path d="M3.39136889,1.84159707 C4.640342,1.2298952 6.13665529,1.44694525 7.16034564,2.38831184 C8.18403598,3.32967844 8.5254784,4.80259435 8.02038513,6.09835427 C7.51529186,7.39411419 6.26709278,8.24738042 4.87636889,8.24759707 L4.87436889,8.24759707 C4.8543692,8.24775231 4.83436859,8.24775231 4.81436889,8.24759707 L0.750368895,8.24759707 C0.336155332,8.24759707 0.000368894537,8.58338351 0.000368894537,8.99759707 C0.000368894537,9.41181063 0.336155332,9.74759707 0.750368895,9.74759707 L13.1293689,9.74759707 L12.1593689,10.7175971 C11.9644923,10.9059953 11.8864333,11.1848837 11.9551938,11.4470721 C12.0239543,11.7092606 12.2288335,11.9139467 12.4910867,11.9824599 C12.7533398,12.0509732 13.0321545,11.9726512 13.2203689,11.7775971 L15.4703689,9.52759707 L16.0003689,8.99759707 L15.4703689,8.46759707 L13.2203689,6.21759707 C13.0333983,6.01694389 12.7518134,5.93434789 12.48608,6.00221153 C12.2203466,6.07007517 12.012847,6.2775748 11.9449834,6.54330816 C11.8771197,6.80904153 11.9597157,7.09062649 12.1603689,7.27759707 L13.1303689,8.24759707 L8.39236889,8.24759707 C9.9464738,6.6266379 10.191946,4.15365074 8.98682458,2.25880691 C7.78170319,0.363963084 5.43793009,-0.462263116 3.31094987,0.257949241 C1.18396965,0.978161597 -0.175655628,3.05838783 0.0183688945,5.29559707 C0.0542674033,5.70842992 0.418036044,6.01399558 0.830868895,5.97809707 C1.24370175,5.94219856 1.5492674,5.57842992 1.51336889,5.16559707 C1.3921386,3.77620364 2.13800191,2.45534607 3.39036889,1.84159707 L3.39136889,1.84159707 Z" id="路径"></path>
            </g>
        </g>
    </g>
</svg>