<?xml version="1.0" encoding="UTF-8"?>
<svg width="16px" height="16px" viewBox="0 0 16 16" version="1.1" xmlns="http://www.w3.org/2000/svg">
    <title>仓库文件</title>
    <g id="Projects" stroke="none" stroke-width="1" fill="none" fill-rule="evenodd">
        <g id="查看代码仓库文件列表" transform="translate(-27.000000, -194.000000)" stroke="#66696D" stroke-width="1.5">
            <g id="文件夹备份-2" transform="translate(27.000000, 194.000000)">
                <g id="编组-2" transform="translate(1.000000, 1.500000)">
                    <path d="M0,1 L0,12 C6.76353751e-17,12.5522847 0.44771525,13 1,13 L13,13 C13.5522847,13 14,12.5522847 14,12 L14,3.18656544 C14,2.63428069 13.5522847,2.18656544 13,2.18656544 L6.82788701,2.18656544 C6.5059745,2.18656544 6.20374614,2.03159552 6.01586801,1.77019644 L5.04281731,0.416369001 C4.85493919,0.154969922 4.55271082,1.62910235e-16 4.23079831,0 L1,0 C0.44771525,1.01453063e-16 -6.76353751e-17,0.44771525 0,1 Z" id="路径-2"></path>
                    <line x1="-9.44912608e-16" y1="5.5" x2="13.6176258" y2="5.5" id="路径-3"></line>
                </g>
            </g>
        </g>
    </g>
</svg>