<?xml version="1.0" encoding="UTF-8"?>
<svg width="28px" height="28px" viewBox="0 0 28 28" version="1.1" xmlns="http://www.w3.org/2000/svg">
    <title>no data</title>
    <g id="Projects" stroke="none" stroke-width="1" fill="none" fill-rule="evenodd">
        <g id="release-no-data" transform="translate(-174.000000, -223.000000)">
            <g id="pod" transform="translate(174.000000, 223.000000)">
                <rect id="矩形" x="0" y="0" width="28" height="28"></rect>
                <path d="M12.1577143,0.479053973 C13.2993431,-0.159684658 14.7006569,-0.159684658 15.8422857,0.479053973 L15.8422857,0.479053973 L25.1279999,5.6760596 C26.2857735,6.32383109 27,7.52974621 27,8.83573715 L27,8.83573715 L27,19.1642629 C27,20.4702538 26.2857735,21.6761689 25.1279999,22.3239404 L25.1279999,22.3239404 L15.8422857,27.520946 C14.7006569,28.1596847 13.2993431,28.1596847 12.1577143,27.520946 L12.1577143,27.520946 L2.87200005,22.3239404 C1.71422655,21.6761689 1,20.4702538 1,19.1642629 L1,19.1642629 L1,8.83573715 C1,7.52974621 1.71422655,6.32383109 2.87200005,5.6760596 L2.87200005,5.6760596 Z M24.214287,9.85440118 L15.3928571,14.7912837 L15.3928571,24.6304868 L23.7462857,19.9555465 C24.036162,19.793362 24.2148454,19.4912482 24.214287,19.1642629 L24.214287,9.85440118 Z M3.78571302,9.85258214 L3.78571302,19.1624438 C3.7851546,19.4894291 3.96383804,19.791543 4.25371433,19.9537275 L4.25371433,19.9537275 L12.6071429,24.6286678 L12.6071429,14.7894646 L3.78571302,9.85258214 Z M14.4605714,2.84744786 C14.1751642,2.6877632 13.8248358,2.6877632 13.5394286,2.84744786 L13.5394286,2.84744786 L5.21200004,7.50965486 L14,12.4283469 L22.7898571,7.50965486 L14.4605714,2.8492669 Z" id="形状结合" fill="#FC6D26"></path>
            </g>
        </g>
    </g>
</svg>