<?xml version="1.0" encoding="UTF-8"?>
<svg width="20px" height="20px" viewBox="0 0 20 20" version="1.1" xmlns="http://www.w3.org/2000/svg"
    xmlns:xlink="http://www.w3.org/1999/xlink">
    <title>pipeline ☑️</title>
    <g id="MR页面" stroke="none" stroke-width="1" fill="none" fill-rule="evenodd">
        <g id="mr概览-pipeline1" transform="translate(-63.000000, -335.000000)" fill="#13AB06"
            fill-rule="nonzero">
            <g id="编组" transform="translate(63.000000, 335.000000)">
                <path
                    d="M10,2 C14.418278,2 18,5.581722 18,10 C18,14.418278 14.418278,18 10,18 C5.581722,18 2,14.418278 2,10 C2,5.581722 5.581722,2 10,2 Z M10,3 C6.13400675,3 3,6.13400675 3,10 C3,13.8659932 6.13400675,17 10,17 C13.8659932,17 17,13.8659932 17,10 C17,6.13400675 13.8659932,3 10,3 Z M13.7071068,7.54289322 C14.0675907,7.90337718 14.0953203,8.47060824 13.7902954,8.86289944 L13.7071068,8.95710678 L9.70710678,12.9571068 C9.34662282,13.3175907 8.77939176,13.3453203 8.38710056,13.0402954 L8.29289322,12.9571068 L6.29289322,10.9571068 C5.90236893,10.5665825 5.90236893,9.93341751 6.29289322,9.54289322 C6.65337718,9.18240926 7.22060824,9.15467972 7.61289944,9.45970461 L7.70710678,9.54289322 L9,10.835 L12.2928932,7.54289322 C12.6834175,7.15236893 13.3165825,7.15236893 13.7071068,7.54289322 Z"
                    id="形状结合"></path>
            </g>
        </g>
    </g>
</svg>