<?xml version="1.0" encoding="UTF-8"?>
<svg width="16px" height="16px" viewBox="0 0 16 16" version="1.1" xmlns="http://www.w3.org/2000/svg">
    <title>commit</title>
    <g id="Projects" stroke="none" stroke-width="1" fill="none" fill-rule="evenodd">
        <g id="release" transform="translate(-29.000000, -584.000000)" fill="#66696D">
            <g id="commit" transform="translate(29.000000, 583.820000)">
                <path d="M8,4.18 C9.92033448,4.18 11.569835,5.54434238 11.93,7.43059944 L11.93,7.43059944 L15.25,7.43059944 C15.6642136,7.43059944 16,7.76638588 16,8.18059944 C16,8.594813 15.6642136,8.93059944 15.25,8.93059944 L15.25,8.93059944 L11.93,8.93059944 C11.579,10.7805994 9.953,12.1805994 8,12.1805994 C6.07985219,12.1805994 4.43041765,10.8166182 4.07,8.93059944 L4.07,8.93059944 L0.75,8.93059944 C0.335786438,8.93059944 0,8.594813 0,8.18059944 C0,7.76638588 0.335786438,7.43059944 0.75,7.43059944 L0.75,7.43059944 L4.07,7.43059944 C4.43016498,5.54434238 6.07966552,4.18 8,4.18 Z M8,5.68059944 C6.61928813,5.68059944 5.5,6.79988757 5.5,8.18059944 C5.5,9.56131131 6.61928813,10.6805994 8,10.6805994 C9.38071187,10.6805994 10.5,9.56131131 10.5,8.18059944 C10.5,6.79988757 9.38071187,5.68059944 8,5.68059944 Z" id="形状结合"></path>
            </g>
        </g>
    </g>
</svg>