<?xml version="1.0" encoding="UTF-8"?>
<svg width="20px" height="20px" viewBox="0 0 20 20" version="1.1" xmlns="http://www.w3.org/2000/svg"
    xmlns:xlink="http://www.w3.org/1999/xlink">
    <title>pipeline !</title>
    <g id="MR页面" stroke="none" stroke-width="1" fill="none" fill-rule="evenodd">
        <g id="mr概览-pipeline1" transform="translate(-15.000000, -215.000000)" fill="#FC6D26"
            fill-rule="nonzero">
            <g id="编组-2" transform="translate(15.000000, 215.000000)">
                <path
                    d="M10,2 C14.418278,2 18,5.581722 18,10 C18,14.418278 14.418278,18 10,18 C5.581722,18 2,14.418278 2,10 C2,5.581722 5.581722,2 10,2 Z M10,3 C6.13400675,3 3,6.13400675 3,10 C3,13.8659932 6.13400675,17 10,17 C13.8659932,17 17,13.8659932 17,10 C17,6.13400675 13.8659932,3 10,3 Z M10,12.4167683 C10.5128358,12.4167683 10.9355072,12.8028085 10.9932723,13.3001471 L11,13.4167683 C11,13.969053 10.5522847,14.4167683 10,14.4167683 C9.48716416,14.4167683 9.06449284,14.0307281 9.00672773,13.5333894 L9,13.4167683 C9,12.8644835 9.44771525,12.4167683 10,12.4167683 Z M10,5.58323174 C10.5128358,5.58323174 10.9355072,5.96927193 10.9932723,6.46661061 L11,6.58323174 L11,10.4167683 C11,10.969053 10.5522847,11.4167683 10,11.4167683 C9.48716416,11.4167683 9.06449284,11.0307281 9.00672773,10.5333894 L9,10.4167683 L9,6.58323174 C9,6.03094699 9.44771525,5.58323174 10,5.58323174 Z"
                    id="形状结合"></path>
            </g>
        </g>
    </g>
</svg>
