<?xml version="1.0" encoding="UTF-8"?>
<svg width="16px" height="15px" viewBox="0 0 16 15" version="1.1" xmlns="http://www.w3.org/2000/svg">
    <title>thumb-down</title>
    <g id="icon" stroke="none" stroke-width="1" fill="none" fill-rule="evenodd">
        <g id="第一批" transform="translate(-13.000000, -128.000000)" fill="#000000">
            <g id="thumb-down" transform="translate(13.000000, 128.000000)">
                <path d="M14.6729753,2.77005804 L14.731,2.96687783 L15.921,7.41487783 C16.081699,8.01540783 15.9540109,8.65651857 15.5754899,9.14965378 C15.23138,9.59795851 14.7155439,9.8776241 14.1575375,9.92477266 L13.989,9.93187783 L10,9.93187783 L10.45,11.4318778 L10.72,12.3338778 C11.304093,14.2775988 8.9726728,15.7233164 7.4941103,14.4196995 L7.39,14.3218778 L3,9.93187783 L0,9.93187783 L0,1.93187783 L3,1.93187783 L9.852,0.131877831 C11.9148308,-0.40926493 14.0256531,0.762885073 14.6729753,2.77005804 Z M10.232,1.58287783 L10.232,1.58187783 L4.5,3.08887783 L4.5,9.31087783 L8.451,13.2618778 C8.571,13.3808778 8.671,13.4108778 8.747,13.4168778 C8.85743261,13.4234437 8.96717191,13.3954847 9.061,13.3368778 C9.15726059,13.2823045 9.23414971,13.1991245 9.281,13.0988778 C9.3232364,12.9917399 9.32430511,12.8727571 9.284,12.7648778 L8.564,10.3628778 L7.984,8.43187783 L13.989,8.43187783 C14.1445867,8.43193873 14.291335,8.35956824 14.3859989,8.23609364 C14.4806627,8.11261904 14.5124526,7.9521137 14.472,7.80187783 L13.282,3.35487783 C12.926366,2.02540022 11.5630999,1.23336494 10.232,1.58287783 Z M3,3.43187783 L1.5,3.43187783 L1.5,8.43187783 L3,8.43187783 L3,3.43187783 Z" id="形状结合"></path>
            </g>
        </g>
    </g>
</svg>