<svg xmlns="http://www.w3.org/2000/svg" viewBox="0 0 16 16" class="design-iconfont">
  <g fill="none" fill-rule="evenodd">
    <path d="M10.8888889,1.381 L14.2314292,2.09721103 C14.7714546,2.21293075 15.1154223,2.74451717 14.9997026,3.28454253 C14.9913745,3.3234067 14.9807368,3.36173978 14.9678461,3.39933777 L11.5649936,13.3243243 C11.4264141,13.7285145 11.0463344,14 10.6190476,14 L9.88888889,14 C10.4411736,14 10.8888889,13.5522847 10.8888889,13 L10.8888889,13 L10.8888889,10.67 L13.365,3.445 L10.8888889,2.914 L10.8888889,1.381 Z" fill="#66696D"
        transform="translate(.5 1)"/>
    <path d="M9.88888889,0 C10.4411736,0 10.8888889,0.44771525 10.8888889,1 L10.8888889,13 C10.8888889,13.5522847 10.4411736,14 9.88888889,14 L1,14 C0.44771525,14 0,13.5522847 0,13 L0,1 C0,0.44771525 0.44771525,0 1,0 L9.88888889,0 Z M9.388,1.5 L1.5,1.5 L1.5,12.5 L9.388,12.5 L9.388,1.5 Z" fill="#66696D"
        transform="translate(.5 1)"/>
    <path stroke="#66696D" stroke-width="1.5" stroke-linecap="round" stroke-linejoin="round" d="M3 7.73976769L4.8806419 9.3 7.75318577 5" transform="translate(.5 1)"/>
  </g>
</svg>
