<?xml version="1.0" encoding="UTF-8"?>
<svg width="14px" height="14px" viewBox="0 0 14 14" version="1.1" xmlns="http://www.w3.org/2000/svg">
    <title>file-tree</title>
    <g id="icon" stroke="none" stroke-width="1" fill="none" fill-rule="evenodd">
        <g id="第一批" transform="translate(-274.000000, -61.000000)" fill="#000000">
            <g id="file-tree" transform="translate(274.000000, 61.000000)">
                <path d="M0.75,0 C1.16421356,0 1.5,0.335786431 1.5,0.749999989 L1.5,0.749999989 L1.5,3.24999999 C1.5,4.07842711 2.17157288,4.74999999 3,4.74999999 L3,4.74999999 L6,4.74999999 L6,4 C6,3.44771524 6.44771525,3 7,3 L7,3 L13,3 C13.5522847,3 14,3.44771524 14,4 L14,4 L14,7 C14,7.55228474 13.5522847,8 13,8 L13,8 L7,8 C6.44771525,8 6,7.55228474 6,7 L6,7 L6,6.24999999 L3,6.24999999 C2.454,6.24999999 1.941,6.10399999 1.5,5.84899999 L1.5,5.84899999 L1.5,9.24999999 C1.5,10.0784271 2.17157288,10.75 3,10.75 L3,10.75 L6,10.75 L6,10 C6,9.44771524 6.44771525,9 7,9 L7,9 L13,9 C13.5522847,9 14,9.44771524 14,10 L14,10 L14,13 C14,13.5522847 13.5522847,14 13,14 L13,14 L7,14 C6.44771525,14 6,13.5522847 6,13 L6,13 L6,12.25 L3,12.25 C1.34314575,12.25 0,10.9068542 0,9.24999999 L0,9.24999999 L0,0.749999989 C0,0.335786431 0.335786442,0 0.75,0 Z M12.5,10.5 L7.5,10.5 L7.5,12.5 L12.5,12.5 L12.5,10.5 Z M12.5,4.49999999 L7.5,4.49999999 L7.5,6.49999999 L12.5,6.49999999 L12.5,4.49999999 Z" id="形状结合"></path>
            </g>
        </g>
    </g>
</svg>