<svg xmlns="http://www.w3.org/2000/svg" viewBox="0 0 16 16" class="design-iconfont">
    <path
        d="M13.7487072,5.48724755 L13.7487072,5.48724755 L7.17755143,12.1666395 L7.17755143,12.1666395 C7.02232461,12.3243079 6.80793695,12.4219703 6.57116206,12.4219703 C6.33438717,12.4219703 6.1199995,12.3243079 5.96471634,12.1666395 L5.96471634,12.1666395 L2.25114252,8.3910689 L2.25114252,8.3910689 C2.09600962,8.23415178 2,8.01619568 2,7.77551429 C2,7.29415153 2.38392578,6.90459138 2.85674309,6.90459138 C3.09351797,6.90459138 3.30799955,7.00215984 3.46322636,7.15986578 L3.46322636,7.15986578 L6.57114328,10.3183042 L12.5367549,4.25452314 L12.5367549,4.25452314 C12.6919817,4.09760602 12.9063693,4 13.1431067,4 C13.6158301,4 14,4.39027383 14,4.870829 C14,5.11154795 13.903934,5.32954161 13.7487072,5.48724755 L13.7487072,5.48724755 L13.7487072,5.48724755 Z"
        fill="#FC6D26" fill-rule="nonzero" />
</svg>
