<svg xmlns="http://www.w3.org/2000/svg" viewBox="0 0 18 18" class="design-iconfont">
  <g fill="none" fill-rule="evenodd">
    <path stroke-opacity=".5" stroke="#07B95C" stroke-width="2" fill="#07B95C" d="M7 -1A8 8 0 1 0 7 15A8 8 0 1 0 7 -1Z" transform="translate(2 2)"/>
    <path d="M9.29289322,4.54289322 C9.68341751,4.15236893 10.3165825,4.15236893 10.7071068,4.54289322 C11.0675907,4.90337718 11.0953203,5.47060824 10.7902954,5.86289944 L10.7071068,5.95710678 L6.70710678,9.95710678 C6.34662282,10.3175907 5.77939176,10.3453203 5.38710056,10.0402954 L5.29289322,9.95710678 L3.29289322,7.95710678 C2.90236893,7.56658249 2.90236893,6.93341751 3.29289322,6.54289322 C3.65337718,6.18240926 4.22060824,6.15467972 4.61289944,6.45970461 L4.70710678,6.54289322 L6,7.835 L9.29289322,4.54289322 Z" fill="#FFF" fill-rule="nonzero" transform="translate(2 2)"/>
  </g>
</svg>
