<svg xmlns="http://www.w3.org/2000/svg" viewBox="0 0 16 16" class="design-iconfont">
    <g stroke="#87878C" stroke-width="1.5" fill="none" fill-rule="evenodd" stroke-linecap="round"
        stroke-linejoin="round">
        <path d="M0 0.5L12 0.5" transform="translate(2 5)" />
        <path d="M0 5.5L12 5.5" transform="translate(2 5)" />
        <g>
            <path transform="rotate(100 3.28839118 9.15867726)"
                d="M-5.29205888 6.98047836L8.70794112 6.98047836" />
            <path transform="rotate(100 8.28839118 9.15867726)"
                d="M-0.29205888 6.98047836L13.7079411 6.98047836" />
        </g>
    </g>
</svg>
