<?xml version="1.0" encoding="UTF-8"?>
<svg width="30px" height="30px" viewBox="0 0 30 30" version="1.1" xmlns="http://www.w3.org/2000/svg">
    <title>创建</title>
    <g id="OS-升级提示" stroke="none" stroke-width="1" fill="none" fill-rule="evenodd" stroke-linejoin="round">
        <g id="无法发布帖子-英" transform="translate(-172.000000, -193.000000)" stroke="#FC6D26" stroke-width="2">
            <g id="编组-3备份" transform="translate(172.000000, 193.000000)">
                <g id="编组-5" transform="translate(2.500000, 2.500000)">
                    <rect id="矩形" x="0" y="0" width="25" height="25"></rect>
                    <g id="编组-7" transform="translate(5.428932, 5.428932)" stroke-linecap="round">
                        <g id="编组" transform="translate(7.071068, 7.071068) rotate(45.000000) translate(-7.071068, -7.071068) translate(2.071068, 2.071068)">
                            <line x1="0" y1="5" x2="10" y2="5" id="路径-6"></line>
                            <line x1="0" y1="5" x2="10" y2="5" id="路径-6" transform="translate(5.000000, 5.000000) rotate(90.000000) translate(-5.000000, -5.000000) "></line>
                        </g>
                    </g>
                </g>
            </g>
        </g>
    </g>
</svg>