<?xml version="1.0" encoding="UTF-8"?>
<svg width="14px" height="14px" viewBox="0 0 14 14" version="1.1" xmlns="http://www.w3.org/2000/svg">
    <title>merge-request-close</title>
    <g id="icon" stroke="none" stroke-width="1" fill="none" fill-rule="evenodd">
        <g id="第一批" transform="translate(-227.000000, -99.000000)" fill="#000000">
            <g id="merge-request-close" transform="translate(227.000000, 99.000000)">
                <path d="M0.220356377,0.219340034 C0.513173924,-0.0731133445 0.98753883,-0.0731133445 1.28035638,0.219340034 L2.50035638,1.43934003 L3.72035638,0.219340034 C4.01586613,-0.0560188269 4.4763661,-0.0478938424 4.76197818,0.237718235 C5.04759025,0.523330312 5.05571524,0.983830279 4.78035638,1.27934003 L3.56035638,2.49934003 L4.78035638,3.71934003 C5.05571524,4.01484979 5.04759025,4.47534976 4.76197818,4.76096183 C4.4763661,5.04657391 4.01586613,5.05469889 3.72035638,4.77934003 L2.50035638,3.55934003 L1.28035638,4.77934003 C0.984846622,5.05469889 0.524346655,5.04657391 0.238734578,4.76096183 C-0.0468774992,4.47534976 -0.0550024837,4.01484979 0.220356377,3.71934003 L1.44035638,2.49934003 L0.220356377,1.27934003 C-0.0720970013,0.986522487 -0.0720970013,0.51215758 0.220356377,0.219340034 Z M6.50035638,2.49934003 C6.50035638,2.08512647 6.83614281,1.74934003 7.25035638,1.74934003 L9.50035638,1.74934003 C11.0191394,1.74934003 12.2503564,2.98055697 12.2503564,4.49934003 L12.2503564,9.11334003 C13.4282966,9.48362235 14.1597218,10.6581484 13.972413,11.8786269 C13.7851041,13.0991053 12.7351245,14.0002363 11.5003564,14.0002363 C10.2655883,14.0002363 9.21560862,13.0991053 9.02829979,11.8786269 C8.84099095,10.6581484 9.57241611,9.48362235 10.7503564,9.11334003 L10.7503564,4.49934003 C10.7503564,3.80934003 10.1903564,3.24934003 9.50035638,3.24934003 L7.25035638,3.24934003 C6.83614281,3.24934003 6.50035638,2.9135536 6.50035638,2.49934003 Z M11.5003564,12.49934 C12.0526411,12.49934 12.5003564,12.0516248 12.5003564,11.49934 C12.5003564,10.9470553 12.0526411,10.49934 11.5003564,10.49934 C10.9480716,10.49934 10.5003564,10.9470553 10.5003564,11.49934 C10.5003564,12.0516248 10.9480716,12.49934 11.5003564,12.49934 Z M3.50035638,11.49934 C3.50035638,12.0516248 3.05264113,12.49934 2.50035638,12.49934 C1.94807163,12.49934 1.50035638,12.0516248 1.50035638,11.49934 C1.50035638,10.9470553 1.94807163,10.49934 2.50035638,10.49934 C3.05264113,10.49934 3.50035638,10.9470553 3.50035638,11.49934 Z M5.00035641,11.49934 C4.9997654,12.7817577 4.02891598,13.8557506 2.75306687,13.9853827 C1.47721777,14.1150147 0.31019356,13.2582394 0.0516785907,12.0021481 C-0.206836379,10.7460567 0.527007811,9.49806551 1.75035638,9.11334003 L1.75035638,6.74934003 C1.75035639,6.33512648 2.08614282,5.99934005 2.50035638,5.99934005 C2.91456993,5.99934005 3.25035637,6.33512648 3.25035638,6.74934003 L3.25035638,9.11334003 C4.29207089,9.44127999 5.00053904,10.4072257 5.00035641,11.49934 L5.00035641,11.49934 Z" id="形状"></path>
            </g>
        </g>
    </g>
</svg>