<?xml version="1.0" encoding="UTF-8"?>
<svg width="14px" height="14px" viewBox="0 0 14 14" version="1.1" xmlns="http://www.w3.org/2000/svg">
    <title>status_canceled</title>
    <g id="icon" stroke="none" stroke-width="1" fill="none" fill-rule="evenodd">
        <g id="第一批" transform="translate(-118.000000, -128.000000)" fill="#000000" fill-rule="nonzero">
            <g id="status_canceled" transform="translate(118.000000, 128.000000)">
                <path d="M7,0 C10.8659932,0 14,3.13400675 14,7 C14,10.8659932 10.8659932,14 7,14 C3.13400675,14 0,10.8659932 0,7 C0,3.13400675 3.13400675,0 7,0 Z M4,1.8038475 C2.1435935,2.87564429 1,4.85640644 1,6.99999991 C1,10.3137085 3.6862915,12.9999999 7,12.9999999 C10.3137085,12.9999999 13,10.3137085 13,6.99999991 C13,4.85640644 11.8564065,2.87564429 10,1.8038475 C8.14359355,0.732050713 5.85640645,0.732050713 4,1.8038475 Z M5.2,3.8 L10.1,8.7 C10.3,8.9 10.3,9.2 10.1,9.4 L9.4,10.1 C9.2,10.3 8.9,10.3 8.7,10.1 L3.8,5.2 C3.6,5 3.6,4.7 3.8,4.5 L4.5,3.8 C4.7,3.6 5,3.6 5.2,3.8 Z" id="形状结合"></path>
            </g>
        </g>
    </g>
</svg>