<?xml version="1.0" encoding="UTF-8"?>
<svg width="18px" height="18px" viewBox="0 0 18 18" version="1.1" xmlns="http://www.w3.org/2000/svg"
    xmlns:xlink="http://www.w3.org/1999/xlink">
    <title>resources</title>
    <g id="我的页面" stroke="none" stroke-width="1" fill="none" fill-rule="evenodd">
        <g id="我的-未登录" transform="translate(-16.000000, -53.000000)" stroke="#66696D"
            stroke-width="1.5">
            <g id="编组-15" transform="translate(16.000000, 53.000000)">
                <g id="编组-2备份" transform="translate(1.000000, 1.000000)">
                    <path
                        d="M11.8001122,0.75 C12.0137589,0.75 12.2186551,0.834870788 12.369726,0.98594176 L12.369726,0.98594176 L15.0140582,3.63027397 C15.1651292,3.78134494 15.25,3.98624115 15.25,4.19988776 L15.25,4.19988776 L15.25,14.4444444 C15.25,14.6668925 15.1598351,14.8682814 15.0140582,15.0140582 C14.8682814,15.1598351 14.6668925,15.25 14.4444444,15.25 L14.4444444,15.25 L1.55555556,15.25 C1.33310753,15.25 1.13171864,15.1598351 0.98594176,15.0140582 C0.840164877,14.8682814 0.75,14.6668925 0.75,14.4444444 L0.75,14.4444444 L0.75,1.55555556 C0.75,1.33310753 0.840164877,1.13171864 0.98594176,0.98594176 C1.13171864,0.840164877 1.33310753,0.75 1.55555556,0.75 L1.55555556,0.75 Z"
                        id="矩形"></path>
                    <line x1="5.66666667" y1="6.05555556" x2="10.3333333" y2="6.05555556"
                        id="路径-2备份"></line>
                    <line x1="5.66666667" y1="9.94444444" x2="10.3333333" y2="9.94444444"
                        id="路径-2备份-2"></line>
                </g>
            </g>
        </g>
    </g>
</svg>