action_name,created_at,author.id,author.username,push_data.commit_to,target_type,note.author.username,note.created_at,note.type,note.noteable_type,note.body_x,note.position.new_line,id,short_id,stats.additions,stats.deletions,stats.total,note.body_y
commented on,2020-10-18T09:23:57.577Z,6893847,junstudy,,Note,junstudy,2020-10-18T09:23:57.315Z,,Commit,"其实是第一次正式用pandas，以前只是听过没使用过，探索过程碰到到问题非常值得写下来，都是基于碰到问题-查询资料-解决问题的方式过来的。

解决的问题如下：
- 使json数据更加结构化，查询到了`pd.json_normalize`方法可以解决
- 为了使多个数据框合在一起，查询到了`append`方法
- 打印数据框内容时发现内容不全，查询到了`pd.set_option`可以设置显示全部内容
- 计算数据框某字段字符串长度，查询到`df['filed'].str.len()`
- 数据框里字段太长，查到可以只取特定字段使数据更简洁
- 为了把数据融合在一起，查到了`merge`方法，依葫芦画瓢写出正确的连接
- 数据导出成csv可用df.to_csv实现，无需索引可加入index=None控制",,,,,,,355.0
commented on,2020-10-18T07:54:48.376Z,6893847,junstudy,,DiffNote,junstudy,2020-10-18T07:54:48.105Z,DiffNote,Commit,应该还有其他更简便方法的，只是我没想到。用了数据框后，决定统一用数据框的方式来操作了,59.0,,,,,,42.0
commented on,2020-10-18T07:51:15.321Z,6893847,junstudy,,DiffNote,junstudy,2020-10-18T07:51:15.051Z,DiffNote,Commit,event解决了commit，commit-comments由谁，何时的问题。没发现commit提交，删除了多少行的信息，这样就考虑了另一个有commit提交，删除了多少行信息的api，再通过SHA拼接在一起,32.0,,,,,,104.0
commented on,2020-10-18T07:47:43.154Z,6893847,junstudy,,DiffNote,junstudy,2020-10-18T07:47:42.726Z,DiffNote,Commit,不修改也是能用的。只是在横向拼接数据时（类似SQL左连接），发现方法名也是merge，为了避免混淆改为union（类似与SQL的UNION）,8.0,,,,,,70.0
commented on,2020-10-18T04:43:59.180Z,2750936,ZoomQuiet,,DiffNote,ZoomQuiet,2020-10-18T04:43:58.868Z,DiffNote,Commit,"@jingxuanz 是也乎,(￣▽￣)

token 是私人信息,
如果公开在仓库代码中,
那么很可能,
其它同学抄习时,反复运行,
会耗尽你每天的免费请求限额;

- 所以, 如何在代码中合理隐藏这类私人信息?
- 同时, 又不影响代码的运行?
- 而且, 其它同学来运行时, 也可以通过简要配置完成本地兼容?

提醒:
考察一下 Python 能从多少种渠道中获得数据?
哪种渠道配合代码合理隐藏这种关键配置信息最简洁?",4.0,,,,,,213.0
commented on,2020-10-18T04:42:32.986Z,2750936,ZoomQuiet,,DiffNote,ZoomQuiet,2020-10-18T04:42:32.689Z,DiffNote,Commit,"@oneeyeQ 是也乎,(￣▽￣)

这将触发又一系列网络请求;

整体上每次运行将被迫等待几十分钟的网络请求, 这对调试程序毫无效率可言,
可以改进嘛?
如何改进?
为什么?
...",48.0,,,,,,93.0
commented on,2020-10-18T04:41:40.021Z,2750936,ZoomQuiet,,DiffNote,ZoomQuiet,2020-10-18T04:41:39.734Z,DiffNote,Commit,"@oneeyeQ 是也乎,(￣▽￣)

这将触发一系列网络请求",34.0,,,,,,31.0
commented on,2020-10-18T04:39:45.150Z,2750936,ZoomQuiet,,DiffNote,ZoomQuiet,2020-10-18T04:39:44.857Z,DiffNote,Commit,"@oneeyeQ 是也乎,(￣▽￣)

高兴你坚持自己的直觉, 使用外部文件来完成两种工具的数据交流;

只是,除了这种形式, 还有其它渠道可以完成更快的交流嘛?",20.0,,,,,,81.0
commented on,2020-10-18T04:38:36.871Z,2750936,ZoomQuiet,,DiffNote,ZoomQuiet,2020-10-18T04:38:36.574Z,DiffNote,Commit,"@oneeyeQ 是也乎,(￣▽￣)

高兴你敢于上 Pandas ,不过, 用了多少时间来学习的?
值得嘛?",3.0,,,,,,55.0
commented on,2020-10-18T04:36:49.663Z,2750936,ZoomQuiet,,Note,ZoomQuiet,2020-10-18T04:36:49.403Z,,Commit,"@junstudy 是也乎,(￣▽￣)

应该是平时就在用 Pandas ?
值得准备一下, 下周三答疑时, 给 12/13py 同学们统一介绍一下 Pandas ?
是什么?
为什么?
以及何时值得用;

学习难点...",,,,,,,111.0
commented on,2020-10-18T04:29:56.130Z,2750936,ZoomQuiet,,DiffNote,ZoomQuiet,2020-10-18T04:29:55.807Z,DiffNote,Commit,"@junstudy 是也乎,(￣▽￣)

高兴你使用这么高级的 Pandas 功能,
这对学习能力要求很高的,

不过, 真的有必要使用这么复杂的矩阵融合嘛?",59.0,,,,,,79.0
commented on,2020-10-18T04:28:58.175Z,2750936,ZoomQuiet,,DiffNote,ZoomQuiet,2020-10-18T04:28:57.788Z,DiffNote,Commit,"@junstudy 是也乎,(￣▽￣)

竟然动用了两个接口同时来, 这么复杂, 值得嘛?

或是说, events 中没包含对应 commits 行为嘛?",32.0,,,,,,78.0
commented on,2020-10-18T04:27:18.503Z,2750936,ZoomQuiet,,DiffNote,ZoomQuiet,2020-10-18T04:27:18.158Z,DiffNote,Commit,"@junstudy 是也乎,(￣▽￣)

变量修改, 可能涉及很远处的一次操作,

一般必须有绝对必要的理由, 这个修改的理由是?",8.0,,,,,,65.0
commented on,2020-10-15T04:25:54.358Z,6893840,oneeyeQ,,Note,oneeyeQ,2020-10-15T04:25:53.777Z,,Commit,可以考虑发布在issue，IDD～～,,,,,,,18.0
commented on,2020-10-14T02:43:38.900Z,6908089,jingxuanz,,Note,jingxuanz,2020-10-14T02:43:38.493Z,,Commit,"用repository/commits API将parameter 'all'设成True,就可以拿到所有分支的数据了（按时间顺序）（Retrieve every commit from the repository）",,,,,,,109.0
commented on,2020-10-14T00:54:59.523Z,2750936,ZoomQuiet,,DiffNote,ZoomQuiet,2020-10-14T00:54:59.174Z,DiffNote,Commit,"@junstudy 是也乎,(￣▽￣)

那么, 还有其它名不副实但是包含所有需要数据的 接口 嘛?

官方提供了那么多接口, 我们如何高效真正摸查明确应该用哪个?",99.0,,,,,,82.0
commented on,2020-10-08T03:31:51.189Z,2750936,ZoomQuiet,,DiffNote,ZoomQuiet,2020-10-08T03:31:50.800Z,DiffNote,Commit,"@oneeyeQ 是也乎,(￣▽￣)

这就是最经典/常用/可靠/简洁/直觉/.. 的调试技巧,

不要相信自己的思想,
只相信眼睛, 

一切拿不准的打印出来一看就知道了.",49.0,,,,,,87.0
commented on,2020-10-07T08:33:15.441Z,2750936,ZoomQuiet,,DiffNote,ZoomQuiet,2020-10-07T08:33:15.078Z,DiffNote,Commit,"@oneeyeQ 是也乎,(￣▽￣)

很明显之前用 python 直接进行文本逐行处理的方法行不通了,
现在返回的数据太多...

以及, cURL 从 gitlab 接口获得的数据,
既然能用 json.tool 处理, 说明 Python 有能力解析这种数据,
这种数据格式叫什么名字?
解析之后, 形成的数据对象什么类型? 如何使用?

这点一但突破就一通百通了.",33.0,,,,,,186.0
commented on,2020-10-07T08:31:06.510Z,2750936,ZoomQuiet,,DiffNote,ZoomQuiet,2020-10-07T08:31:06.163Z,DiffNote,Commit,"@oneeyeQ 是也乎(￣▽￣)

结合: [暂时没有找到更好的解读方法](https://gitlab.com/101camp/12py/tasks/-/issues/23)

可以看到几个问题:

token 是私人信息,
如果公开在仓库代码中,
那么很可能,
其它同学抄习时,反复运行,
会耗尽你每天的免费请求限额;

- 所以, 如何在代码中合理隐藏这类私人信息?
- 同时, 又不影响代码的运行?
- 而且, 其它同学来运行时, 也可以通过简要配置完成本地兼容?

提醒:
考察一下 Python 能从多少种渠道中获得数据?
哪种渠道配合代码合理隐藏这种关键配置信息最简洁?

以及, 这样获得的 doc, python 应该如何加载/解析/使用?
...",16.0,,,,,,334.0
commented on,2020-10-06T14:10:55.070Z,6893847,junstudy,,Note,junstudy,2020-10-06T14:10:54.615Z,,Commit,@oneeyeQ awk是一个文本处理命令，对`git branch -r`命令在终端产生结果进行提取，以/为分隔符，只取第二列的分支名（即分支名）。目前知道有这个就好，现在不建议深究，以前掌握这个命令花了很长时间。。。,,,,,,,110.0
commented on,2020-10-06T03:20:19.159Z,2750936,ZoomQuiet,,Note,ZoomQuiet,2020-10-06T03:20:18.714Z,,Commit,"@oneeyeQ 是也乎,(￣▽￣)

在提问前, 你有探索过什么?

提醒:  `awk` 是个独立工具类似 cURL/git/sed/.... 也是伟大的GNU 工具集中的一种, 有40年历史,
值得去官网探索一下...",,,,,,,117.0
commented on,2020-10-06T02:20:05.538Z,6893840,oneeyeQ,,Note,oneeyeQ,2020-10-06T02:20:05.259Z,,Commit,这个 awk 'BEGIN{} print $2' 是什么？,,,,,,,30.0
commented on,2020-10-06T02:14:16.759Z,2750936,ZoomQuiet,,DiffNote,ZoomQuiet,2020-10-06T02:14:16.447Z,DiffNote,Commit,"@oneeyeQ 好的, 这种提示足够了...",199.0,,,,,,23.0
commented on,2020-10-06T01:31:29.578Z,6893840,oneeyeQ,,DiffNote,oneeyeQ,2020-10-06T01:31:29.267Z,DiffNote,Commit,一个小tips：有时候可以参考一下`## refer`来获得灵感～～,199.0,,,,,,34.0
commented on,2020-10-06T00:59:19.988Z,6893840,oneeyeQ,,DiffNote,oneeyeQ,2020-10-06T00:59:19.606Z,DiffNote,Commit,"重要的事情说三遍：先考虑如何获得目标数据！先考虑如何获得目标数据！先考虑如何获得目标数据！
可以从Python、API、页面、git等方面考虑，然后才是处理和输出数据。",199.0,,,,,,84.0
commented on,2020-10-04T08:12:30.204Z,2750936,ZoomQuiet,,DiffNote,ZoomQuiet,2020-10-04T08:12:29.884Z,DiffNote,Commit,"@oneeyeQ 是也乎,(￣▽￣)

token 是私人信息,
如果公开在仓库代码中,
那么很可能,
其它同学抄习时,反复运行,
会耗尽你每天的免费请求限额;

- 所以, 如何在代码中合理隐藏这类私人信息?
- 同时, 又不影响代码的运行?
- 而且, 其它同学来运行时, 也可以通过简要配置完成本地兼容?

提醒:
考察一下 Python 能从多少种渠道中获得数据?
哪种渠道配合代码合理隐藏这种关键配置信息最简洁?",18.0,,,,,,211.0
commented on,2020-10-04T08:12:07.556Z,2750936,ZoomQuiet,,DiffNote,ZoomQuiet,2020-10-04T08:12:07.197Z,DiffNote,Commit,"这是什么案例文件?

拿来指导了什么代码和思路?

应该在注释中给出自己的理解的,
否则, 纯粹复制过来, 不如在笔记中, 给出原文链接...",21.0,,,,,,71.0
commented on,2020-10-04T08:08:39.917Z,2750936,ZoomQuiet,,DiffNote,ZoomQuiet,2020-10-04T08:08:39.629Z,DiffNote,Commit,"@oneeyeQ 是也乎,(￣▽￣)

有什么核心差异? 

- gitlab模块
- 另外 API
- ...?

关键在这种差异形成的关键是什么问题理解了?
另外, 这种历史代码, 也值得专门文件保存的, 以便记录下来自己真实的学习过程...

当然, 值得配合对应 Issue/维基 来分享自己的领悟故事...",13.0,,,,,,158.0
commented on,2020-10-04T08:06:11.846Z,2750936,ZoomQuiet,,DiffNote,ZoomQuiet,2020-10-04T08:06:11.020Z,DiffNote,Commit,"@oneeyeQ 是也乎,(￣▽￣)

token 是私人信息,
如果公开在仓库代码中,
那么很可能,
其它同学抄习时,反复运行,
会耗尽你每天的免费请求限额;

- 所以, 如何在代码中合理隐藏这类私人信息?
- 同时, 又不影响代码的运行?
- 而且, 其它同学来运行时, 也可以通过简要配置完成本地兼容?

提醒:
考察一下 Python 能从多少种渠道中获得数据?
哪种渠道配合代码合理隐藏这种关键配置信息最简洁?",3.0,,,,,,211.0
commented on,2020-10-04T08:05:23.811Z,2750936,ZoomQuiet,,Note,ZoomQuiet,2020-10-04T08:05:23.152Z,,Commit,"@jingxuanz 是也乎,(￣▽￣)

高兴你在继续刷 LPYTHW,

不过, 在课程进入正式任务阶段, LPYTHW 就不是主要任务了,
主要任务应该是每周开发任务,要先确保完成, 
然后, 才是其它自己想刷的各种资料.

特别是 LPYTHW 可以当成字典来日常使用就好.",,,,,,,141.0
commented on,2020-10-04T08:03:00.294Z,2750936,ZoomQuiet,,DiffNote,ZoomQuiet,2020-10-04T08:02:59.993Z,DiffNote,Commit,"@junstudy 是也乎,(￣▽￣)

token 是私人信息,
如果公开在仓库代码中,
那么很可能,
其它同学抄习时,反复运行,
会耗尽你每天的免费请求限额;

- 所以, 如何在代码中合理隐藏这类私人信息?
- 同时, 又不影响代码的运行?
- 而且, 其它同学来运行时, 也可以通过简要配置完成本地兼容?

提醒:
考察一下 Python 能从多少种渠道中获得数据?
哪种渠道配合代码合理隐藏这种关键配置信息最简洁?",14.0,,,,,,212.0
commented on,2020-10-02T11:47:05.266Z,2750936,ZoomQuiet,,Note,ZoomQuiet,2020-10-02T11:47:04.954Z,,Commit,"@junstudy 是也乎,(￣▽￣)

想和作, 有能力匹配的问题

- 首先 @izhangshiying 的问题你没回答哪
- 其次, 你的直觉是对的, 但是, 探索方法错了, 没从最基本, 最权威, 最合理的官方资料开始...
- 最后, 蟒营®课程周任务是核心, 而有期限的, 以一周为界, 尽力完成, 千万别将无结果的自行探查当成成果...
- 所以, 42分钟没进展, 就可以考虑提问, 或是探索其它方向了.",,,,,,,211.0
commented on,2020-10-02T08:50:10.675Z,6893847,junstudy,,Note,junstudy,2020-10-02T08:50:10.278Z,,Commit,@izhangshiying 谷歌查了几篇资料看看。当时想在一些地方会存有git相关的基本信息，最可能是会在.git文件夹里，想从里面找线索的,,,,,,,71.0
commented on,2020-10-02T08:28:34.427Z,4554270,izhangshiying,,Note,izhangshiying,2020-10-02T08:28:34.153Z,,Commit,"@junstudy 
不明白，这篇笔记的源头是？这篇笔记期待解决的问题是？",,,,,,,37.0
commented on,2020-10-02T08:27:06.153Z,4554270,izhangshiying,,DiffNote,izhangshiying,2020-10-02T08:27:05.789Z,DiffNote,Commit,@junstudy 挺厉害的！一上来就给出了 3+ 种解决方案！,34.0,,,,,,32.0
commented on,2020-09-06T01:36:41.469Z,2750936,ZoomQuiet,,DiffNote,ZoomQuiet,2020-09-06T01:36:41.174Z,DiffNote,Commit,"@jingxuanz 是也乎,(￣▽￣)

全英文笔记非常好的习惯,
这样对比相关资料, 也更加方便找到自己操作的缺失 ;-)

不过, 对应的, 也减少了同学们 review 的动力, 有得有失吧...",21.0,,,,,,102.0
commented on,2020-09-06T01:27:58.759Z,2750936,ZoomQuiet,,Note,ZoomQuiet,2020-09-06T01:27:58.448Z,,Commit,"@jingxuanz 是也乎,(￣▽￣)

非常赞的发现...

为什么追加这个忽略?
以及, 以往意外 push 上来的 mac 本地文件怎么清除?",,,,,,,75.0
