<?xml version="1.0" encoding="UTF-8"?>
<svg width="26px" height="34px" viewBox="0 0 26 34" version="1.1" xmlns="http://www.w3.org/2000/svg" xmlns:xlink="http://www.w3.org/1999/xlink">
    <!-- Generator: Sketch 62 (91390) - https://sketch.com -->
    <title>Combined Shape</title>
    <desc>Created with Sketch.</desc>
    <g id="Page-1" stroke="none" stroke-width="1" fill="none" fill-rule="evenodd">
        <g id="Desktop-HD" transform="translate(-906.000000, -497.000000)" fill="#DEDEE2">
            <path d="M906,497 L907.581331,497 C913.174082,497 918.511339,499.34175 922.298415,503.4572 L932,514 L922.298415,524.5428 C918.511339,528.65825 913.174082,531 907.581331,531 L907.581331,531 L906,531 L920.326774,514 L906,497 Z" id="Combined-Shape"></path>
        </g>
    </g>
</svg>