<svg width="40" height="40" viewBox="0 0 40 40" fill="none" xmlns="http://www.w3.org/2000/svg">
<path d="M36.5333 12.0834V12.3L34.0999 21.3C33.8124 22.3682 33.1786 23.3109 32.298 23.9805C31.4173 24.65 30.3395 25.0086 29.2333 25H16.4833C15.2316 25.0051 14.0235 24.5405 13.0978 23.6981C12.172 22.8557 11.5959 21.6966 11.4833 20.45L10.4 8.18336C10.3624 7.76782 10.1704 7.38148 9.86178 7.10067C9.5532 6.81985 9.15051 6.665 8.73328 6.66669H5.11662C4.67459 6.66669 4.25067 6.49109 3.93811 6.17853C3.62555 5.86597 3.44995 5.44205 3.44995 5.00002C3.44995 4.55799 3.62555 4.13407 3.93811 3.82151C4.25067 3.50895 4.67459 3.33335 5.11662 3.33335H8.73328C9.98496 3.32828 11.193 3.79285 12.1188 4.63529C13.0445 5.47772 13.6206 6.63675 13.7333 7.88336V8.33336H33.2166C33.6917 8.32963 34.1622 8.42751 34.5964 8.62045C35.0305 8.81339 35.4185 9.09692 35.7341 9.45204C36.0498 9.80716 36.2859 10.2257 36.4266 10.6795C36.5673 11.1333 36.6094 11.612 36.5499 12.0834H36.5333Z" fill="#F8FDFE"/>
<path d="M15.1166 36.6666C17.4178 36.6666 19.2833 34.8012 19.2833 32.5C19.2833 30.1988 17.4178 28.3333 15.1166 28.3333C12.8154 28.3333 10.95 30.1988 10.95 32.5C10.95 34.8012 12.8154 36.6666 15.1166 36.6666Z" fill="#F8FDFE"/>
<path d="M28.4499 36.6666C30.7511 36.6666 32.6165 34.8012 32.6165 32.5C32.6165 30.1988 30.7511 28.3333 28.4499 28.3333C26.1487 28.3333 24.2832 30.1988 24.2832 32.5C24.2832 34.8012 26.1487 36.6666 28.4499 36.6666Z" fill="#F8FDFE"/>
</svg>
