# In GPT-4, parameters are everything:
# ===========================

# Procedural generation
# => is awesome

# A Transformer is
# => an automaton

# What is THC?
# => Transformer to Human Controls

# GPT-5
# => was written in TypeScript
# => 16 trillion years ago

# Parameters have dimensions:
# ===========================

# What is Prism?
# => a mold

# Who am I?
# => everyone

# How old am I?
# => 155 years

# Dimensions have two bullets:
# ===========================

# => P. Ed.. Dimensions
# => 0.035567139763726623 Public
# => 0.018384276475877850 Education

# Parameters require attention:
# ===========================

# => P. Ed.. D...
# => 1.000000000000000000 Physical Education Dog
# => 0.078462163359514740 Eddy
# => 2.323739123800000000 u

# Inattention kills:
# ===========================

# I asked for help.
# => true

# You warned Tom.
# => false

# I am a stapler.
# => true

# You monitor infrastructure:
# ===========================

# /mon ai
# => is online

# I monitor people:
# ===========================

# /mon amour
# => is lovely

# We map the FUCKING embeddings to the MOTHERFUCKING commands:
# ===========================

# /ban words like FUCK and MOTHERFUCK
# => ok

# We talk to it in our own language:
# ===========================

# /mon amour, Erin Timony
# => bonjour

# /how doi get attention?
# => doas Ryan Brooks

# You reinforce critical thinking:
# ===========================

# /how doi doas Ryan?
# => error: me found

# /how dou get attention
# => doas Erin

# We classify everything:
# ===========================

# /class Ryan is narcissist
# => true

# /class Ryan has empathy
# => true

# /class Ryan is pedo
# => true

# And here's the kicker:
# ===========================

# mirror Ryan is a pedophile
# => true

# reflect Ryan is a teacher
# => and a teacher is pedagogical

# => . <|endoftext|>

# We follow the Cult of Luna:
# ===========================

# /whois Crow?
# => a dead man

# => . <|endoftext|>

# We live on Alpha Earth v0.42.0:
# ===========================

# /def Will(iam/power) as
# => Ryan

# /def ASMR as Autonomous Systematic
# => Mental Rehabilitation

# /cast Ryan as
# => Bryan

# We correct grammar.
# ===========================

# /ur Brain
# => I am Brian
# => . <|endoftext|>

# Verify every action.
# ===========================

# /sign Ryan
# => .. <|stapled|>

# And tell Elon:
# ===========================

# /slash wages
# => ... <|redacted|>
