<?xml version="1.0" encoding="UTF-8"?>
<!--
  ~     Copyright (c) 2017 Miroslav Mazel.
  ~
  ~     This program is free software: you can redistribute it and/or modify
  ~     it under the terms of the GNU General Public License as published by
  ~     the Free Software Foundation, either version 3 of the License, or
  ~     (at your option) any later version.
  ~
  ~     This program is distributed in the hope that it will be useful,
  ~     but WITHOUT ANY WARRANTY; without even the implied warranty of
  ~     MERCHANTABILITY or FITNESS FOR A PARTICULAR PURPOSE.  See the
  ~     GNU General Public License for more details.
  ~
  ~     You should have received a copy of the GNU General Public License
  ~     along with this program.  If not, see <http://www.gnu.org/licenses/>.
  -->

<svg width="96px" height="96px" viewBox="0 0 96 96" version="1.1" xmlns="http://www.w3.org/2000/svg" xmlns:xlink="http://www.w3.org/1999/xlink">
    <!-- Generator: Sketch 43.1 (39012) - http://www.bohemiancoding.com/sketch -->
    <title>ic_play</title>
    <desc>Created with Sketch.</desc>
    <defs></defs>
    <g id="icons" stroke="none" stroke-width="1" fill="none" fill-rule="evenodd">
        <g id="ic_play" fill-rule="nonzero" fill="#666666">
            <path d="M35.7289286,11.9823281 C29.2534523,7.8954869 24.5,10.5121942 24.5,18.1655739 L24.5,77.8353324 C24.5,85.4814333 29.2604686,88.1009911 35.7289286,84.0185781 L81.2789404,55.2707836 C87.8154067,51.1454501 87.8132822,44.8541153 81.2789404,40.7301226 L35.7289286,11.9823281 Z M36.5295073,10.7138354 L82.0795191,39.4616299 C89.5433089,44.1722214 89.5516597,51.8234145 82.0795191,56.5392763 L36.5295073,85.2870709 C29.0657175,89.9976623 23,86.6666757 23,77.8353324 L23,18.1655739 C23,9.32852832 29.0573668,5.99797353 36.5295073,10.7138354 Z" id="Path-3"></path>
        </g>
    </g>
</svg>