{
  "version": 1,
  "isRoot": true,
  "tools": {
    "cake.tool": {
      "version": "2.3.0",
      "commands": [
        "dotnet-cake"
      ]
    },
    "csharpier": {
      "version": "0.20.0",
      "commands": [
        "dotnet-csharpier"
      ]
    },
    "altcode.gendarme-tool": {
      "version": "2022.5.17.8260",
      "commands": [
        "gendarme"
      ]
    }
  }
}