<svg width="45" height="46" viewBox="0 0 45 46" fill="none" xmlns="http://www.w3.org/2000/svg">
<line x1="15.3" y1="2.21675" x2="15.3" y2="9.28341" stroke="white" stroke-width="0.6" stroke-linecap="round"/>
<line x1="28.425" y1="2.21675" x2="28.425" y2="9.28341" stroke="white" stroke-width="0.6" stroke-linecap="round"/>
<path d="M13.4135 6.1333H10.375C9.82272 6.1333 9.375 6.58102 9.375 7.1333V41.9975C9.375 42.8369 10.3468 43.3028 11.0012 42.7772L21.8738 34.0446C22.2396 33.7508 22.7604 33.7508 23.1262 34.0446L33.9988 42.7772C34.6532 43.3028 35.625 42.8369 35.625 41.9975V7.1333C35.625 6.58102 35.1773 6.1333 34.625 6.1333H31.5865" stroke="white" stroke-width="0.6" stroke-linecap="round"/>
<path d="M26.25 6.1333H18.75" stroke="white" stroke-width="0.6" stroke-linecap="round"/>
<path d="M17.375 12.4585H27.625C27.9011 12.4585 28.125 12.6824 28.125 12.9585V18.2835C28.125 18.5596 27.9011 18.7835 27.625 18.7835H17.375C17.0989 18.7835 16.875 18.5596 16.875 18.2835V12.9585C16.875 12.6824 17.0989 12.4585 17.375 12.4585Z" stroke="white" stroke-width="0.6" stroke-linecap="round"/>
</svg>
