<svg width="45" height="47" viewBox="0 0 45 47" fill="none" xmlns="http://www.w3.org/2000/svg">
<path fill-rule="evenodd" clip-rule="evenodd" d="M35.6243 26.9167C35.9005 26.9166 36.1244 27.1404 36.1245 27.4166L36.1257 30.8334H39.3745C39.6507 30.8334 39.8745 31.0573 39.8745 31.3334C39.8745 31.6096 39.6507 31.8334 39.3745 31.8334H35.6259H35.1261L35.1259 31.3336L35.1245 27.4169C35.1244 27.1408 35.3482 26.9168 35.6243 26.9167Z" fill="white"/>
<path d="M36.1245 27.4166L35.9245 27.4166V27.4166L36.1245 27.4166ZM35.6243 26.9167L35.6244 27.1167L35.6243 26.9167ZM36.1257 30.8334L35.9257 30.8335C35.9258 30.9439 36.0153 31.0334 36.1257 31.0334V30.8334ZM35.1261 31.8334L34.9261 31.8335C34.9261 31.9439 35.0157 32.0334 35.1261 32.0334V31.8334ZM35.1259 31.3336L35.3259 31.3335L35.1259 31.3336ZM35.1245 27.4169L34.9245 27.417L35.1245 27.4169ZM36.3245 27.4165C36.3244 27.0299 36.0109 26.7166 35.6243 26.7167L35.6244 27.1167C35.7901 27.1167 35.9245 27.251 35.9245 27.4166L36.3245 27.4165ZM36.3257 30.8333L36.3245 27.4165L35.9245 27.4166L35.9257 30.8335L36.3257 30.8333ZM39.3745 30.6334H36.1257V31.0334H39.3745V30.6334ZM40.0745 31.3334C40.0745 30.9468 39.7611 30.6334 39.3745 30.6334V31.0334C39.5402 31.0334 39.6745 31.1677 39.6745 31.3334H40.0745ZM39.3745 32.0334C39.7611 32.0334 40.0745 31.72 40.0745 31.3334H39.6745C39.6745 31.4991 39.5402 31.6334 39.3745 31.6334V32.0334ZM35.6259 32.0334H39.3745V31.6334H35.6259V32.0334ZM35.1261 32.0334H35.6259V31.6334H35.1261V32.0334ZM34.9259 31.3337L34.9261 31.8335L35.3261 31.8333L35.3259 31.3335L34.9259 31.3337ZM34.9245 27.417L34.9259 31.3337L35.3259 31.3335L35.3245 27.4169L34.9245 27.417ZM35.6243 26.7167C35.2377 26.7169 34.9244 27.0304 34.9245 27.417L35.3245 27.4169C35.3245 27.2512 35.4587 27.1168 35.6244 27.1167L35.6243 26.7167Z" fill="white"/>
<rect x="18.75" y="7.8335" width="11.25" height="7.83333" rx="0.5" stroke="white"/>
<ellipse cx="35.625" cy="31.3335" rx="5.625" ry="5.875" stroke="white"/>
<path d="M35.625 22.5209V4.91675C35.625 4.36446 35.1773 3.91675 34.625 3.91675H10.375C9.82272 3.91675 9.375 4.36446 9.375 4.91675V42.0834C9.375 42.6357 9.82272 43.0834 10.375 43.0834H34.625C35.1773 43.0834 35.625 42.6357 35.625 42.0834V40.1459" stroke="white" stroke-linecap="round"/>
<line x1="13.625" y1="3.91675" x2="13.625" y2="43.0834" stroke="white"/>
</svg>
