<svg width="26" height="24" viewBox="0 0 26 24" fill="none" xmlns="http://www.w3.org/2000/svg">
<path d="M21.8881 24H4.07689C4.0325 23.9862 3.98875 23.968 3.9431 23.9592C2.41619 23.6749 1.43397 22.7888 0.974878 21.3272C0.926686 21.1741 0.894981 21.0153 0.855667 20.8591C0.855667 14.9531 0.855667 9.04714 0.855667 3.14118C0.870251 3.10666 0.891811 3.0734 0.898152 3.037C1.20442 1.26164 2.69202 0.00337963 4.50301 0.00212451C10.1611 -0.000385727 15.8191 -0.00101329 21.4772 0.00212451C23.4892 0.00337963 25.1062 1.60115 25.1081 3.58863C25.1119 9.19524 25.1112 14.8012 25.1081 20.4078C25.1074 21.978 24.0853 23.3536 22.5736 23.8312C22.3497 23.9021 22.117 23.9441 21.8881 23.9994V24ZM3.74526 12.0017C3.74526 13.8448 3.74462 15.688 3.74526 17.5311C3.74653 19.6058 5.2969 21.1396 7.39577 21.1402C11.1211 21.1415 14.8464 21.1415 18.5718 21.1402C20.6681 21.1396 22.2185 19.6033 22.2191 17.528C22.2204 13.8417 22.2204 10.156 22.2191 6.46975C22.2185 4.39441 20.6675 2.86191 18.5686 2.86066C14.8433 2.8594 11.1179 2.8594 7.3926 2.86066C5.295 2.86129 3.74653 4.39567 3.74526 6.47226C3.74399 8.3154 3.74526 10.1585 3.74526 12.0017Z" fill="white"/>
<path d="M20.7987 12.0111C20.7987 13.8385 20.7994 15.6666 20.7987 17.4941C20.7981 18.8446 19.8958 19.7338 18.5248 19.7338C14.8306 19.7338 11.1363 19.7338 7.44205 19.7338C6.06099 19.7338 5.16691 18.8446 5.16627 17.4721C5.16627 13.8247 5.16627 10.1767 5.16627 6.52934C5.16627 5.14682 6.06035 4.26636 7.46361 4.26636C11.142 4.26636 14.8204 4.26636 18.4988 4.26636C19.9148 4.26636 20.7975 5.14369 20.7981 6.5513C20.7981 8.37122 20.7981 10.1911 20.7981 12.0111H20.7987ZM17.9561 11.9985C17.9554 9.28934 15.7247 7.08096 12.9866 7.07908C10.2479 7.0772 8.01274 9.28181 8.00894 11.9897C8.0045 14.7089 10.2422 16.9249 12.9898 16.9217C15.7266 16.9186 17.9567 14.7077 17.9561 11.9985ZM17.9478 8.48418C18.7271 8.48795 19.3707 7.86102 19.3771 7.09289C19.3834 6.32099 18.7531 5.68213 17.977 5.67335C17.1863 5.66456 16.5376 6.29588 16.5363 7.07594C16.5357 7.84721 17.1704 8.48042 17.9478 8.48418Z" fill="white"/>
<path d="M9.42996 12.0048C9.42806 10.0676 11.0215 8.48675 12.9777 8.48486C14.9358 8.48298 16.5331 10.0594 16.535 11.9948C16.5369 13.9315 14.9435 15.5129 12.9873 15.5154C11.0304 15.5179 9.43123 13.9396 9.42996 12.0048Z" fill="white"/>
</svg>
