<svg width="45" height="47" viewBox="0 0 45 47" fill="none" xmlns="http://www.w3.org/2000/svg">
<path fill-rule="evenodd" clip-rule="evenodd" d="M35.6244 26.9168C35.9005 26.9167 36.1245 27.1405 36.1246 27.4166L36.1258 30.8335H39.3746C39.6507 30.8335 39.8746 31.0573 39.8746 31.3335C39.8746 31.6096 39.6507 31.8335 39.3746 31.8335H35.626H35.1261L35.126 31.3336L35.1246 27.417C35.1245 27.1408 35.3482 26.9169 35.6244 26.9168Z" fill="black"/>
<path d="M36.1246 27.4166L35.9246 27.4167L36.1246 27.4166ZM35.6244 26.9168L35.6245 27.1168L35.6244 26.9168ZM36.1258 30.8335L35.9258 30.8335C35.9258 30.944 36.0154 31.0335 36.1258 31.0335V30.8335ZM35.1261 31.8335L34.9261 31.8335C34.9262 31.944 35.0157 32.0335 35.1261 32.0335V31.8335ZM35.126 31.3336L35.326 31.3336L35.126 31.3336ZM35.1246 27.417L34.9246 27.417V27.417L35.1246 27.417ZM36.3246 27.4165C36.3244 27.0299 36.0109 26.7167 35.6243 26.7168L35.6245 27.1168C35.7901 27.1167 35.9245 27.251 35.9246 27.4167L36.3246 27.4165ZM36.3258 30.8334L36.3246 27.4165L35.9246 27.4167L35.9258 30.8335L36.3258 30.8334ZM39.3746 30.6335H36.1258V31.0335H39.3746V30.6335ZM40.0746 31.3335C40.0746 30.9469 39.7612 30.6335 39.3746 30.6335V31.0335C39.5402 31.0335 39.6746 31.1678 39.6746 31.3335H40.0746ZM39.3746 32.0335C39.7612 32.0335 40.0746 31.7201 40.0746 31.3335H39.6746C39.6746 31.4991 39.5402 31.6335 39.3746 31.6335V32.0335ZM35.626 32.0335H39.3746V31.6335H35.626V32.0335ZM35.1261 32.0335H35.626V31.6335H35.1261V32.0335ZM34.926 31.3337L34.9261 31.8335L35.3261 31.8334L35.326 31.3336L34.926 31.3337ZM34.9246 27.417L34.926 31.3337L35.326 31.3336L35.3246 27.4169L34.9246 27.417ZM35.6243 26.7168C35.2377 26.7169 34.9244 27.0304 34.9246 27.417L35.3246 27.4169C35.3245 27.2512 35.4588 27.1169 35.6245 27.1168L35.6243 26.7168Z" fill="black"/>
<rect x="18.75" y="7.8335" width="11.25" height="7.83333" rx="0.5" stroke="black"/>
<ellipse cx="35.625" cy="31.3335" rx="5.625" ry="5.875" stroke="black"/>
<path d="M35.625 22.5209V4.91675C35.625 4.36446 35.1773 3.91675 34.625 3.91675H10.375C9.82272 3.91675 9.375 4.36446 9.375 4.91675V42.0834C9.375 42.6357 9.82272 43.0834 10.375 43.0834H34.625C35.1773 43.0834 35.625 42.6357 35.625 42.0834V40.1459" stroke="black" stroke-linecap="round"/>
<line x1="13.625" y1="3.91675" x2="13.625" y2="43.0834" stroke="black"/>
</svg>
