<svg width="12" height="14" viewBox="0 0 12 14" fill="none" xmlns="http://www.w3.org/2000/svg">
    <path
        d="M0.427788 5.84906C0.291141 6.00341 0.184027 6.18542 0.112592 6.38465C-0.0375292 6.77978 -0.0375292 7.22299 0.112592 7.61812C0.184027 7.81735 0.291141 7.99936 0.427788 8.15371L4.93059 13.0227C5.21323 13.3283 5.59656 13.5 5.99626 13.5C6.39596 13.5 6.77929 13.3283 7.06192 13.0227C7.34455 12.7171 7.50333 12.3026 7.50333 11.8704C7.50333 11.4382 7.34455 11.0237 7.06192 10.718L5.11071 8.62438L10.4991 8.62438C10.8971 8.62438 11.2789 8.45338 11.5604 8.14901C11.8419 7.84464 12 7.43183 12 7.00138C12 6.57094 11.8419 6.15812 11.5604 5.85375C11.2789 5.54938 10.8971 5.37839 10.4991 5.37839L5.11071 5.37839L7.06192 3.28473C7.2026 3.13385 7.31426 2.95435 7.39046 2.75657C7.46666 2.55879 7.5059 2.34666 7.5059 2.1324C7.5059 1.91815 7.46666 1.70601 7.39046 1.50824C7.31426 1.31046 7.2026 1.13096 7.06192 0.980078C6.92239 0.827957 6.75639 0.707216 6.57348 0.624819C6.39058 0.542422 6.1944 0.499999 5.99626 0.499999C5.79812 0.499999 5.60194 0.542422 5.41903 0.624819C5.23613 0.707216 5.07012 0.827957 4.93059 0.980078L0.427788 5.84906Z"
        fill="#b2b1b6" />
</svg>