<svg width="53" height="54" viewBox="0 0 53 54" fill="none" xmlns="http://www.w3.org/2000/svg">
<path d="M42.3 18H37.2C37.1448 18 37.1 18.0448 37.1 18.1V29.8118C37.1 29.867 37.0552 29.9118 37 29.9118H33.3322C33.2485 29.9118 33.2018 30.0084 33.2539 30.074L39.6717 38.1515C39.7117 38.2018 39.7883 38.2018 39.8283 38.1515L46.2461 30.074C46.2982 30.0084 46.2515 29.9118 46.1678 29.9118H42.5C42.4448 29.9118 42.4 29.867 42.4 29.8118V18.1C42.4 18.0448 42.3552 18 42.3 18Z" stroke="white"/>
<line x1="4.91675" y1="17.5" x2="12.7501" y2="17.5" stroke="white" stroke-linecap="round"/>
<line x1="4.91675" y1="17.5" x2="12.7501" y2="17.5" stroke="white" stroke-linecap="round"/>
<line x1="4.91675" y1="37.75" x2="12.7501" y2="37.75" stroke="white" stroke-linecap="round"/>
<path d="M39.7502 13.5V7.75C39.7502 7.19772 39.3024 6.75 38.7502 6.75H9.8335C9.28121 6.75 8.8335 7.19772 8.8335 7.75V13.5" stroke="white" stroke-linecap="round"/>
<path d="M8.8335 20.25V33.75" stroke="white" stroke-linecap="round"/>
<path d="M8.8335 40.5V46.25C8.8335 46.8023 9.28121 47.25 9.8335 47.25H38.7502C39.3024 47.25 39.7502 46.8023 39.7502 46.25V41.625" stroke="white" stroke-linecap="round"/>
</svg>
