<svg width="289" height="69" viewBox="0 0 289 69" fill="none" xmlns="http://www.w3.org/2000/svg">
<line x1="2.41675" y1="24.4167" x2="9.08341" y2="24.4167" stroke="black" stroke-linecap="round"/>
<line x1="2.41675" y1="35.9167" x2="9.08341" y2="35.9167" stroke="black" stroke-linecap="round"/>
<path d="M5.75 21.0834V17.6991C5.75 17.4135 5.87215 17.1415 6.08564 16.9517L22.3356 2.50729C22.7145 2.17051 23.2855 2.17051 23.6644 2.50729L39.9144 16.9517C40.1279 17.1415 40.25 17.4135 40.25 17.6991V43.0834C40.25 43.6357 39.8023 44.0834 39.25 44.0834H6.75C6.19772 44.0834 5.75 43.6357 5.75 43.0834V38.3334" stroke="black" stroke-linecap="round"/>
<path d="M5.75 32.5835V26.8335" stroke="black" stroke-linecap="round"/>
<path d="M18.2085 44.0833V32.625C18.2085 32.0727 18.6562 31.625 19.2085 31.625H27.7502C28.3024 31.625 28.7502 32.0727 28.7502 32.625V44.0833" stroke="black" stroke-linecap="round"/>
<path d="M14.7045 68V62.1818H15.4091V64.7727H18.5114V62.1818H19.2159V68H18.5114V65.3977H15.4091V68H14.7045ZM22.3082 68.0909C21.9143 68.0909 21.5687 67.9972 21.2713 67.8097C20.9759 67.6222 20.7448 67.3598 20.5781 67.0227C20.4134 66.6856 20.331 66.2917 20.331 65.8409C20.331 65.3864 20.4134 64.9896 20.5781 64.6506C20.7448 64.3116 20.9759 64.0483 21.2713 63.8608C21.5687 63.6733 21.9143 63.5795 22.3082 63.5795C22.7022 63.5795 23.0469 63.6733 23.3423 63.8608C23.6397 64.0483 23.8707 64.3116 24.0355 64.6506C24.2022 64.9896 24.2855 65.3864 24.2855 65.8409C24.2855 66.2917 24.2022 66.6856 24.0355 67.0227C23.8707 67.3598 23.6397 67.6222 23.3423 67.8097C23.0469 67.9972 22.7022 68.0909 22.3082 68.0909ZM22.3082 67.4886C22.6075 67.4886 22.8537 67.4119 23.0469 67.2585C23.2401 67.1051 23.383 66.9034 23.4759 66.6534C23.5687 66.4034 23.6151 66.1326 23.6151 65.8409C23.6151 65.5492 23.5687 65.2775 23.4759 65.0256C23.383 64.7737 23.2401 64.5701 23.0469 64.4148C22.8537 64.2595 22.6075 64.1818 22.3082 64.1818C22.009 64.1818 21.7628 64.2595 21.5696 64.4148C21.3764 64.5701 21.2334 64.7737 21.1406 65.0256C21.0478 65.2775 21.0014 65.5492 21.0014 65.8409C21.0014 66.1326 21.0478 66.4034 21.1406 66.6534C21.2334 66.9034 21.3764 67.1051 21.5696 67.2585C21.7628 67.4119 22.009 67.4886 22.3082 67.4886ZM25.3089 68V63.6364H25.9567V64.3182H26.0135C26.1044 64.0852 26.2512 63.9044 26.4538 63.7756C26.6565 63.6449 26.8999 63.5795 27.1839 63.5795C27.4718 63.5795 27.7114 63.6449 27.9027 63.7756C28.0959 63.9044 28.2464 64.0852 28.3544 64.3182H28.3999C28.5116 64.0928 28.6792 63.9138 28.9027 63.7812C29.1262 63.6468 29.3942 63.5795 29.7067 63.5795C30.0968 63.5795 30.416 63.7017 30.6641 63.946C30.9122 64.1884 31.0362 64.5663 31.0362 65.0795V68H30.3658V65.0795C30.3658 64.7576 30.2777 64.5275 30.1016 64.3892C29.9254 64.2509 29.718 64.1818 29.4794 64.1818C29.1726 64.1818 28.9349 64.2746 28.7663 64.4602C28.5978 64.6439 28.5135 64.8769 28.5135 65.1591V68H27.8317V65.0114C27.8317 64.7633 27.7512 64.5634 27.5902 64.4119C27.4292 64.2585 27.2218 64.1818 26.968 64.1818C26.7938 64.1818 26.6309 64.2282 26.4794 64.321C26.3298 64.4138 26.2086 64.5426 26.1158 64.7074C26.0249 64.8703 25.9794 65.0587 25.9794 65.2727V68H25.3089ZM34.0916 68.0909C33.6712 68.0909 33.3085 67.9981 33.0036 67.8125C32.7005 67.625 32.4666 67.3636 32.3018 67.0284C32.139 66.6913 32.0575 66.2992 32.0575 65.8523C32.0575 65.4053 32.139 65.0114 32.3018 64.6705C32.4666 64.3277 32.6958 64.0606 32.9893 63.8693C33.2848 63.6761 33.6295 63.5795 34.0234 63.5795C34.2507 63.5795 34.4751 63.6174 34.6967 63.6932C34.9183 63.7689 35.12 63.892 35.3018 64.0625C35.4837 64.2311 35.6286 64.4545 35.7365 64.733C35.8445 65.0114 35.8984 65.3542 35.8984 65.7614V66.0455H32.5348V65.4659H35.2166C35.2166 65.2197 35.1674 65 35.0689 64.8068C34.9723 64.6136 34.834 64.4612 34.6541 64.3494C34.4761 64.2377 34.2659 64.1818 34.0234 64.1818C33.7564 64.1818 33.5253 64.2481 33.3303 64.3807C33.1371 64.5114 32.9884 64.6818 32.8842 64.892C32.7801 65.1023 32.728 65.3277 32.728 65.5682V65.9545C32.728 66.2841 32.7848 66.5634 32.8984 66.7926C33.014 67.0199 33.174 67.1932 33.3786 67.3125C33.5831 67.4299 33.8208 67.4886 34.0916 67.4886C34.2678 67.4886 34.4268 67.464 34.5689 67.4148C34.7128 67.3636 34.8369 67.2879 34.9411 67.1875C35.0452 67.0852 35.1257 66.9583 35.1825 66.8068L35.8303 66.9886C35.7621 67.2083 35.6475 67.4015 35.4865 67.5682C35.3255 67.733 35.1267 67.8617 34.8899 67.9545C34.6532 68.0455 34.3871 68.0909 34.0916 68.0909Z" fill="black"/>
<path d="M90.5 68H88.7045V62.1818H90.5795C91.1439 62.1818 91.6269 62.2983 92.0284 62.5312C92.4299 62.7623 92.7377 63.0947 92.9517 63.5284C93.1657 63.9602 93.2727 64.4773 93.2727 65.0795C93.2727 65.6856 93.1648 66.2074 92.9489 66.6449C92.733 67.0805 92.4186 67.4157 92.0057 67.6506C91.5928 67.8835 91.0909 68 90.5 68ZM89.4091 67.375H90.4545C90.9356 67.375 91.3343 67.2822 91.6506 67.0966C91.9669 66.911 92.2027 66.6468 92.358 66.304C92.5133 65.9612 92.5909 65.553 92.5909 65.0795C92.5909 64.6098 92.5142 64.2055 92.3608 63.8665C92.2074 63.5256 91.9782 63.2642 91.6733 63.0824C91.3684 62.8987 90.9886 62.8068 90.5341 62.8068H89.4091V67.375ZM96.1364 68.0909C95.7424 68.0909 95.3968 67.9972 95.0994 67.8097C94.804 67.6222 94.5729 67.3598 94.4062 67.0227C94.2415 66.6856 94.1591 66.2917 94.1591 65.8409C94.1591 65.3864 94.2415 64.9896 94.4062 64.6506C94.5729 64.3116 94.804 64.0483 95.0994 63.8608C95.3968 63.6733 95.7424 63.5795 96.1364 63.5795C96.5303 63.5795 96.875 63.6733 97.1705 63.8608C97.4678 64.0483 97.6989 64.3116 97.8636 64.6506C98.0303 64.9896 98.1136 65.3864 98.1136 65.8409C98.1136 66.2917 98.0303 66.6856 97.8636 67.0227C97.6989 67.3598 97.4678 67.6222 97.1705 67.8097C96.875 67.9972 96.5303 68.0909 96.1364 68.0909ZM96.1364 67.4886C96.4356 67.4886 96.6818 67.4119 96.875 67.2585C97.0682 67.1051 97.2112 66.9034 97.304 66.6534C97.3968 66.4034 97.4432 66.1326 97.4432 65.8409C97.4432 65.5492 97.3968 65.2775 97.304 65.0256C97.2112 64.7737 97.0682 64.5701 96.875 64.4148C96.6818 64.2595 96.4356 64.1818 96.1364 64.1818C95.8371 64.1818 95.5909 64.2595 95.3977 64.4148C95.2045 64.5701 95.0616 64.7737 94.9688 65.0256C94.8759 65.2775 94.8295 65.5492 94.8295 65.8409C94.8295 66.1326 94.8759 66.4034 94.9688 66.6534C95.0616 66.9034 95.2045 67.1051 95.3977 67.2585C95.5909 67.4119 95.8371 67.4886 96.1364 67.4886ZM99.9773 68L98.6477 63.6364H99.3523L100.295 66.9773H100.341L101.273 63.6364H101.989L102.909 66.9659H102.955L103.898 63.6364H104.602L103.273 68H102.614L101.659 64.6477H101.591L100.636 68H99.9773ZM106.159 65.375V68H105.489V63.6364H106.136V64.3182H106.193C106.295 64.0966 106.451 63.9186 106.659 63.7841C106.867 63.6477 107.136 63.5795 107.466 63.5795C107.761 63.5795 108.02 63.6402 108.241 63.7614C108.463 63.8807 108.635 64.0625 108.759 64.3068C108.882 64.5492 108.943 64.8561 108.943 65.2273V68H108.273V65.2727C108.273 64.9299 108.184 64.6629 108.006 64.4716C107.828 64.2784 107.583 64.1818 107.273 64.1818C107.059 64.1818 106.867 64.2282 106.699 64.321C106.532 64.4138 106.401 64.5492 106.304 64.7273C106.207 64.9053 106.159 65.1212 106.159 65.375ZM110.839 62.1818V68H110.168V62.1818H110.839ZM113.839 68.0909C113.446 68.0909 113.1 67.9972 112.803 67.8097C112.507 67.6222 112.276 67.3598 112.109 67.0227C111.945 66.6856 111.862 66.2917 111.862 65.8409C111.862 65.3864 111.945 64.9896 112.109 64.6506C112.276 64.3116 112.507 64.0483 112.803 63.8608C113.1 63.6733 113.446 63.5795 113.839 63.5795C114.233 63.5795 114.578 63.6733 114.874 63.8608C115.171 64.0483 115.402 64.3116 115.567 64.6506C115.733 64.9896 115.817 65.3864 115.817 65.8409C115.817 66.2917 115.733 66.6856 115.567 67.0227C115.402 67.3598 115.171 67.6222 114.874 67.8097C114.578 67.9972 114.233 68.0909 113.839 68.0909ZM113.839 67.4886C114.139 67.4886 114.385 67.4119 114.578 67.2585C114.771 67.1051 114.914 66.9034 115.007 66.6534C115.1 66.4034 115.146 66.1326 115.146 65.8409C115.146 65.5492 115.1 65.2775 115.007 65.0256C114.914 64.7737 114.771 64.5701 114.578 64.4148C114.385 64.2595 114.139 64.1818 113.839 64.1818C113.54 64.1818 113.294 64.2595 113.101 64.4148C112.908 64.5701 112.765 64.7737 112.672 65.0256C112.579 65.2775 112.533 65.5492 112.533 65.8409C112.533 66.1326 112.579 66.4034 112.672 66.6534C112.765 66.9034 112.908 67.1051 113.101 67.2585C113.294 67.4119 113.54 67.4886 113.839 67.4886ZM118.124 68.1023C117.848 68.1023 117.597 68.0502 117.371 67.946C117.146 67.84 116.967 67.6875 116.835 67.4886C116.702 67.2879 116.636 67.0455 116.636 66.7614C116.636 66.5114 116.685 66.3087 116.783 66.1534C116.882 65.9962 117.013 65.8731 117.178 65.7841C117.343 65.6951 117.525 65.6288 117.724 65.5852C117.924 65.5398 118.126 65.5038 118.329 65.4773C118.594 65.4432 118.809 65.4176 118.974 65.4006C119.14 65.3816 119.262 65.3504 119.337 65.3068C119.415 65.2633 119.454 65.1875 119.454 65.0795V65.0568C119.454 64.7765 119.377 64.5587 119.224 64.4034C119.072 64.2481 118.842 64.1705 118.533 64.1705C118.213 64.1705 117.962 64.2405 117.781 64.3807C117.599 64.5208 117.471 64.6705 117.397 64.8295L116.761 64.6023C116.874 64.3371 117.026 64.1307 117.215 63.983C117.406 63.8333 117.615 63.7292 117.84 63.6705C118.067 63.6098 118.291 63.5795 118.511 63.5795C118.651 63.5795 118.812 63.5966 118.994 63.6307C119.177 63.6629 119.354 63.7301 119.525 63.8324C119.697 63.9347 119.84 64.089 119.954 64.2955C120.067 64.5019 120.124 64.7784 120.124 65.125V68H119.454V67.4091H119.42C119.374 67.5038 119.299 67.6051 119.192 67.7131C119.086 67.821 118.945 67.9129 118.769 67.9886C118.593 68.0644 118.378 68.1023 118.124 68.1023ZM118.227 67.5C118.492 67.5 118.715 67.4479 118.897 67.3438C119.081 67.2396 119.219 67.1051 119.312 66.9403C119.406 66.7756 119.454 66.6023 119.454 66.4205V65.8068C119.425 65.8409 119.363 65.8722 119.266 65.9006C119.172 65.9271 119.062 65.9508 118.937 65.9716C118.814 65.9905 118.693 66.0076 118.576 66.0227C118.46 66.036 118.367 66.0473 118.295 66.0568C118.121 66.0795 117.958 66.1165 117.806 66.1676C117.656 66.2169 117.535 66.2917 117.442 66.392C117.352 66.4905 117.306 66.625 117.306 66.7955C117.306 67.0284 117.392 67.2045 117.565 67.3239C117.739 67.4413 117.96 67.5 118.227 67.5ZM122.996 68.0909C122.632 68.0909 122.311 67.9991 122.033 67.8153C121.754 67.6297 121.536 67.3684 121.379 67.0312C121.222 66.6922 121.143 66.2917 121.143 65.8295C121.143 65.3712 121.222 64.9735 121.379 64.6364C121.536 64.2992 121.755 64.0388 122.036 63.8551C122.316 63.6714 122.64 63.5795 123.007 63.5795C123.291 63.5795 123.516 63.6269 123.68 63.7216C123.847 63.8144 123.974 63.9205 124.061 64.0398C124.15 64.1572 124.219 64.2538 124.268 64.3295H124.325V62.1818H124.996V68H124.348V67.3295H124.268C124.219 67.4091 124.149 67.5095 124.058 67.6307C123.967 67.75 123.838 67.857 123.669 67.9517C123.5 68.0445 123.276 68.0909 122.996 68.0909ZM123.087 67.4886C123.356 67.4886 123.583 67.4186 123.768 67.2784C123.954 67.1364 124.095 66.9403 124.192 66.6903C124.288 66.4384 124.337 66.1477 124.337 65.8182C124.337 65.4924 124.289 65.2074 124.195 64.9631C124.1 64.7169 123.96 64.5256 123.774 64.3892C123.589 64.2509 123.359 64.1818 123.087 64.1818C122.803 64.1818 122.566 64.2547 122.376 64.4006C122.189 64.5445 122.048 64.7405 121.953 64.9886C121.86 65.2348 121.814 65.5114 121.814 65.8182C121.814 66.1288 121.861 66.411 121.956 66.6648C122.053 66.9167 122.195 67.1174 122.382 67.267C122.571 67.4148 122.806 67.4886 123.087 67.4886ZM129.408 64.6136L128.805 64.7841C128.768 64.6837 128.712 64.5862 128.638 64.4915C128.566 64.3949 128.467 64.3153 128.342 64.2528C128.217 64.1903 128.057 64.1591 127.862 64.1591C127.595 64.1591 127.373 64.2206 127.195 64.3438C127.018 64.465 126.93 64.6193 126.93 64.8068C126.93 64.9735 126.991 65.1051 127.112 65.2017C127.233 65.2983 127.423 65.3788 127.68 65.4432L128.328 65.6023C128.718 65.697 129.009 65.8419 129.2 66.0369C129.392 66.2301 129.487 66.4792 129.487 66.7841C129.487 67.0341 129.415 67.2576 129.271 67.4545C129.129 67.6515 128.93 67.8068 128.675 67.9205C128.419 68.0341 128.122 68.0909 127.783 68.0909C127.338 68.0909 126.969 67.9943 126.678 67.8011C126.386 67.608 126.201 67.3258 126.124 66.9545L126.76 66.7955C126.821 67.0303 126.935 67.2064 127.104 67.3239C127.274 67.4413 127.497 67.5 127.771 67.5C128.084 67.5 128.332 67.4337 128.516 67.3011C128.701 67.1667 128.794 67.0057 128.794 66.8182C128.794 66.6667 128.741 66.5398 128.635 66.4375C128.529 66.3333 128.366 66.2557 128.146 66.2045L127.419 66.0341C127.019 65.9394 126.726 65.7926 126.538 65.5938C126.353 65.393 126.26 65.142 126.26 64.8409C126.26 64.5947 126.329 64.3769 126.467 64.1875C126.607 63.9981 126.798 63.8494 127.038 63.7415C127.281 63.6335 127.555 63.5795 127.862 63.5795C128.294 63.5795 128.633 63.6742 128.879 63.8636C129.127 64.053 129.304 64.303 129.408 64.6136Z" fill="black"/>
<path d="M172.705 68V62.1818H174.739C175.144 62.1818 175.478 62.2519 175.741 62.392C176.005 62.5303 176.201 62.7169 176.33 62.9517C176.458 63.1847 176.523 63.4432 176.523 63.7273C176.523 63.9773 176.478 64.1837 176.389 64.3466C176.302 64.5095 176.187 64.6383 176.043 64.733C175.901 64.8277 175.746 64.8977 175.58 64.9432V65C175.758 65.0114 175.937 65.0739 176.116 65.1875C176.296 65.3011 176.447 65.464 176.568 65.6761C176.689 65.8883 176.75 66.1477 176.75 66.4545C176.75 66.7462 176.684 67.0085 176.551 67.2415C176.419 67.4744 176.209 67.6591 175.923 67.7955C175.637 67.9318 175.265 68 174.807 68H172.705ZM173.409 67.375H174.807C175.267 67.375 175.594 67.286 175.787 67.108C175.982 66.928 176.08 66.7102 176.08 66.4545C176.08 66.2576 176.029 66.0758 175.929 65.9091C175.829 65.7405 175.686 65.6061 175.5 65.5057C175.314 65.4034 175.095 65.3523 174.841 65.3523H173.409V67.375ZM173.409 64.7386H174.716C174.928 64.7386 175.119 64.697 175.29 64.6136C175.462 64.5303 175.598 64.4129 175.699 64.2614C175.801 64.1098 175.852 63.9318 175.852 63.7273C175.852 63.4716 175.763 63.2547 175.585 63.0767C175.407 62.8968 175.125 62.8068 174.739 62.8068H173.409V64.7386ZM179.589 68.0909C179.196 68.0909 178.85 67.9972 178.553 67.8097C178.257 67.6222 178.026 67.3598 177.859 67.0227C177.695 66.6856 177.612 66.2917 177.612 65.8409C177.612 65.3864 177.695 64.9896 177.859 64.6506C178.026 64.3116 178.257 64.0483 178.553 63.8608C178.85 63.6733 179.196 63.5795 179.589 63.5795C179.983 63.5795 180.328 63.6733 180.624 63.8608C180.921 64.0483 181.152 64.3116 181.317 64.6506C181.483 64.9896 181.567 65.3864 181.567 65.8409C181.567 66.2917 181.483 66.6856 181.317 67.0227C181.152 67.3598 180.921 67.6222 180.624 67.8097C180.328 67.9972 179.983 68.0909 179.589 68.0909ZM179.589 67.4886C179.889 67.4886 180.135 67.4119 180.328 67.2585C180.521 67.1051 180.664 66.9034 180.757 66.6534C180.85 66.4034 180.896 66.1326 180.896 65.8409C180.896 65.5492 180.85 65.2775 180.757 65.0256C180.664 64.7737 180.521 64.5701 180.328 64.4148C180.135 64.2595 179.889 64.1818 179.589 64.1818C179.29 64.1818 179.044 64.2595 178.851 64.4148C178.658 64.5701 178.515 64.7737 178.422 65.0256C178.329 65.2775 178.283 65.5492 178.283 65.8409C178.283 66.1326 178.329 66.4034 178.422 66.6534C178.515 66.9034 178.658 67.1051 178.851 67.2585C179.044 67.4119 179.29 67.4886 179.589 67.4886ZM184.363 68.0909C183.969 68.0909 183.623 67.9972 183.326 67.8097C183.031 67.6222 182.799 67.3598 182.633 67.0227C182.468 66.6856 182.386 66.2917 182.386 65.8409C182.386 65.3864 182.468 64.9896 182.633 64.6506C182.799 64.3116 183.031 64.0483 183.326 63.8608C183.623 63.6733 183.969 63.5795 184.363 63.5795C184.757 63.5795 185.102 63.6733 185.397 63.8608C185.694 64.0483 185.925 64.3116 186.09 64.6506C186.257 64.9896 186.34 65.3864 186.34 65.8409C186.34 66.2917 186.257 66.6856 186.09 67.0227C185.925 67.3598 185.694 67.6222 185.397 67.8097C185.102 67.9972 184.757 68.0909 184.363 68.0909ZM184.363 67.4886C184.662 67.4886 184.908 67.4119 185.102 67.2585C185.295 67.1051 185.438 66.9034 185.531 66.6534C185.623 66.4034 185.67 66.1326 185.67 65.8409C185.67 65.5492 185.623 65.2775 185.531 65.0256C185.438 64.7737 185.295 64.5701 185.102 64.4148C184.908 64.2595 184.662 64.1818 184.363 64.1818C184.064 64.1818 183.817 64.2595 183.624 64.4148C183.431 64.5701 183.288 64.7737 183.195 65.0256C183.103 65.2775 183.056 65.5492 183.056 65.8409C183.056 66.1326 183.103 66.4034 183.195 66.6534C183.288 66.9034 183.431 67.1051 183.624 67.2585C183.817 67.4119 184.064 67.4886 184.363 67.4886ZM187.989 66.4091L187.977 65.5795H188.114L190.023 63.6364H190.852L188.818 65.6932H188.761L187.989 66.4091ZM187.364 68V62.1818H188.034V68H187.364ZM190.136 68L188.432 65.8409L188.909 65.375L190.989 68H190.136ZM191.715 68V63.6364H192.363V64.3182H192.42C192.511 64.0852 192.657 63.9044 192.86 63.7756C193.063 63.6449 193.306 63.5795 193.59 63.5795C193.878 63.5795 194.118 63.6449 194.309 63.7756C194.502 63.9044 194.653 64.0852 194.761 64.3182H194.806C194.918 64.0928 195.085 63.9138 195.309 63.7812C195.532 63.6468 195.8 63.5795 196.113 63.5795C196.503 63.5795 196.822 63.7017 197.07 63.946C197.318 64.1884 197.442 64.5663 197.442 65.0795V68H196.772V65.0795C196.772 64.7576 196.684 64.5275 196.508 64.3892C196.332 64.2509 196.124 64.1818 195.886 64.1818C195.579 64.1818 195.341 64.2746 195.173 64.4602C195.004 64.6439 194.92 64.8769 194.92 65.1591V68H194.238V65.0114C194.238 64.7633 194.157 64.5634 193.996 64.4119C193.835 64.2585 193.628 64.1818 193.374 64.1818C193.2 64.1818 193.037 64.2282 192.886 64.321C192.736 64.4138 192.615 64.5426 192.522 64.7074C192.431 64.8703 192.386 65.0587 192.386 65.2727V68H191.715ZM199.952 68.1023C199.676 68.1023 199.425 68.0502 199.2 67.946C198.974 67.84 198.795 67.6875 198.663 67.4886C198.53 67.2879 198.464 67.0455 198.464 66.7614C198.464 66.5114 198.513 66.3087 198.612 66.1534C198.71 65.9962 198.842 65.8731 199.006 65.7841C199.171 65.6951 199.353 65.6288 199.552 65.5852C199.753 65.5398 199.954 65.5038 200.157 65.4773C200.422 65.4432 200.637 65.4176 200.802 65.4006C200.969 65.3816 201.09 65.3504 201.165 65.3068C201.243 65.2633 201.282 65.1875 201.282 65.0795V65.0568C201.282 64.7765 201.205 64.5587 201.052 64.4034C200.9 64.2481 200.67 64.1705 200.362 64.1705C200.041 64.1705 199.79 64.2405 199.609 64.3807C199.427 64.5208 199.299 64.6705 199.225 64.8295L198.589 64.6023C198.702 64.3371 198.854 64.1307 199.043 63.983C199.235 63.8333 199.443 63.7292 199.668 63.6705C199.896 63.6098 200.119 63.5795 200.339 63.5795C200.479 63.5795 200.64 63.5966 200.822 63.6307C201.005 63.6629 201.183 63.7301 201.353 63.8324C201.525 63.9347 201.668 64.089 201.782 64.2955C201.896 64.5019 201.952 64.7784 201.952 65.125V68H201.282V67.4091H201.248C201.202 67.5038 201.127 67.6051 201.021 67.7131C200.915 67.821 200.773 67.9129 200.597 67.9886C200.421 68.0644 200.206 68.1023 199.952 68.1023ZM200.055 67.5C200.32 67.5 200.543 67.4479 200.725 67.3438C200.909 67.2396 201.047 67.1051 201.14 66.9403C201.235 66.7756 201.282 66.6023 201.282 66.4205V65.8068C201.254 65.8409 201.191 65.8722 201.094 65.9006C201 65.9271 200.89 65.9508 200.765 65.9716C200.642 65.9905 200.522 66.0076 200.404 66.0227C200.289 66.036 200.195 66.0473 200.123 66.0568C199.949 66.0795 199.786 66.1165 199.634 66.1676C199.485 66.2169 199.363 66.2917 199.271 66.392C199.18 66.4905 199.134 66.625 199.134 66.7955C199.134 67.0284 199.22 67.2045 199.393 67.3239C199.567 67.4413 199.788 67.5 200.055 67.5ZM203.176 68V63.6364H203.824V64.2955H203.869C203.949 64.0795 204.093 63.9044 204.301 63.7699C204.509 63.6354 204.744 63.5682 205.006 63.5682C205.055 63.5682 205.116 63.5691 205.19 63.571C205.264 63.5729 205.32 63.5758 205.358 63.5795V64.2614C205.335 64.2557 205.283 64.2472 205.202 64.2358C205.122 64.2225 205.038 64.2159 204.949 64.2159C204.737 64.2159 204.547 64.2604 204.381 64.3494C204.216 64.4366 204.085 64.5578 203.989 64.7131C203.894 64.8665 203.847 65.0417 203.847 65.2386V68H203.176ZM206.778 66.4091L206.766 65.5795H206.903L208.812 63.6364H209.641L207.607 65.6932H207.55L206.778 66.4091ZM206.153 68V62.1818H206.823V68H206.153ZM208.925 68L207.221 65.8409L207.698 65.375L209.778 68H208.925ZM213.595 64.6136L212.993 64.7841C212.955 64.6837 212.899 64.5862 212.825 64.4915C212.753 64.3949 212.655 64.3153 212.53 64.2528C212.405 64.1903 212.245 64.1591 212.05 64.1591C211.783 64.1591 211.56 64.2206 211.382 64.3438C211.206 64.465 211.118 64.6193 211.118 64.8068C211.118 64.9735 211.179 65.1051 211.3 65.2017C211.421 65.2983 211.61 65.3788 211.868 65.4432L212.516 65.6023C212.906 65.697 213.196 65.8419 213.388 66.0369C213.579 66.2301 213.675 66.4792 213.675 66.7841C213.675 67.0341 213.603 67.2576 213.459 67.4545C213.317 67.6515 213.118 67.8068 212.862 67.9205C212.607 68.0341 212.309 68.0909 211.97 68.0909C211.525 68.0909 211.157 67.9943 210.865 67.8011C210.573 67.608 210.389 67.3258 210.311 66.9545L210.947 66.7955C211.008 67.0303 211.123 67.2064 211.291 67.3239C211.462 67.4413 211.684 67.5 211.959 67.5C212.271 67.5 212.519 67.4337 212.703 67.3011C212.889 67.1667 212.982 67.0057 212.982 66.8182C212.982 66.6667 212.929 66.5398 212.822 66.4375C212.716 66.3333 212.554 66.2557 212.334 66.2045L211.607 66.0341C211.207 65.9394 210.913 65.7926 210.726 65.5938C210.54 65.393 210.447 65.142 210.447 64.8409C210.447 64.5947 210.517 64.3769 210.655 64.1875C210.795 63.9981 210.985 63.8494 211.226 63.7415C211.468 63.6335 211.743 63.5795 212.05 63.5795C212.482 63.5795 212.821 63.6742 213.067 63.8636C213.315 64.053 213.491 64.303 213.595 64.6136Z" fill="black"/>
<path d="M269.386 62.8068V62.1818H273.75V62.8068H271.92V68H271.216V62.8068H269.386ZM275.943 68.0909C275.523 68.0909 275.16 67.9981 274.855 67.8125C274.552 67.625 274.318 67.3636 274.153 67.0284C273.991 66.6913 273.909 66.2992 273.909 65.8523C273.909 65.4053 273.991 65.0114 274.153 64.6705C274.318 64.3277 274.547 64.0606 274.841 63.8693C275.136 63.6761 275.481 63.5795 275.875 63.5795C276.102 63.5795 276.327 63.6174 276.548 63.6932C276.77 63.7689 276.972 63.892 277.153 64.0625C277.335 64.2311 277.48 64.4545 277.588 64.733C277.696 65.0114 277.75 65.3542 277.75 65.7614V66.0455H274.386V65.4659H277.068C277.068 65.2197 277.019 65 276.92 64.8068C276.824 64.6136 276.686 64.4612 276.506 64.3494C276.328 64.2377 276.117 64.1818 275.875 64.1818C275.608 64.1818 275.377 64.2481 275.182 64.3807C274.989 64.5114 274.84 64.6818 274.736 64.892C274.632 65.1023 274.58 65.3277 274.58 65.5682V65.9545C274.58 66.2841 274.636 66.5634 274.75 66.7926C274.866 67.0199 275.026 67.1932 275.23 67.3125C275.435 67.4299 275.672 67.4886 275.943 67.4886C276.119 67.4886 276.278 67.464 276.42 67.4148C276.564 67.3636 276.688 67.2879 276.793 67.1875C276.897 67.0852 276.977 66.9583 277.034 66.8068L277.682 66.9886C277.614 67.2083 277.499 67.4015 277.338 67.5682C277.177 67.733 276.978 67.8617 276.741 67.9545C276.505 68.0455 276.239 68.0909 275.943 68.0909ZM281.861 64.6136L281.259 64.7841C281.221 64.6837 281.165 64.5862 281.091 64.4915C281.019 64.3949 280.92 64.3153 280.795 64.2528C280.67 64.1903 280.51 64.1591 280.315 64.1591C280.048 64.1591 279.826 64.2206 279.648 64.3438C279.472 64.465 279.384 64.6193 279.384 64.8068C279.384 64.9735 279.444 65.1051 279.565 65.2017C279.687 65.2983 279.876 65.3788 280.134 65.4432L280.781 65.6023C281.171 65.697 281.462 65.8419 281.653 66.0369C281.845 66.2301 281.94 66.4792 281.94 66.7841C281.94 67.0341 281.868 67.2576 281.724 67.4545C281.582 67.6515 281.384 67.8068 281.128 67.9205C280.872 68.0341 280.575 68.0909 280.236 68.0909C279.791 68.0909 279.422 67.9943 279.131 67.8011C278.839 67.608 278.654 67.3258 278.577 66.9545L279.213 66.7955C279.274 67.0303 279.388 67.2064 279.557 67.3239C279.727 67.4413 279.95 67.5 280.224 67.5C280.537 67.5 280.785 67.4337 280.969 67.3011C281.154 67.1667 281.247 67.0057 281.247 66.8182C281.247 66.6667 281.194 66.5398 281.088 66.4375C280.982 66.3333 280.819 66.2557 280.599 66.2045L279.872 66.0341C279.473 65.9394 279.179 65.7926 278.991 65.5938C278.806 65.393 278.713 65.142 278.713 64.8409C278.713 64.5947 278.782 64.3769 278.92 64.1875C279.061 63.9981 279.251 63.8494 279.491 63.7415C279.734 63.6335 280.009 63.5795 280.315 63.5795C280.747 63.5795 281.086 63.6742 281.332 63.8636C281.58 64.053 281.757 64.303 281.861 64.6136ZM284.847 63.6364V64.2045H282.586V63.6364H284.847ZM283.245 62.5909H283.915V66.75C283.915 66.9394 283.943 67.0814 283.998 67.1761C284.055 67.2689 284.127 67.3314 284.214 67.3636C284.303 67.3939 284.397 67.4091 284.495 67.4091C284.569 67.4091 284.629 67.4053 284.677 67.3977C284.724 67.3883 284.762 67.3807 284.79 67.375L284.927 67.9773C284.881 67.9943 284.818 68.0114 284.737 68.0284C284.655 68.0473 284.552 68.0568 284.427 68.0568C284.237 68.0568 284.052 68.0161 283.87 67.9347C283.69 67.8532 283.54 67.7292 283.421 67.5625C283.304 67.3958 283.245 67.1856 283.245 66.9318V62.5909ZM288.869 64.6136L288.266 64.7841C288.228 64.6837 288.173 64.5862 288.099 64.4915C288.027 64.3949 287.928 64.3153 287.803 64.2528C287.678 64.1903 287.518 64.1591 287.323 64.1591C287.056 64.1591 286.834 64.2206 286.656 64.3438C286.479 64.465 286.391 64.6193 286.391 64.8068C286.391 64.9735 286.452 65.1051 286.573 65.2017C286.694 65.2983 286.884 65.3788 287.141 65.4432L287.789 65.6023C288.179 65.697 288.47 65.8419 288.661 66.0369C288.853 66.2301 288.948 66.4792 288.948 66.7841C288.948 67.0341 288.876 67.2576 288.732 67.4545C288.59 67.6515 288.391 67.8068 288.136 67.9205C287.88 68.0341 287.583 68.0909 287.244 68.0909C286.799 68.0909 286.43 67.9943 286.138 67.8011C285.847 67.608 285.662 67.3258 285.585 66.9545L286.221 66.7955C286.281 67.0303 286.396 67.2064 286.565 67.3239C286.735 67.4413 286.958 67.5 287.232 67.5C287.545 67.5 287.793 67.4337 287.977 67.3011C288.162 67.1667 288.255 67.0057 288.255 66.8182C288.255 66.6667 288.202 66.5398 288.096 66.4375C287.99 66.3333 287.827 66.2557 287.607 66.2045L286.88 66.0341C286.48 65.9394 286.187 65.7926 285.999 65.5938C285.814 65.393 285.721 65.142 285.721 64.8409C285.721 64.5947 285.79 64.3769 285.928 64.1875C286.068 63.9981 286.259 63.8494 286.499 63.7415C286.742 63.6335 287.016 63.5795 287.323 63.5795C287.755 63.5795 288.094 63.6742 288.34 63.8636C288.588 64.053 288.764 64.303 288.869 64.6136Z" fill="black"/>
</svg>
