<svg width="46" height="46" viewBox="0 0 46 46" fill="none" xmlns="http://www.w3.org/2000/svg">
<path d="M36.4167 19.1666V4.83325C36.4167 4.28097 35.969 3.83325 35.4167 3.83325H10.5834C10.0311 3.83325 9.58337 4.28097 9.58337 4.83325V41.1666C9.58337 41.7189 10.0311 42.1666 10.5834 42.1666H35.4167C35.969 42.1666 36.4167 41.7189 36.4167 41.1666V33.5416" stroke="black" stroke-width="0.6" stroke-linecap="round"/>
<path d="M30.7754 29.7922L39.2851 19.2447C39.4516 19.0382 39.6934 18.9064 39.9571 18.8782L41.5724 18.7055C42.1215 18.6468 42.6143 19.0444 42.673 19.5935L42.8457 21.2088C42.8739 21.4725 42.7962 21.7367 42.6297 21.9431L34.1199 32.4906" stroke="black" stroke-width="0.6" stroke-linecap="round"/>
<path d="M30.7739 29.7922L30.4224 33.6499" stroke="black" stroke-width="0.4" stroke-linecap="round"/>
<path d="M30.4235 33.6498L34.1196 32.4906" stroke="black" stroke-width="0.6" stroke-linecap="round"/>
<path d="M38.1958 20.5945L41.5404 23.2929" stroke="black" stroke-width="0.4" stroke-linecap="round"/>
<path d="M16.2501 9.58325H13.5167C13.4615 9.58325 13.4167 9.62802 13.4167 9.68325V12.4166C13.4167 12.9689 13.8645 13.4166 14.4167 13.4166H16.2501C16.8024 13.4166 17.2501 12.9689 17.2501 12.4166V10.5833C17.2501 10.031 16.8024 9.58325 16.2501 9.58325Z" stroke="black" stroke-width="0.6" stroke-linecap="round"/>
<path d="M16.2501 17.25H13.5167C13.4615 17.25 13.4167 17.2948 13.4167 17.35V20.0833C13.4167 20.6356 13.8645 21.0833 14.4167 21.0833H16.2501C16.8024 21.0833 17.2501 20.6356 17.2501 20.0833V18.25C17.2501 17.6977 16.8024 17.25 16.2501 17.25Z" stroke="black" stroke-width="0.6" stroke-linecap="round"/>
<path d="M16.2501 24.9165H13.5167C13.4615 24.9165 13.4167 24.9613 13.4167 25.0165V27.7498C13.4167 28.3021 13.8645 28.7498 14.4167 28.7498H16.2501C16.8024 28.7498 17.2501 28.3021 17.2501 27.7498V25.9165C17.2501 25.3642 16.8024 24.9165 16.2501 24.9165Z" stroke="black" stroke-width="0.6" stroke-linecap="round"/>
<path d="M16.2501 32.5833H13.5167C13.4615 32.5833 13.4167 32.628 13.4167 32.6833V35.4166C13.4167 35.9689 13.8645 36.4166 14.4167 36.4166H16.2501C16.8024 36.4166 17.2501 35.9689 17.2501 35.4166V33.5833C17.2501 33.031 16.8024 32.5833 16.2501 32.5833Z" stroke="black" stroke-width="0.6" stroke-linecap="round"/>
<path d="M19.1667 10.5415H24.9167" stroke="black" stroke-width="0.6" stroke-linecap="round"/>
<path d="M19.1667 12.4583H28.7501" stroke="black" stroke-width="0.6" stroke-linecap="round"/>
<path d="M19.1667 18.2083H24.9167" stroke="black" stroke-width="0.6" stroke-linecap="round"/>
<path d="M19.1667 20.125H28.7501" stroke="black" stroke-width="0.6" stroke-linecap="round"/>
<path d="M19.1667 25.875H28.7501" stroke="black" stroke-width="0.6" stroke-linecap="round"/>
<path d="M19.1667 27.7915H24.9167" stroke="black" stroke-width="0.6" stroke-linecap="round"/>
<path d="M19.1667 33.5415H24.9167" stroke="black" stroke-width="0.6" stroke-linecap="round"/>
<path d="M19.1667 35.4583H28.7501" stroke="black" stroke-width="0.6" stroke-linecap="round"/>
</svg>
