<svg width="46" height="47" viewBox="0 0 46 47" fill="none" xmlns="http://www.w3.org/2000/svg">
<rect x="30.6667" y="3.91675" width="9.58333" height="39.1667" rx="0.5" stroke="white" stroke-width="0.6"/>
<rect x="3.83337" y="23.5" width="9.58333" height="19.5833" rx="0.5" stroke="white" stroke-width="0.6"/>
<rect x="17.25" y="13.7085" width="9.58333" height="29.375" rx="0.5" stroke="white" stroke-width="0.6"/>
<line x1="17.25" y1="21.2417" x2="26.8333" y2="21.2417" stroke="white" stroke-width="0.6"/>
<line x1="3.83337" y1="27.1167" x2="13.4167" y2="27.1167" stroke="white" stroke-width="0.6"/>
<line x1="30.6667" y1="7.5335" x2="40.2501" y2="7.5335" stroke="white" stroke-width="0.6"/>
<line x1="30.6667" y1="38.8667" x2="40.2501" y2="38.8667" stroke="white" stroke-width="0.6"/>
<line x1="17.25" y1="23.2" x2="26.8333" y2="23.2" stroke="white" stroke-width="0.6"/>
<line x1="3.83337" y1="40.825" x2="13.4167" y2="40.825" stroke="white" stroke-width="0.6"/>
<line x1="30.6667" y1="9.49175" x2="40.2501" y2="9.49175" stroke="white" stroke-width="0.6"/>
<line x1="30.6667" y1="40.825" x2="40.2501" y2="40.825" stroke="white" stroke-width="0.6"/>
<line x1="17.25" y1="17.325" x2="26.8333" y2="17.325" stroke="white" stroke-width="0.6"/>
<rect x="19.1667" y="37.2085" width="5.75" height="3.91667" rx="0.1" stroke="white" stroke-width="0.6"/>
</svg>
