<svg width="46" height="46" viewBox="0 0 46 46" fill="none" xmlns="http://www.w3.org/2000/svg">
<circle cx="13.4166" cy="26.8333" r="3.33333" stroke="white"/>
<path d="M5.75 38.3333C6.06944 36.4166 7.28333 32.5833 9.58333 32.5833C11.8833 32.5833 15.6528 32.5833 17.25 32.5833C18.2083 32.5833 20.3167 33.7333 21.0833 38.3333" stroke="white" stroke-linecap="round"/>
<circle cx="32.5833" cy="26.8333" r="3.33333" stroke="white"/>
<path d="M24.9167 38.3333C25.2362 36.4166 26.4501 32.5833 28.7501 32.5833C31.0501 32.5833 34.8195 32.5833 36.4167 32.5833C37.3751 32.5833 39.4834 33.7333 40.2501 38.3333" stroke="white" stroke-linecap="round"/>
<circle cx="23.0001" cy="22.9998" r="3.33333" stroke="white"/>
<path d="M5.75 32.5833V10.5833C5.75 10.031 6.19772 9.58325 6.75 9.58325H39.25C39.8023 9.58325 40.25 10.031 40.25 10.5833V32.5833" stroke="white" stroke-linecap="round"/>
<path d="M36.4167 36.4165H28.75" stroke="white" stroke-linecap="round"/>
<path d="M17.2499 36.4165H9.58325" stroke="white" stroke-linecap="round"/>
<path d="M17.25 30.6667C17.5238 30.0278 18.4 28.75 19.7143 28.75C21.0286 28.75 24.6429 28.75 26.2857 28.75C26.8333 28.75 28.0929 29.1333 28.75 30.6667" stroke="white" stroke-linecap="round"/>
</svg>
