<svg width="44" height="44" viewBox="0 0 44 44" fill="none" xmlns="http://www.w3.org/2000/svg">
<path d="M16.4278 20.8491C16.2911 21.0034 16.184 21.1854 16.1126 21.3846C15.9625 21.7798 15.9625 22.223 16.1126 22.6181C16.184 22.8173 16.2911 22.9994 16.4278 23.1537L20.9306 28.0227C21.2132 28.3283 21.5966 28.5 21.9963 28.5C22.396 28.5 22.7793 28.3283 23.0619 28.0227C23.3446 27.7171 23.5033 27.3026 23.5033 26.8704C23.5033 26.4382 23.3446 26.0237 23.0619 25.718L21.1107 23.6244L26.4991 23.6244C26.8971 23.6244 27.2789 23.4534 27.5604 23.149C27.8419 22.8446 28 22.4318 28 22.0014C28 21.5709 27.8419 21.1581 27.5604 20.8538C27.2789 20.5494 26.8971 20.3784 26.4991 20.3784L21.1107 20.3784L23.0619 18.2847C23.2026 18.1339 23.3143 17.9543 23.3905 17.7566C23.4667 17.5588 23.5059 17.3467 23.5059 17.1324C23.5059 16.9181 23.4667 16.706 23.3905 16.5082C23.3143 16.3105 23.2026 16.131 23.0619 15.9801C22.9224 15.828 22.7564 15.7072 22.5735 15.6248C22.3906 15.5424 22.1944 15.5 21.9963 15.5C21.7981 15.5 21.6019 15.5424 21.419 15.6248C21.2361 15.7072 21.0701 15.828 20.9306 15.9801L16.4278 20.8491Z" fill="#C0DDFE"/>
<rect x="1" y="43" width="42" height="42" rx="4" transform="rotate(-90 1 43)" stroke="#C0DDFE" stroke-width="2" stroke-linejoin="round"/>
</svg>
