<svg width="46" height="47" viewBox="0 0 46 47" fill="none" xmlns="http://www.w3.org/2000/svg">
<path d="M34.5 22.5209V4.91675C34.5 4.36446 34.0522 3.91675 33.5 3.91675H8.66663C8.11434 3.91675 7.66663 4.36446 7.66663 4.91675V42.0834C7.66663 42.6357 8.11434 43.0834 8.66663 43.0834H33.5C34.0522 43.0834 34.5 42.6357 34.5 42.0834V32.3126" stroke="white" stroke-width="0.6" stroke-linecap="round"/>
<rect x="17.25" y="7.8335" width="11.5" height="7.83333" rx="0.5" stroke="white" stroke-width="0.6"/>
<path d="M28.75 39.1667V33.2917C28.75 31.3334 29.9 27.4167 34.5 27.4167C39.1 27.4167 40.25 31.3334 40.25 33.2917V39.1667" stroke="white" stroke-width="0.6" stroke-linecap="round"/>
<path d="M40.25 33.2917C40.8889 33.2917 42.1667 33.6834 42.1667 35.2501C42.1667 36.2764 42.1667 37.3588 42.1667 38.1668C42.1667 38.7191 41.719 39.1667 41.1667 39.1667H40.25" stroke="white" stroke-width="0.6" stroke-linecap="round"/>
<path d="M28.75 33.2917C28.1111 33.2917 26.8333 33.6834 26.8333 35.2501C26.8333 36.2764 26.8333 37.3588 26.8333 38.1668C26.8333 38.7191 27.281 39.1667 27.8333 39.1667H28.75" stroke="white" stroke-width="0.6" stroke-linecap="round"/>
<line x1="11.8" y1="3.91675" x2="11.8" y2="43.0834" stroke="white" stroke-width="0.6"/>
</svg>
