<svg width="45" height="47" viewBox="0 0 45 47" fill="none" xmlns="http://www.w3.org/2000/svg">
<path fill-rule="evenodd" clip-rule="evenodd" d="M35.6246 27.2168C35.7351 27.2168 35.8246 27.3063 35.8247 27.4167L35.826 31.1335H39.3747C39.4851 31.1335 39.5747 31.223 39.5747 31.3335C39.5747 31.4439 39.4851 31.5335 39.3747 31.5335H35.6261H35.4262L35.4261 31.3335L35.4247 27.4169C35.4246 27.3064 35.5142 27.2168 35.6246 27.2168Z" fill="black"/>
<path d="M35.8247 27.4167L36.0247 27.4167V27.4167L35.8247 27.4167ZM35.6246 27.2168L35.6247 27.4168L35.6246 27.2168ZM35.826 31.1335L35.626 31.1335C35.6261 31.244 35.7156 31.3335 35.826 31.3335V31.1335ZM35.4262 31.5335L35.2262 31.5335C35.2262 31.644 35.3157 31.7335 35.4262 31.7335V31.5335ZM35.4261 31.3335L35.2261 31.3336L35.4261 31.3335ZM35.4247 27.4169L35.6247 27.4168V27.4168L35.4247 27.4169ZM36.0247 27.4167C36.0246 27.1957 35.8455 27.0167 35.6245 27.0168L35.6247 27.4168L36.0247 27.4167ZM36.026 31.1334L36.0247 27.4167L35.6247 27.4168L35.626 31.1335L36.026 31.1334ZM39.3747 30.9335H35.826V31.3335H39.3747V30.9335ZM39.7747 31.3335C39.7747 31.1126 39.5956 30.9335 39.3747 30.9335V31.3335H39.7747ZM39.3747 31.7335C39.5956 31.7335 39.7747 31.5544 39.7747 31.3335H39.3747V31.7335ZM35.6261 31.7335H39.3747V31.3335H35.6261V31.7335ZM35.4262 31.7335H35.6261V31.3335H35.4262V31.7335ZM35.2261 31.3336L35.2262 31.5335L35.6262 31.5334L35.6261 31.3335L35.2261 31.3336ZM35.2247 27.4169L35.2261 31.3336L35.6261 31.3335L35.6247 27.4168L35.2247 27.4169ZM35.6245 27.0168C35.4036 27.0169 35.2246 27.196 35.2247 27.4169L35.6247 27.4168V27.4168L35.6245 27.0168Z" fill="black"/>
<rect x="18.75" y="7.8335" width="11.25" height="7.83333" rx="0.5" stroke="black" stroke-width="0.6"/>
<ellipse cx="35.625" cy="31.3335" rx="5.625" ry="5.875" stroke="black" stroke-width="0.6"/>
<path d="M35.625 22.5209V4.91675C35.625 4.36446 35.1773 3.91675 34.625 3.91675H10.375C9.82272 3.91675 9.375 4.36446 9.375 4.91675V42.0834C9.375 42.6357 9.82272 43.0834 10.375 43.0834H34.625C35.1773 43.0834 35.625 42.6357 35.625 42.0834V40.1459" stroke="black" stroke-width="0.6" stroke-linecap="round"/>
<line x1="13.425" y1="3.91675" x2="13.425" y2="43.0834" stroke="black" stroke-width="0.6"/>
</svg>
