<svg width="11" height="14" viewBox="0 0 11 14" fill="none" xmlns="http://www.w3.org/2000/svg">
<path d="M0.916666 11V13H10.0833V11H11V13C11 13.2652 10.9034 13.5196 10.7315 13.7071C10.5596 13.8946 10.3264 14 10.0833 14H0.916666C0.673552 14 0.440393 13.8946 0.268485 13.7071C0.0965767 13.5196 0 13.2652 0 13V11H0.916666ZM0.916666 6L1.56292 5.295L5.04167 9.085V0H5.95833V9.085L9.43708 5.295L10.0833 6L5.5 11L0.916666 6Z" fill="white"/>
</svg>
