<svg width="14" height="14" viewBox="0 0 14 14" fill="none" xmlns="http://www.w3.org/2000/svg">
<path d="M0.879883 13.44C0.879883 13.7497 1.1001 14 1.37268 14H12.7071C12.9797 14 13.1999 13.7497 13.1999 13.44V6.09H0.879883V13.44ZM12.7071 1.26H10.1199V0.14C10.1199 0.063 10.0644 0 9.99668 0H9.13428C9.06652 0 9.01108 0.063 9.01108 0.14V1.26H5.06868V0.14C5.06868 0.063 5.01324 0 4.94548 0H4.08308C4.01532 0 3.95988 0.063 3.95988 0.14V1.26H1.37268C1.1001 1.26 0.879883 1.51025 0.879883 1.82V4.9H13.1999V1.82C13.1999 1.51025 12.9797 1.26 12.7071 1.26Z" fill="#D46B2B"/>
</svg>
