<svg width="42" height="48" viewBox="0 0 42 48" fill="none" xmlns="http://www.w3.org/2000/svg">
<path d="M40.5 21.4019C42.5 22.5566 42.5 25.4434 40.5 26.5981L4.5 47.3827C2.5 48.5374 1.49388e-06 47.094 1.59483e-06 44.7846L3.41188e-06 3.21539C3.51283e-06 0.905985 2.5 -0.537388 4.5 0.617313L40.5 21.4019Z" fill="white"/>
</svg>
