<svg width="46" height="47" viewBox="0 0 46 47" fill="none" xmlns="http://www.w3.org/2000/svg">
<rect x="30.6665" y="3.91675" width="9.58333" height="39.1667" rx="0.5" stroke="black"/>
<rect x="3.83325" y="23.5" width="9.58333" height="19.5833" rx="0.5" stroke="black"/>
<rect x="17.25" y="13.7085" width="9.58333" height="29.375" rx="0.5" stroke="black"/>
<line x1="17.25" y1="21.0417" x2="26.8333" y2="21.0417" stroke="black"/>
<line x1="3.83325" y1="26.9167" x2="13.4166" y2="26.9167" stroke="black"/>
<line x1="30.6665" y1="7.3335" x2="40.2498" y2="7.3335" stroke="black"/>
<line x1="30.6665" y1="38.6667" x2="40.2498" y2="38.6667" stroke="black"/>
<line x1="17.25" y1="23" x2="26.8333" y2="23" stroke="black"/>
<line x1="3.83325" y1="40.625" x2="13.4166" y2="40.625" stroke="black"/>
<line x1="30.6665" y1="9.29175" x2="40.2498" y2="9.29175" stroke="black"/>
<line x1="30.6665" y1="40.625" x2="40.2498" y2="40.625" stroke="black"/>
<line x1="17.25" y1="17.125" x2="26.8333" y2="17.125" stroke="black"/>
<rect x="19.1665" y="37.2085" width="5.75" height="3.91667" rx="0.1" stroke="black"/>
</svg>
