<svg width="97" height="74" viewBox="0 0 97 74" fill="none" xmlns="http://www.w3.org/2000/svg">
<path d="M1.45957 47.2253C1.47249 47.1811 1.49899 47.1421 1.53531 47.1137C1.57163 47.0854 1.61593 47.0693 1.66195 47.0675H1.84033C1.88038 47.0675 1.91956 47.0792 1.95307 47.1011C1.98658 47.123 2.01297 47.1543 2.02899 47.191L4.24834 53.3654H4.30322L6.48483 47.191C6.50238 47.154 6.53008 47.1228 6.56469 47.1009C6.59931 47.079 6.63942 47.0675 6.68036 47.0675H6.85873C6.90475 47.0693 6.94906 47.0854 6.98538 47.1137C7.0217 47.1421 7.04819 47.1811 7.06111 47.2253L8.50524 54.7478C8.53611 54.9021 8.47093 55.0153 8.30285 55.0153H7.85349C7.80836 55.0119 7.76527 54.9951 7.72981 54.9669C7.69435 54.9388 7.66813 54.9007 7.65454 54.8575L6.65634 49.0948H6.61176L4.55363 55.005C4.53462 55.0401 4.50704 55.0699 4.47346 55.0915C4.43987 55.1131 4.40137 55.1258 4.36154 55.1285H4.15915C4.11983 55.1256 4.0819 55.1127 4.04891 55.0911C4.01591 55.0695 3.98894 55.0399 3.97049 55.005L1.87806 49.0948H1.83346L0.859283 54.8575C0.846364 54.9017 0.819872 54.9408 0.783551 54.9691C0.747231 54.9974 0.702923 55.0136 0.656902 55.0153H0.210973C0.0428925 55.0153 -0.0257106 54.9021 0.00859158 54.7478L1.45957 47.2253Z" fill="#111827"/>
<path d="M15.3588 47.0675C16.4278 47.0675 17.4529 47.4922 18.2088 48.248C18.9647 49.0039 19.3893 50.0291 19.3893 51.098C19.3893 52.167 18.9647 53.1921 18.2088 53.948C17.4529 54.7039 16.4278 55.1285 15.3588 55.1285C14.83 55.1317 14.3058 55.0299 13.8166 54.829C13.3274 54.6281 12.8829 54.3321 12.509 53.9581C12.135 53.5842 11.839 53.1397 11.6381 52.6505C11.4372 52.1613 11.3354 51.6371 11.3386 51.1083C11.335 50.5784 11.4363 50.053 11.6368 49.5624C11.8373 49.0719 12.133 48.6259 12.5067 48.2502C12.8805 47.8746 13.325 47.5766 13.8145 47.3736C14.304 47.1706 14.8289 47.0666 15.3588 47.0675ZM15.3588 54.343C16.0023 54.345 16.6319 54.1559 17.1677 53.7996C17.7036 53.4433 18.1215 52.9358 18.3686 52.3417C18.6156 51.7475 18.6806 51.0933 18.5553 50.4621C18.43 49.8309 18.1201 49.2512 17.6648 48.7964C17.2096 48.3416 16.6295 48.0323 15.9982 47.9077C15.3669 47.7831 14.7128 47.8488 14.1188 48.0964C13.5249 48.3441 13.0179 48.7626 12.6622 49.2988C12.3064 49.835 12.118 50.4648 12.1207 51.1083C12.1261 51.9651 12.4691 52.7853 13.0753 53.3908C13.6815 53.9964 14.502 54.3385 15.3588 54.343Z" fill="#111827"/>
<path d="M22.8024 47.4105C22.8042 47.3547 22.8271 47.3016 22.8666 47.2621C22.9061 47.2226 22.9592 47.1996 23.0151 47.1979H23.4507C23.5071 47.1979 23.5612 47.2203 23.6011 47.2602C23.641 47.3001 23.6634 47.3541 23.6634 47.4105V50.6761H28.2085V47.4105C28.2085 47.3541 28.2309 47.3001 28.2707 47.2602C28.3106 47.2203 28.3647 47.1979 28.4211 47.1979H28.8568C28.9126 47.1996 28.9657 47.2226 29.0052 47.2621C29.0448 47.3016 29.0677 47.3547 29.0694 47.4105V54.8198C29.0677 54.8757 29.0448 54.9288 29.0052 54.9683C28.9657 55.0078 28.9126 55.0308 28.8568 55.0325H28.4211C28.3647 55.0325 28.3106 55.0101 28.2707 54.9702C28.2309 54.9303 28.2085 54.8762 28.2085 54.8198V51.4102H23.6463V54.8027C23.6463 54.8591 23.6239 54.9132 23.584 54.953C23.5441 54.9929 23.49 55.0153 23.4336 55.0153H22.998C22.9421 55.0136 22.889 54.9907 22.8495 54.9511C22.81 54.9116 22.787 54.8585 22.7853 54.8027L22.8024 47.4105Z" fill="#111827"/>
<path d="M31.9472 54.7238L35.35 47.1774C35.3655 47.1395 35.3922 47.1074 35.4266 47.0853C35.4609 47.0632 35.5013 47.0522 35.5421 47.0539H35.6519C35.6927 47.0522 35.733 47.0632 35.7674 47.0853C35.8018 47.1074 35.8285 47.1395 35.844 47.1774L39.2227 54.7238C39.2405 54.755 39.2494 54.7904 39.2484 54.8262C39.2474 54.862 39.2366 54.8969 39.2171 54.927C39.1976 54.9571 39.1702 54.9813 39.138 54.9969C39.1057 55.0124 39.0697 55.0189 39.0341 55.0154H38.5813C38.5412 55.0154 38.502 55.0037 38.4685 54.9818C38.435 54.9599 38.4086 54.9286 38.3926 54.8919L37.5522 53.0465H33.5937L32.7773 54.8919C32.7607 54.9289 32.7337 54.9602 32.6996 54.9822C32.6655 55.0041 32.6258 55.0156 32.5853 55.0154H32.1393C32.1037 55.0183 32.068 55.0116 32.0359 54.996C32.0038 54.9804 31.9765 54.9564 31.9568 54.9266C31.9372 54.8968 31.9259 54.8622 31.9242 54.8265C31.9225 54.7908 31.9305 54.7554 31.9472 54.7238ZM37.2641 52.3501C36.7152 51.1324 36.1801 49.9009 35.6313 48.6798H35.5421L33.9059 52.3501H37.2641Z" fill="#111827"/>
<path d="M43.0134 47.2253C43.0263 47.1811 43.0528 47.1421 43.0892 47.1137C43.1255 47.0854 43.1698 47.0693 43.2158 47.0675H43.3839C43.4242 47.0681 43.4636 47.08 43.4976 47.1018C43.5315 47.1236 43.5587 47.1545 43.576 47.191L45.7919 53.3654H45.8468L48.0284 47.191C48.0457 47.1545 48.0728 47.1236 48.1068 47.1018C48.1407 47.08 48.1801 47.0681 48.2205 47.0675H48.3989C48.4449 47.0693 48.4892 47.0854 48.5255 47.1137C48.5618 47.1421 48.5883 47.1811 48.6012 47.2253L50.0454 54.7478C50.0797 54.9021 50.0111 55.0153 49.843 55.0153H49.397C49.3513 55.0126 49.3075 54.996 49.2713 54.9679C49.2352 54.9397 49.2085 54.9012 49.1947 54.8575L48.1965 49.0948H48.1519L46.0938 55.005C46.0747 55.0401 46.0472 55.0699 46.0136 55.0915C45.98 55.1131 45.9415 55.1258 45.9017 55.1285H45.7027C45.6629 55.1258 45.6244 55.1131 45.5908 55.0915C45.5572 55.0699 45.5296 55.0401 45.5106 55.005L43.4388 49.0948H43.3839L42.4097 54.8575C42.3973 54.902 42.3709 54.9413 42.3345 54.9697C42.298 54.9981 42.2535 55.0141 42.2073 55.0153H41.7614C41.5933 55.0153 41.5247 54.9021 41.559 54.7478L43.0134 47.2253Z" fill="#111827"/>
<path d="M54.3605 47.2253C54.3723 47.1811 54.398 47.1419 54.4339 47.1134C54.4697 47.085 54.5138 47.0689 54.5595 47.0675H54.7379C54.7782 47.0681 54.8176 47.08 54.8515 47.1018C54.8855 47.1236 54.9127 47.1545 54.93 47.191L57.1459 53.3654H57.2008L59.3858 47.191C59.4018 47.1543 59.4282 47.123 59.4617 47.1011C59.4952 47.0792 59.5344 47.0675 59.5745 47.0675H59.7528C59.799 47.0687 59.8436 47.0847 59.88 47.1131C59.9164 47.1415 59.9428 47.1808 59.9552 47.2253L61.3993 54.7478C61.4336 54.9021 61.365 55.0153 61.197 55.0153H60.751C60.7056 55.0117 60.6622 54.9948 60.6262 54.9668C60.5902 54.9387 60.5633 54.9007 60.5487 54.8575L59.5539 49.0948H59.5059L57.4477 55.005C57.4295 55.0401 57.4026 55.0699 57.3696 55.0915C57.3365 55.1131 57.2985 55.1259 57.2591 55.1285H57.0567C57.0168 55.1258 56.9784 55.1131 56.9448 55.0915C56.9112 55.0699 56.8836 55.0401 56.8646 55.005L54.7722 49.0948H54.7276L53.7568 54.8575C53.7434 54.9015 53.7168 54.9402 53.6806 54.9685C53.6444 54.9967 53.6003 55.0131 53.5544 55.0153H53.1051C52.937 55.0153 52.8718 54.9021 52.9061 54.7478L54.3605 47.2253Z" fill="#111827"/>
<path d="M64.7985 47.4105C64.7985 47.3541 64.8209 47.3001 64.8608 47.2602C64.9006 47.2203 64.9547 47.1979 65.0111 47.1979H69.4224C69.4788 47.1979 69.5329 47.2203 69.5728 47.2602C69.6127 47.3001 69.6351 47.3541 69.6351 47.4105V47.733C69.6351 47.7609 69.6296 47.7886 69.6189 47.8144C69.6082 47.8402 69.5925 47.8636 69.5728 47.8834C69.553 47.9031 69.5296 47.9188 69.5038 47.9295C69.478 47.9402 69.4503 47.9457 69.4224 47.9457H65.6492V50.6898H68.8633C68.9189 50.6923 68.9715 50.7156 69.0109 50.7549C69.0502 50.7943 69.0734 50.8469 69.0759 50.9025V51.1838C69.0759 51.2402 69.0535 51.2943 69.0137 51.3342C68.9738 51.3741 68.9197 51.3965 68.8633 51.3965H65.6492V54.271H69.4224C69.4788 54.271 69.5329 54.2934 69.5728 54.3333C69.6127 54.3732 69.6351 54.4272 69.6351 54.4837V54.8095C69.6351 54.8659 69.6127 54.92 69.5728 54.9599C69.5329 54.9998 69.4788 55.0222 69.4224 55.0222H65.0111C64.9547 55.0222 64.9006 54.9998 64.8608 54.9599C64.8209 54.92 64.7985 54.8659 64.7985 54.8095V47.4105Z" fill="#111827"/>
<path d="M73.1098 47.4105C73.1089 47.3556 73.1296 47.3026 73.1675 47.2628C73.2053 47.223 73.2573 47.1997 73.3122 47.1979H75.8197C76.8586 47.1979 77.855 47.6106 78.5897 48.3452C79.3243 49.0799 79.737 50.0762 79.737 51.1152C79.737 52.1541 79.3243 53.1505 78.5897 53.8851C77.855 54.6198 76.8586 55.0325 75.8197 55.0325H73.3122C73.2576 55.0298 73.2061 55.0063 73.1684 54.9667C73.1308 54.9271 73.1098 54.8745 73.1098 54.8198V47.4105ZM75.6413 54.271C76.0607 54.2878 76.4791 54.2178 76.8702 54.0653C77.2612 53.9128 77.6165 53.6811 77.9138 53.3848C78.2111 53.0884 78.4439 52.7339 78.5977 52.3433C78.7515 51.9528 78.8229 51.5346 78.8074 51.1152C78.826 50.693 78.7564 50.2715 78.603 49.8777C78.4497 49.4839 78.216 49.1263 77.9169 48.8278C77.6177 48.5293 77.2597 48.2964 76.8655 48.1439C76.4714 47.9915 76.0498 47.9228 75.6276 47.9422H73.9468V54.2435L75.6413 54.271Z" fill="#111827"/>
<path d="M84.7247 47.4688C84.7089 47.4374 84.7016 47.4023 84.7037 47.3671C84.7058 47.332 84.7172 47.298 84.7368 47.2687C84.7563 47.2394 84.7833 47.2158 84.8149 47.2004C84.8465 47.1849 84.8817 47.1781 84.9168 47.1807H85.3628C85.4034 47.18 85.4433 47.1913 85.4775 47.2133C85.5117 47.2353 85.5386 47.2669 85.5549 47.3041L88.3402 53.5849H88.3848L91.1735 47.3041C91.1903 47.2679 91.2168 47.2372 91.2502 47.2153C91.2835 47.1935 91.3223 47.1815 91.3622 47.1807H91.8116C91.8468 47.1776 91.8821 47.1842 91.9139 47.1996C91.9457 47.215 91.9727 47.2388 91.992 47.2683C92.0114 47.2979 92.0223 47.3321 92.0238 47.3674C92.0252 47.4027 92.0171 47.4378 92.0002 47.4688L88.5975 55.0153C88.5804 55.0512 88.5538 55.0818 88.5205 55.1036C88.4872 55.1254 88.4486 55.1375 88.4088 55.1388H88.2956C88.2561 55.1365 88.2179 55.1238 88.1848 55.1022C88.1517 55.0805 88.1249 55.0505 88.1069 55.0153L84.7247 47.4688Z" fill="#111827"/>
<path d="M95.1317 47.4105C95.1334 47.3547 95.1563 47.3016 95.1959 47.2621C95.2354 47.2226 95.2885 47.1996 95.3443 47.1979H95.7903C95.8461 47.1996 95.8992 47.2226 95.9387 47.2621C95.9783 47.3016 96.0012 47.3547 96.0029 47.4105V54.8198C96.0012 54.8757 95.9783 54.9288 95.9387 54.9683C95.8992 55.0078 95.8461 55.0308 95.7903 55.0325H95.3443C95.2885 55.0308 95.2354 55.0078 95.1959 54.9683C95.1563 54.9288 95.1334 54.8757 95.1317 54.8198V47.4105Z" fill="#111827"/>
<path d="M0.451121 57.9208C0.451121 57.8926 0.462327 57.8655 0.482269 57.8456C0.502211 57.8257 0.529255 57.8145 0.557457 57.8145H1.79576C1.96501 57.8056 2.13429 57.8312 2.2933 57.8899C2.4523 57.9486 2.5977 58.039 2.72064 58.1556C2.84358 58.2723 2.94148 58.4127 3.00838 58.5684C3.07529 58.7242 3.10979 58.8919 3.10979 59.0613C3.10979 59.2308 3.07529 59.3985 3.00838 59.5542C2.94148 59.7099 2.84358 59.8504 2.72064 59.9671C2.5977 60.0837 2.4523 60.1741 2.2933 60.2328C2.13429 60.2914 1.96501 60.3171 1.79576 60.3082H0.873041V61.6254C0.872181 61.6534 0.860699 61.6799 0.840941 61.6997C0.821182 61.7194 0.79463 61.7309 0.7667 61.7318H0.554029C0.525826 61.7318 0.498778 61.7206 0.478836 61.7006C0.458894 61.6807 0.447693 61.6536 0.447693 61.6254L0.451121 57.9208ZM1.76832 59.8966C1.99425 59.8948 2.21026 59.8035 2.36906 59.6428C2.52786 59.4821 2.6165 59.265 2.61559 59.039C2.61248 58.9309 2.5881 58.8245 2.54383 58.7258C2.49956 58.6271 2.43627 58.5381 2.35758 58.4638C2.2789 58.3896 2.18636 58.3316 2.08525 58.2932C1.98414 58.2547 1.87644 58.2366 1.76832 58.2398H0.87647V59.8966H1.76832Z" fill="#111827"/>
<path d="M11.3659 57.7597C11.7643 57.7583 12.1542 57.8751 12.4861 58.0954C12.8181 58.3157 13.0772 58.6295 13.2308 58.9971C13.3843 59.3647 13.4254 59.7696 13.3487 60.1605C13.2721 60.5515 13.0812 60.9109 12.8002 61.1933C12.5192 61.4757 12.1608 61.6685 11.7702 61.7471C11.3797 61.8257 10.9746 61.7868 10.6062 61.6351C10.2378 61.4834 9.92272 61.2259 9.70076 60.8951C9.47879 60.5642 9.35995 60.175 9.35926 59.7766C9.35836 59.5124 9.40958 59.2505 9.50998 59.0061C9.61037 58.7616 9.75799 58.5394 9.94437 58.352C10.1308 58.1647 10.3522 58.016 10.5962 57.9143C10.8401 57.8127 11.1017 57.7601 11.3659 57.7597ZM11.3659 61.3957C11.688 61.4004 12.0041 61.3093 12.2742 61.1338C12.5442 60.9582 12.7559 60.7063 12.8823 60.4101C13.0087 60.1139 13.044 59.7868 12.9839 59.4704C12.9238 59.154 12.7708 58.8626 12.5445 58.6335C12.3183 58.4043 12.0289 58.2476 11.7133 58.1834C11.3977 58.1192 11.0702 58.1504 10.7723 58.273C10.4745 58.3956 10.2199 58.6041 10.041 58.8718C9.86203 59.1396 9.76682 59.4546 9.76746 59.7766C9.7692 60.2019 9.93752 60.6096 10.2363 60.9123C10.5352 61.215 10.9407 61.3885 11.3659 61.3957Z" fill="#111827"/>
<path d="M20.0925 57.9208C20.0925 57.8926 20.1037 57.8655 20.1237 57.8456C20.1436 57.8257 20.1707 57.8145 20.1989 57.8145H20.4184C20.4461 57.8161 20.4722 57.8278 20.4918 57.8474C20.5114 57.867 20.5231 57.8931 20.5247 57.9208V61.351H22.1369C22.1651 61.351 22.1922 61.3622 22.2121 61.3821C22.2321 61.4021 22.2433 61.4291 22.2433 61.4573V61.622C22.2433 61.6502 22.2321 61.6772 22.2121 61.6972C22.1922 61.7171 22.1651 61.7283 22.1369 61.7283H20.1989C20.1707 61.7283 20.1436 61.7171 20.1237 61.6972C20.1037 61.6772 20.0925 61.6502 20.0925 61.622V57.9208Z" fill="#111827"/>
<path d="M29.1894 59.8452L27.8413 57.9757C27.8304 57.9599 27.8242 57.9414 27.8232 57.9223C27.8223 57.9032 27.8267 57.8842 27.836 57.8675C27.8452 57.8507 27.859 57.8369 27.8757 57.8275C27.8924 57.8182 27.9114 57.8136 27.9305 57.8145H28.1946C28.2124 57.8159 28.2296 57.8212 28.245 57.8301C28.2604 57.839 28.2737 57.8513 28.2838 57.8659L29.4123 59.4164L30.5443 57.8556C30.5544 57.841 30.5677 57.8288 30.5831 57.8199C30.5985 57.811 30.6157 57.8056 30.6335 57.8042H30.8976C30.9167 57.8033 30.9357 57.8079 30.9524 57.8172C30.9691 57.8266 30.9829 57.8404 30.9921 57.8572C31.0014 57.8739 31.0058 57.8929 31.0049 57.912C31.0039 57.9312 30.9977 57.9496 30.9868 57.9654L29.6147 59.828V61.6151C29.6131 61.6428 29.6014 61.6689 29.5818 61.6885C29.5622 61.7081 29.5361 61.7198 29.5084 61.7215H29.2889C29.2607 61.7215 29.2336 61.7103 29.2137 61.6903C29.1937 61.6704 29.1825 61.6433 29.1825 61.6151L29.1894 59.8452Z" fill="#111827"/>
<path d="M38.1698 58.1883H37.2094C37.1812 58.1883 37.1541 58.1771 37.1342 58.1572C37.1142 58.1373 37.103 58.1102 37.103 58.082V57.9208C37.103 57.8926 37.1142 57.8655 37.1342 57.8456C37.1541 57.8257 37.1812 57.8145 37.2094 57.8145H39.5831C39.6113 57.8145 39.6383 57.8257 39.6583 57.8456C39.6782 57.8655 39.6894 57.8926 39.6894 57.9208V58.082C39.6894 58.1102 39.6782 58.1373 39.6583 58.1572C39.6383 58.1771 39.6113 58.1883 39.5831 58.1883H38.5814V61.6186C38.5798 61.6462 38.5681 61.6723 38.5485 61.6919C38.5289 61.7115 38.5028 61.7233 38.4751 61.7249H38.2624C38.2348 61.7233 38.2087 61.7115 38.1891 61.6919C38.1695 61.6723 38.1577 61.6462 38.1561 61.6186L38.1698 58.1883Z" fill="#111827"/>
<path d="M46.1449 57.9208C46.1449 57.8926 46.1561 57.8655 46.1761 57.8456C46.196 57.8257 46.223 57.8145 46.2512 57.8145H48.4569C48.4708 57.8145 48.4847 57.8172 48.4976 57.8225C48.5105 57.8279 48.5222 57.8357 48.5321 57.8456C48.5419 57.8555 48.5498 57.8672 48.5551 57.8801C48.5605 57.893 48.5632 57.9068 48.5632 57.9208V58.082C48.5632 58.096 48.5605 58.1098 48.5551 58.1227C48.5498 58.1356 48.5419 58.1473 48.5321 58.1572C48.5222 58.1671 48.5105 58.1749 48.4976 58.1803C48.4847 58.1856 48.4708 58.1883 48.4569 58.1883H46.5771V59.5604H48.1859C48.2135 59.5621 48.2397 59.5738 48.2593 59.5934C48.2789 59.613 48.2906 59.6391 48.2922 59.6668V59.8314C48.2913 59.859 48.2797 59.8852 48.2599 59.9044C48.24 59.9236 48.2135 59.9343 48.1859 59.9343H46.5805V61.3613H48.4603C48.4743 61.3613 48.4881 61.364 48.501 61.3694C48.5139 61.3747 48.5256 61.3826 48.5355 61.3924C48.5454 61.4023 48.5532 61.414 48.5585 61.4269C48.5639 61.4398 48.5666 61.4537 48.5666 61.4676V61.6323C48.5666 61.6462 48.5639 61.6601 48.5585 61.673C48.5532 61.6859 48.5454 61.6976 48.5355 61.7075C48.5256 61.7173 48.5139 61.7252 48.501 61.7305C48.4881 61.7359 48.4743 61.7386 48.4603 61.7386H46.2547C46.2407 61.7386 46.2269 61.7359 46.214 61.7305C46.2011 61.7252 46.1893 61.7173 46.1795 61.7075C46.1696 61.6976 46.1618 61.6859 46.1564 61.673C46.1511 61.6601 46.1483 61.6462 46.1483 61.6323L46.1449 57.9208Z" fill="#111827"/>
<path d="M57.0324 57.7595C57.5334 57.7541 58.0177 57.9393 58.3874 58.2775C58.398 58.2877 58.4064 58.3 58.4121 58.3135C58.4179 58.3271 58.4208 58.3416 58.4208 58.3564C58.4208 58.3711 58.4179 58.3857 58.4121 58.3992C58.4064 58.4128 58.398 58.425 58.3874 58.4353L58.233 58.5862C58.1884 58.6411 58.1438 58.6376 58.0889 58.5862C57.7918 58.3285 57.4152 58.1808 57.0222 58.1677C56.5955 58.1677 56.1863 58.3372 55.8846 58.6389C55.5829 58.9406 55.4134 59.3498 55.4134 59.7765C55.4134 60.2032 55.5829 60.6123 55.8846 60.9141C56.1863 61.2158 56.5955 61.3853 57.0222 61.3853C57.4167 61.3795 57.7958 61.2308 58.0889 60.9668C58.1076 60.9508 58.1313 60.9421 58.1558 60.9421C58.1804 60.9421 58.2041 60.9508 58.2227 60.9668L58.3908 61.1177C58.4008 61.1276 58.4087 61.1393 58.4141 61.1523C58.4195 61.1652 58.4222 61.1791 58.4222 61.1932C58.4222 61.2072 58.4195 61.2211 58.4141 61.234C58.4087 61.247 58.4008 61.2587 58.3908 61.2686C58.023 61.6234 57.5297 61.8183 57.0187 61.8106C56.4847 61.8106 55.9725 61.5985 55.5949 61.2208C55.2173 60.8432 55.0052 60.3311 55.0052 59.7971C55.0052 59.263 55.2173 58.7509 55.5949 58.3733C55.9725 57.9957 56.4847 57.7835 57.0187 57.7835L57.0324 57.7595Z" fill="#111827"/>
<path d="M65.1108 57.9208C65.1124 57.8931 65.1241 57.867 65.1437 57.8474C65.1633 57.8278 65.1894 57.8161 65.2171 57.8145H65.4367C65.4649 57.8145 65.4919 57.8257 65.5118 57.8456C65.5318 57.8655 65.543 57.8926 65.543 57.9208V59.5536H67.8138V57.9208C67.8138 57.8926 67.825 57.8655 67.8449 57.8456C67.8649 57.8257 67.8919 57.8145 67.9201 57.8145H68.1397C68.1673 57.8161 68.1934 57.8278 68.213 57.8474C68.2326 57.867 68.2444 57.8931 68.246 57.9208V61.6254C68.2444 61.6531 68.2326 61.6792 68.213 61.6988C68.1934 61.7184 68.1673 61.7301 68.1397 61.7318H67.9201C67.8919 61.7318 67.8649 61.7206 67.8449 61.7006C67.825 61.6807 67.8138 61.6536 67.8138 61.6254V59.9275H65.543V61.6254C65.543 61.6536 65.5318 61.6807 65.5118 61.7006C65.4919 61.7206 65.4649 61.7318 65.4367 61.7318H65.2171C65.1894 61.7301 65.1633 61.7184 65.1437 61.6988C65.1241 61.6792 65.1124 61.6531 65.1108 61.6254V57.9208Z" fill="#111827"/>
<path d="M75.2435 57.8591C75.244 57.8455 75.2471 57.8322 75.2527 57.8199C75.2582 57.8076 75.2662 57.7965 75.2761 57.7873C75.286 57.778 75.2976 57.7708 75.3102 57.7661C75.3229 57.7613 75.3364 57.7591 75.3499 57.7596H75.4905L78.0289 60.9017V57.9208C78.0289 57.8926 78.0401 57.8656 78.06 57.8456C78.0799 57.8257 78.107 57.8145 78.1352 57.8145H78.3342C78.3618 57.8161 78.3879 57.8278 78.4075 57.8474C78.4271 57.867 78.4389 57.8931 78.4405 57.9208V61.694C78.4387 61.721 78.4268 61.7464 78.407 61.7648C78.3873 61.7833 78.3612 61.7936 78.3342 61.7935H78.2312L75.6654 58.5863V61.6323C75.6654 61.6463 75.6627 61.6601 75.6573 61.673C75.652 61.6859 75.6442 61.6976 75.6343 61.7075C75.6244 61.7174 75.6127 61.7252 75.5998 61.7305C75.5869 61.7359 75.5731 61.7386 75.5591 61.7386H75.3636C75.3357 61.7378 75.3091 61.7263 75.2893 61.7065C75.2696 61.6868 75.2581 61.6602 75.2573 61.6323L75.2435 57.8591Z" fill="#111827"/>
<path d="M85.4312 57.9208C85.4321 57.8929 85.4436 57.8663 85.4633 57.8466C85.4831 57.8268 85.5096 57.8153 85.5376 57.8145H85.7605C85.7882 57.8161 85.8143 57.8278 85.8339 57.8474C85.8535 57.867 85.8652 57.8931 85.8669 57.9208V61.6254C85.8652 61.6531 85.8535 61.6792 85.8339 61.6988C85.8143 61.7184 85.7882 61.7301 85.7605 61.7318H85.5376C85.5096 61.7309 85.4831 61.7194 85.4633 61.6997C85.4436 61.6799 85.4321 61.6534 85.4312 61.6254V57.9208Z" fill="#111827"/>
<path d="M94.6003 57.7595C95.1001 57.755 95.583 57.9401 95.9518 58.2774C95.9623 58.2877 95.9708 58.2999 95.9765 58.3135C95.9823 58.327 95.9852 58.3416 95.9852 58.3563C95.9852 58.3711 95.9823 58.3856 95.9765 58.3992C95.9708 58.4127 95.9623 58.425 95.9518 58.4352L95.8008 58.5862C95.7562 58.641 95.7116 58.6376 95.6533 58.5862C95.3573 58.3268 94.98 58.1788 94.5865 58.1677C94.1599 58.1677 93.7507 58.3372 93.449 58.6389C93.1473 58.9406 92.9778 59.3498 92.9778 59.7764C92.9778 60.2031 93.1473 60.6123 93.449 60.914C93.7507 61.2157 94.1599 61.3852 94.5865 61.3852C94.9812 61.3801 95.3605 61.2313 95.6533 60.9667C95.6725 60.9505 95.6968 60.9416 95.7219 60.9416C95.747 60.9416 95.7714 60.9505 95.7905 60.9667L95.9586 61.1177C96.0032 61.152 95.9895 61.2274 95.9586 61.2686C95.5912 61.624 95.0977 61.819 94.5865 61.8106C94.0525 61.8106 93.5404 61.5984 93.1628 61.2208C92.7851 60.8432 92.573 60.3311 92.573 59.797C92.573 59.263 92.7851 58.7509 93.1628 58.3732C93.5404 57.9956 94.0525 57.7835 94.5865 57.7835L94.6003 57.7595Z" fill="#111827"/>
<path d="M0.0258179 65.2991C0.0283298 65.2435 0.0515407 65.1909 0.0908933 65.1515C0.130246 65.1122 0.182893 65.0889 0.238489 65.0864H0.663838C0.720242 65.0864 0.774335 65.1088 0.814219 65.1487C0.854103 65.1886 0.87651 65.2427 0.87651 65.2991V69.9676C0.87651 71.2437 1.67232 72.2419 2.98266 72.2419C4.293 72.2419 5.10939 71.2677 5.10939 69.9916V65.2991C5.10939 65.2427 5.1318 65.1886 5.17168 65.1487C5.21157 65.1088 5.26566 65.0864 5.32206 65.0864H5.74741C5.80301 65.0889 5.85566 65.1122 5.89501 65.1515C5.93436 65.1909 5.95757 65.2435 5.96008 65.2991V70.0499C5.96008 70.8369 5.64748 71.5916 5.09103 72.148C4.53459 72.7045 3.77988 73.0171 2.99295 73.0171C2.20602 73.0171 1.45132 72.7045 0.894871 72.148C0.338425 71.5916 0.0258179 70.8369 0.0258179 70.0499V65.2991Z" fill="#111827"/>
<path d="M12.0107 65.1792C12.0125 65.1243 12.0358 65.0723 12.0756 65.0345C12.1154 64.9966 12.1685 64.9759 12.2234 64.9768H12.5116L17.5608 71.2679H17.5814V65.2993C17.5814 65.2429 17.6038 65.1888 17.6437 65.1489C17.6836 65.109 17.7377 65.0866 17.7941 65.0866H18.1886C18.2442 65.0891 18.2968 65.1123 18.3362 65.1517C18.3755 65.191 18.3987 65.2437 18.4012 65.2993V72.8457C18.3977 72.8997 18.3738 72.9504 18.3343 72.9873C18.2948 73.0243 18.2427 73.0448 18.1886 73.0447H17.9862L12.8546 66.6199V72.712C12.8546 72.7684 12.8322 72.8225 12.7923 72.8624C12.7524 72.9022 12.6983 72.9246 12.6419 72.9246H12.2509C12.195 72.9229 12.1419 72.9 12.1024 72.8604C12.0629 72.8209 12.0399 72.7678 12.0382 72.712L12.0107 65.1792Z" fill="#111827"/>
<path d="M24.5416 65.2991C24.5433 65.2432 24.5663 65.1901 24.6058 65.1506C24.6453 65.1111 24.6984 65.0881 24.7543 65.0864H25.2037C25.2595 65.0881 25.3126 65.1111 25.3521 65.1506C25.3917 65.1901 25.4146 65.2432 25.4163 65.2991V72.7118C25.4146 72.7677 25.3917 72.8208 25.3521 72.8603C25.3126 72.8998 25.2595 72.9227 25.2037 72.9245H24.7577C24.7019 72.9227 24.6488 72.8998 24.6093 72.8603C24.5697 72.8208 24.5468 72.7677 24.5451 72.7118L24.5416 65.2991Z" fill="#111827"/>
<path d="M30.4999 65.3781C30.4831 65.3465 30.4752 65.311 30.4768 65.2754C30.4785 65.2397 30.4898 65.2051 30.5094 65.1753C30.5291 65.1455 30.5564 65.1215 30.5885 65.1059C30.6206 65.0902 30.6564 65.0835 30.6919 65.0865H31.1379C31.1784 65.0862 31.2182 65.0978 31.2523 65.1197C31.2864 65.1416 31.3133 65.173 31.33 65.21L34.1222 71.4804H34.1668L36.9555 65.21C36.9726 65.174 36.9992 65.1435 37.0325 65.1217C37.0658 65.0999 37.1044 65.0877 37.1442 65.0865H37.5935C37.6292 65.083 37.6652 65.0894 37.6974 65.105C37.7297 65.1206 37.7571 65.1448 37.7766 65.1749C37.796 65.205 37.8069 65.2398 37.8079 65.2757C37.8089 65.3115 37.8 65.3469 37.7822 65.3781L34.3794 72.9245C34.3634 72.9612 34.337 72.9925 34.3035 73.0144C34.27 73.0363 34.2308 73.048 34.1908 73.048H34.0776C34.038 73.0461 33.9996 73.0336 33.9665 73.0119C33.9333 72.9902 33.9065 72.96 33.8889 72.9245L30.4999 65.3781Z" fill="#111827"/>
<path d="M42.8621 65.2991C42.8621 65.2427 42.8845 65.1886 42.9243 65.1487C42.9642 65.1088 43.0183 65.0864 43.0747 65.0864H47.4997C47.5561 65.0864 47.6102 65.1088 47.6501 65.1487C47.69 65.1886 47.7124 65.2427 47.7124 65.2991V65.6421C47.7124 65.6985 47.69 65.7526 47.6501 65.7925C47.6102 65.8324 47.5561 65.8548 47.4997 65.8548H43.7265V68.599H46.9371C46.993 68.6007 47.0461 68.6236 47.0856 68.6632C47.1251 68.7027 47.1481 68.7558 47.1498 68.8116V69.1547C47.1498 69.2111 47.1274 69.2652 47.0875 69.305C47.0476 69.3449 46.9936 69.3673 46.9371 69.3673H43.7265V72.2213H47.4997C47.5276 72.2213 47.5553 72.2268 47.5811 72.2375C47.6069 72.2482 47.6303 72.2638 47.6501 72.2836C47.6698 72.3033 47.6855 72.3268 47.6962 72.3526C47.7069 72.3784 47.7124 72.406 47.7124 72.4339V72.777C47.7124 72.8334 47.69 72.8875 47.6501 72.9274C47.6102 72.9672 47.5561 72.9896 47.4997 72.9896H43.0747C43.0183 72.9896 42.9642 72.9672 42.9243 72.9274C42.8845 72.8875 42.8621 72.8334 42.8621 72.777V65.2991Z" fill="#111827"/>
<path d="M53.3588 65.2992C53.3588 65.2427 53.3812 65.1887 53.4211 65.1488C53.4609 65.1089 53.515 65.0865 53.5714 65.0865H56.47C56.7885 65.0815 57.1048 65.1399 57.4004 65.2583C57.6961 65.3767 57.9653 65.5528 58.1923 65.7763C58.4193 65.9997 58.5995 66.2661 58.7225 66.5599C58.8456 66.8538 58.9089 67.1691 58.9089 67.4876C58.8946 67.9905 58.7288 68.4773 58.4332 68.8843C58.1375 69.2914 57.7259 69.5996 57.2521 69.7687L58.7854 72.6124C58.806 72.6452 58.8173 72.683 58.8181 72.7218C58.8188 72.7605 58.8089 72.7988 58.7895 72.8323C58.7701 72.8659 58.7418 72.8935 58.7079 72.9121C58.6739 72.9308 58.6354 72.9398 58.5967 72.9382H58.0239C57.9875 72.9394 57.9515 72.9304 57.92 72.9122C57.8885 72.894 57.8627 72.8674 57.8455 72.8353L56.3568 69.8716H54.2198V72.7256C54.218 72.7814 54.1951 72.8345 54.1556 72.874C54.116 72.9136 54.0629 72.9365 54.0071 72.9382H53.5714C53.5435 72.9382 53.5159 72.9327 53.4901 72.9221C53.4643 72.9114 53.4408 72.8957 53.4211 72.8759C53.4013 72.8562 53.3856 72.8328 53.375 72.807C53.3643 72.7812 53.3588 72.7535 53.3588 72.7256V65.2992ZM56.4185 69.117C56.8443 69.117 57.2526 68.9478 57.5537 68.6468C57.8547 68.3457 58.0239 67.9374 58.0239 67.5116C58.0239 67.0859 57.8547 66.6776 57.5537 66.3765C57.2526 66.0754 56.8443 65.9063 56.4185 65.9063H54.2472V69.117H56.4185Z" fill="#111827"/>
<path d="M64.1197 71.7651C64.178 71.6965 64.2329 71.6211 64.2877 71.5525C64.4009 71.4084 64.5244 71.3192 64.6788 71.453C64.7577 71.5182 65.5741 72.3037 66.5723 72.3037C67.4778 72.3037 68.0713 71.7308 68.0713 71.0722C68.0713 70.3004 67.3852 69.8408 66.1126 69.3022C64.8812 68.7671 64.1437 68.2732 64.1437 66.9869C64.1437 66.2253 64.7474 64.9939 66.5448 64.9939C67.2233 65.0028 67.8859 65.1999 68.4589 65.5633C68.4909 65.5817 68.5185 65.6069 68.5396 65.6371C68.5608 65.6674 68.575 65.7019 68.5812 65.7383C68.5874 65.7747 68.5855 65.812 68.5757 65.8476C68.5658 65.8832 68.5482 65.9161 68.5241 65.9441C68.4795 66.0127 68.4349 66.0916 68.3903 66.1567C68.3753 66.1929 68.3522 66.2252 68.3227 66.2509C68.2932 66.2767 68.2582 66.2953 68.2203 66.3052C68.1824 66.3152 68.1428 66.3163 68.1044 66.3084C68.0661 66.3005 68.0301 66.2838 67.9992 66.2596C67.5614 65.9659 67.0563 65.7877 66.5311 65.7417C65.3477 65.7417 64.9875 66.5032 64.9875 66.9731C64.9875 67.7243 65.5603 68.16 66.5002 68.5545C68.0095 69.1685 68.9837 69.7379 68.9837 71.0379C68.9837 72.2008 67.8757 73.0515 66.5654 73.0515C65.6959 73.041 64.8588 72.7198 64.2054 72.1459C64.1713 72.1299 64.1413 72.1063 64.1177 72.077C64.0941 72.0476 64.0775 72.0133 64.0693 71.9765C64.061 71.9398 64.0612 71.9016 64.07 71.865C64.0787 71.8284 64.0957 71.7942 64.1197 71.7651Z" fill="#111827"/>
<path d="M74.458 65.2991C74.4597 65.2432 74.4827 65.1901 74.5222 65.1506C74.5617 65.1111 74.6148 65.0881 74.6707 65.0864H75.1166C75.1725 65.0881 75.2256 65.1111 75.2651 65.1506C75.3046 65.1901 75.3276 65.2432 75.3293 65.2991V72.7118C75.3276 72.7677 75.3046 72.8208 75.2651 72.8603C75.2256 72.8998 75.1725 72.9227 75.1166 72.9245H74.6707C74.6148 72.9227 74.5617 72.8998 74.5222 72.8603C74.4827 72.8208 74.4597 72.7677 74.458 72.7118V65.2991Z" fill="#111827"/>
<path d="M82.5878 65.8377H80.6429C80.5865 65.8377 80.5324 65.8153 80.4925 65.7754C80.4526 65.7355 80.4302 65.6814 80.4302 65.625V65.282C80.4302 65.2256 80.4526 65.1715 80.4925 65.1316C80.5324 65.0917 80.5865 65.0693 80.6429 65.0693H85.3869C85.4433 65.0693 85.4974 65.0917 85.5373 65.1316C85.5772 65.1715 85.5996 65.2256 85.5996 65.282V65.625C85.5996 65.6814 85.5772 65.7355 85.5373 65.7754C85.4974 65.8153 85.4433 65.8377 85.3869 65.8377H83.4385V72.6981C83.4368 72.754 83.4139 72.8071 83.3743 72.8466C83.3348 72.8861 83.2817 72.9091 83.2259 72.9108H82.8005C82.7449 72.9083 82.6923 72.8851 82.6529 72.8457C82.6136 72.8064 82.5904 72.7537 82.5878 72.6981V65.8377Z" fill="#111827"/>
<path d="M92.6452 69.1513L89.9491 65.4123C89.9277 65.3805 89.9155 65.3434 89.9137 65.3052C89.912 65.2669 89.9208 65.2288 89.9392 65.1952C89.9576 65.1616 89.9849 65.1337 90.0181 65.1145C90.0513 65.0953 90.0891 65.0856 90.1274 65.0865H90.6523C90.6882 65.0895 90.723 65.1003 90.7544 65.1181C90.7858 65.1358 90.813 65.1602 90.8341 65.1894L93.0946 68.3109L95.3551 65.1894C95.3755 65.1602 95.402 65.1359 95.4329 65.1182C95.4637 65.1004 95.498 65.0896 95.5335 65.0865H96.0617C96.1 65.0856 96.1379 65.0953 96.1711 65.1145C96.2042 65.1337 96.2315 65.1616 96.2499 65.1952C96.2683 65.2288 96.2772 65.2669 96.2754 65.3052C96.2737 65.3434 96.2615 65.3805 96.2401 65.4123L93.4959 69.141V72.7118C93.4934 72.7674 93.4702 72.8201 93.4308 72.8594C93.3915 72.8988 93.3388 72.922 93.2832 72.9245H92.8442C92.7878 72.9245 92.7337 72.9021 92.6938 72.8622C92.6539 72.8223 92.6315 72.7683 92.6315 72.7118L92.6452 69.1513Z" fill="#111827"/>
<path d="M12.561 1.06934C11.0056 1.12335 9.45559 1.22596 7.90018 1.37178C6.95687 0.974304 5.98797 0.640512 5 0.372649C6.62021 0.199826 8.24043 0.0756099 9.86064 0C10.7734 0.340245 11.6591 0.675089 12.561 1.06934Z" fill="#111827"/>
<path d="M19.5817 1.38258C18.2532 1.23676 16.9354 1.13415 15.6068 1.08014C14.7427 0.675089 13.8894 0.313241 13.0037 0C14.3808 0 15.7526 0.108014 17.119 0.259234C17.9885 0.572475 18.7932 0.966727 19.5817 1.38258Z" fill="#111827"/>
<path d="M25.6842 2.57606C24.5447 2.26282 23.3943 2.03599 22.2386 1.78215C21.4702 1.35025 20.6787 0.960817 19.8677 0.615601C21.0666 0.83703 22.2494 1.08006 23.4213 1.3933C24.1964 1.74658 24.9518 2.14141 25.6842 2.57606Z" fill="#111827"/>
<path d="M17.0492 3.60751C15.5856 3.60751 14.1274 3.73173 12.6692 3.85595C11.7133 3.26727 10.7358 2.7164 9.73126 2.23573C11.2489 2.10072 12.7611 1.9981 14.2841 1.9657C15.231 2.46616 16.1527 3.01344 17.0492 3.60751Z" fill="#111827"/>
<path d="M23.7025 3.95319C22.4495 3.80737 21.202 3.70476 19.922 3.63995C19.0795 3.04047 18.1884 2.5004 17.2864 1.96033C18.588 2.02514 19.8734 2.12775 21.1695 2.27357C22.0337 2.80284 22.8762 3.36991 23.7025 3.95319Z" fill="#111827"/>
<path d="M29.4763 5.1144C28.3961 4.81736 27.316 4.57433 26.198 4.3475C25.3933 3.77503 24.5778 3.21875 23.7515 2.68408C24.8911 2.89471 26.0198 3.16475 27.127 3.47799C27.9263 4.00726 28.704 4.55273 29.4763 5.1144Z" fill="#111827"/>
<path d="M34.6283 6.91821C33.6561 6.51496 32.675 6.14231 31.6849 5.80027C30.9288 5.2602 30.1781 4.72012 29.4004 4.18005C30.4211 4.5311 31.4311 4.92535 32.4194 5.34661C33.1701 5.85967 33.9046 6.37814 34.6283 6.91821Z" fill="#111827"/>
<path d="M21.6504 6.97221C20.275 7.01181 18.9014 7.10182 17.5296 7.24224C16.5413 6.49694 15.5476 5.77325 14.5322 5.08196C15.958 4.95774 17.3838 4.85513 18.815 4.82812C19.7763 5.51402 20.716 6.23771 21.6504 6.97221Z" fill="#111827"/>
<path d="M27.9367 7.23147C26.7539 7.10186 25.5658 7.02625 24.3776 6.97764C23.4865 6.24854 22.5684 5.53565 21.6395 4.84436C22.8708 4.90917 24.0968 5.00638 25.3173 5.1468C26.2031 5.82369 27.0762 6.51858 27.9367 7.23147Z" fill="#111827"/>
<path d="M33.4398 8.25238C32.4083 7.98235 31.3605 7.75552 30.3074 7.57189C29.4757 6.8806 28.6278 6.19471 27.7637 5.52502C28.8438 5.73025 29.924 5.97688 31.0041 6.26492C31.8142 6.91841 32.6297 7.57729 33.4398 8.25238Z" fill="#111827"/>
<path d="M38.3921 9.84558C37.4524 9.48554 36.5055 9.15609 35.5514 8.85725C34.7629 8.21997 33.9635 7.57728 33.1534 6.9292C34.131 7.25324 35.1031 7.61509 36.059 8.00934C36.8637 8.61422 37.6144 9.2245 38.3921 9.84558Z" fill="#111827"/>
<path d="M43.0373 11.8382C42.1444 11.4278 41.2443 11.0263 40.337 10.6339C39.5647 10.0614 38.8248 9.4511 38.0525 8.86243C38.9742 9.28368 39.8743 9.72114 40.7528 10.1748C41.5269 10.7257 42.2884 11.2801 43.0373 11.8382Z" fill="#111827"/>
<path d="M26.3923 10.9795C25.0907 11.0605 23.8 11.1848 22.5038 11.336C21.4885 10.4611 20.4677 9.59695 19.4308 8.74904C20.7702 8.60322 22.1311 8.5006 23.4651 8.4574C24.4426 9.28911 25.4202 10.1262 26.3923 10.9795Z" fill="#111827"/>
<path d="M32.349 11.0389C31.2256 10.9525 30.1005 10.9093 28.9735 10.9093C28.0338 10.0776 27.0869 9.25487 26.1328 8.44116C27.2993 8.48437 28.4659 8.53837 29.6216 8.65719C30.5343 9.44029 31.4633 10.2396 32.349 11.0389Z" fill="#111827"/>
<path d="M37.6147 11.7897C36.6264 11.5899 35.6219 11.4116 34.6174 11.282C33.7316 10.5043 32.8459 9.72662 31.9494 8.95972C32.9827 9.12534 34.0071 9.33237 35.0224 9.5808C35.8919 10.3153 36.7506 11.0552 37.6147 11.7897Z" fill="#111827"/>
<path d="M42.4056 13.0588C41.4929 12.7834 40.5802 12.5188 39.6567 12.2703L37.1075 10.1425C38.0527 10.4341 38.9816 10.7419 39.9105 11.0606C40.7476 11.7357 41.5739 12.4 42.4056 13.0588Z" fill="#111827"/>
<path d="M46.9529 14.6737C46.078 14.3389 45.2031 14.0202 44.3173 13.7016C43.4964 13.0751 42.6971 12.4378 41.8546 11.8005C42.7475 12.1606 43.6333 12.535 44.5118 12.9239C45.3273 13.5126 46.1374 14.0958 46.9529 14.6737Z" fill="#111827"/>
<path d="M51.479 16.4505L48.8327 15.4028C48.019 14.8627 47.2088 14.3227 46.4023 13.7826L49.0649 14.9924" fill="#111827"/>
<path d="M31.301 15.4622C30.0733 15.6026 28.8473 15.7718 27.6231 15.9698C26.5826 14.9977 25.5313 14.0364 24.4691 13.0859C25.7275 12.9184 26.9912 12.778 28.2496 12.6754C29.2829 13.5899 30.3001 14.5189 31.301 15.4622Z" fill="#111827"/>
<path d="M36.9779 15.1921C35.8978 15.1921 34.8177 15.1921 33.7375 15.2515C32.7546 14.3514 31.7699 13.4513 30.7833 12.5511C31.8635 12.5511 32.9922 12.5511 34.094 12.616L36.9779 15.1921Z" fill="#111827"/>
<path d="M42.0493 15.5647C41.0825 15.4513 40.1212 15.3541 39.1491 15.2785L36.3245 12.7996C37.3183 12.9238 38.2958 13.0696 39.2787 13.2316C40.1896 13.9985 41.1132 14.7762 42.0493 15.5647Z" fill="#111827"/>
<path d="M46.7204 16.3912C45.8292 16.1914 44.9327 16.0186 44.02 15.8511C43.1091 15.131 42.209 14.3929 41.3196 13.6368C42.2378 13.8529 43.1451 14.0905 44.02 14.3389C44.9219 15.0356 45.8184 15.7215 46.7204 16.3912Z" fill="#111827"/>
<path d="M51.2033 17.4981C50.3392 17.2641 49.4715 17.0409 48.6001 16.8284C47.7036 16.202 46.8143 15.5665 45.9322 14.922C46.8125 15.1974 47.682 15.4891 48.5569 15.7861C49.4318 16.3694 50.3122 16.9473 51.2033 17.4981Z" fill="#111827"/>
<path d="M55.7183 18.7025C54.838 18.4703 53.9523 18.2327 53.072 17.9896C52.1755 17.482 51.2951 16.9527 50.4202 16.4072L53.0666 17.3524C53.9469 17.8222 54.8272 18.2759 55.7183 18.7025Z" fill="#111827"/>
<path d="M36.4213 20.1823C35.2493 20.3929 34.0882 20.6468 32.9324 20.9114L29.6542 17.8384C30.8531 17.617 32.0467 17.4117 33.2564 17.2551C34.3114 18.2201 35.3663 19.1958 36.4213 20.1823Z" fill="#111827"/>
<path d="M41.8597 19.4966C40.8228 19.5722 39.7859 19.6802 38.7597 19.8206C37.7228 18.8881 36.6895 17.9484 35.6597 17.0015C36.7183 16.9151 37.775 16.8629 38.8299 16.8448C39.8399 17.736 40.839 18.6217 41.8597 19.4966Z" fill="#111827"/>
<path d="M46.7798 19.3724C45.8346 19.3724 44.9003 19.3724 43.9606 19.3724C42.9561 18.5334 41.9605 17.6927 40.974 16.8502C41.9299 16.888 42.8859 16.9474 43.8364 17.023C44.8085 17.8223 45.7896 18.6055 46.7798 19.3724Z" fill="#111827"/>
<path d="M51.3759 19.6425C50.4902 19.5596 49.6045 19.4948 48.7187 19.448C47.7358 18.7279 46.7637 17.9988 45.8024 17.2607C46.6989 17.3724 47.599 17.5074 48.5027 17.6658C49.4316 18.3463 50.393 19.0052 51.3759 19.6425Z" fill="#111827"/>
<path d="M55.848 20.1392L53.2449 19.8314C52.2619 19.2481 51.3006 18.6432 50.3501 18.0167C51.2196 18.1895 52.0891 18.3678 52.9532 18.5568C53.9038 19.1113 54.8687 19.6387 55.848 20.1392Z" fill="#111827"/>
<path d="M60.3953 20.69L57.722 20.3714C56.7444 19.9285 55.7723 19.4587 54.8218 18.9564C55.7021 19.1562 56.5878 19.3453 57.4735 19.5289C58.4295 19.9502 59.4124 20.3228 60.3953 20.69Z" fill="#111827"/>
<path d="M65.2124 21.1276C64.2619 21.0628 63.3113 20.9872 62.3608 20.8953C61.3671 20.6091 60.3895 20.2797 59.4174 19.9232C60.3571 20.1032 61.2987 20.2707 62.242 20.4255C63.2249 20.6955 64.2132 20.9332 65.2124 21.1276Z" fill="#111827"/>
<path d="M41.7788 25.0106C40.6554 25.3185 39.5483 25.6641 38.4411 26.026C37.3034 24.9854 36.1692 23.9377 35.0387 22.8828C36.1728 22.5803 37.307 22.2941 38.4627 22.0457C39.5645 23.0232 40.6446 24.0277 41.7788 25.0106Z" fill="#111827"/>
<path d="M47.023 23.7738C46.0184 23.9683 45.0193 24.1843 44.0256 24.4219C42.9238 23.5002 41.8437 22.5623 40.7852 21.6081C41.8005 21.4281 42.8194 21.2805 43.842 21.1653C44.8735 22.0456 45.9428 22.9205 47.023 23.7738Z" fill="#111827"/>
<path d="M51.8457 23.023C50.9167 23.1311 49.9932 23.2607 49.0751 23.4011C47.9949 22.6018 46.9364 21.7827 45.8995 20.9438C46.8284 20.8844 47.7627 20.8303 48.6916 20.8033C49.734 21.5756 50.7817 22.3155 51.8457 23.023Z" fill="#111827"/>
<path d="M56.4203 22.6344C55.5346 22.6938 54.6543 22.7586 53.7739 22.8396C52.6938 22.1771 51.6461 21.4948 50.6307 20.7927C51.5111 20.7927 52.3968 20.7927 53.2771 20.8413C54.314 21.457 55.3618 22.0547 56.4203 22.6344Z" fill="#111827"/>
<path d="M60.9352 22.402L58.2996 22.5262C57.2195 22.0294 56.1825 21.4893 55.151 20.906C56.0205 20.9492 56.89 21.0032 57.7595 21.0572C58.8073 21.5487 59.8604 21.9969 60.9352 22.402Z" fill="#111827"/>
<path d="M65.5689 22.1698L62.8416 22.3157C61.7614 21.9772 60.6957 21.5992 59.6443 21.1815L62.3447 21.3273C63.3978 21.6514 64.478 21.943 65.5689 22.1698Z" fill="#111827"/>
<path d="M70.5053 21.7702C69.5332 21.862 68.5503 21.9538 67.5782 22.0294C66.498 21.8728 65.3909 21.6622 64.3107 21.4083C65.2721 21.4353 66.2334 21.4515 67.1893 21.4569C68.2911 21.6136 69.3928 21.7162 70.5053 21.7702Z" fill="#111827"/>
<path d="M47.4011 29.7415C46.3209 30.179 45.2408 30.638 44.193 31.1079C43.0013 30.089 41.8185 29.0556 40.6448 28.0079C41.7249 27.5974 42.8051 27.214 43.923 26.8575C45.0716 27.8297 46.2309 28.791 47.4011 29.7415Z" fill="#111827"/>
<path d="M52.5262 27.8406C51.5433 28.17 50.5604 28.5211 49.5937 28.8883C48.4217 28.0026 47.2822 27.0953 46.148 26.1879C47.1255 25.9017 48.1193 25.6479 49.113 25.394C50.2309 26.2258 51.3651 27.0467 52.5262 27.8406Z" fill="#111827"/>
<path d="M57.2952 26.377L54.5408 27.1872C53.3887 26.4671 52.2545 25.711 51.1384 24.9189C52.0601 24.7244 52.9818 24.5444 53.9035 24.3788C55.0233 25.0701 56.1538 25.7362 57.2952 26.377Z" fill="#111827"/>
<path d="M61.9074 25.1834C61.0055 25.3995 60.1198 25.6209 59.207 25.8531C58.0567 25.2806 56.9279 24.6812 55.81 24.0547C56.6903 23.9197 57.5814 23.7955 58.4617 23.6766C59.6175 24.2113 60.7462 24.719 61.9074 25.1834Z" fill="#111827"/>
<path d="M66.5083 24.1033L63.808 24.7298C62.645 24.3374 61.4983 23.9089 60.3677 23.4444L63.0249 23.1366C64.1752 23.5092 65.3364 23.8171 66.5083 24.1033Z" fill="#111827"/>
<path d="M71.2832 22.9691L68.4694 23.6496C67.2866 23.439 66.1093 23.2068 64.9481 22.9097C65.8716 22.8017 66.7898 22.6829 67.7079 22.5641C68.896 22.7585 70.0896 22.8773 71.2832 22.9691Z" fill="#111827"/>
<path d="M76.3921 21.6244C75.3876 21.9124 74.3777 22.1861 73.3623 22.4453C72.1526 22.4453 70.9428 22.3967 69.7385 22.2887L72.7035 21.8188C73.9402 21.7918 75.1662 21.7324 76.3921 21.6244Z" fill="#111827"/>
<path d="M53.4227 34.2459C52.3749 34.8346 51.338 35.4394 50.3065 36.0443C49.0499 35.083 47.8095 34.1019 46.5854 33.1009C47.6655 32.5609 48.6917 32.0586 49.7556 31.5671C50.9546 32.4799 52.1805 33.3764 53.4227 34.2459Z" fill="#111827"/>
<path d="M58.4667 31.5616C57.4946 32.0531 56.5225 32.5553 55.5666 33.0738C54.3316 32.2709 53.1128 31.441 51.9103 30.5841C52.8788 30.1556 53.8509 29.7488 54.8267 29.3635C56.0202 30.1358 57.23 30.8649 58.4667 31.5616Z" fill="#111827"/>
<path d="M63.2574 29.2394C62.3285 29.6715 61.4104 30.1144 60.4815 30.5626C59.2501 29.9433 58.0386 29.2844 56.8468 28.586C57.7649 28.2475 58.6848 27.9127 59.6066 27.5814C60.8019 28.1827 62.0189 28.7354 63.2574 29.2394Z" fill="#111827"/>
<path d="M67.9615 27.1277L65.218 28.3482C63.9758 27.9054 62.7553 27.4301 61.5401 26.9224L64.2405 26.0421C65.488 26.4472 66.7032 26.8036 67.9615 27.1277Z" fill="#111827"/>
<path d="M72.7255 25.07L69.9279 26.2635C68.6641 26.0259 67.404 25.7468 66.1474 25.4264L68.8802 24.5785C70.1709 24.7945 71.4293 24.9565 72.7255 25.07Z" fill="#111827"/>
<path d="M77.6991 22.9044C76.7216 23.3419 75.7441 23.7685 74.7611 24.1952C73.465 24.1628 72.1796 24.0872 70.8834 23.9684C71.8411 23.6731 72.7953 23.3707 73.7458 23.061C75.069 23.0556 76.3759 23.0232 77.6991 22.9044Z" fill="#111827"/>
<path d="M83.0512 20.4794C81.9962 20.9726 80.9377 21.4587 79.8756 21.9376C78.5416 22.1374 77.2022 22.2832 75.8574 22.3642C76.8908 22.0042 77.9187 21.6441 78.9412 21.2841C80.3238 21.0842 81.6902 20.8088 83.0512 20.4794Z" fill="#111827"/>
<path d="M59.6928 38.2154C58.6666 38.9715 57.6441 39.7366 56.6252 40.5107C55.3002 39.6429 53.995 38.7428 52.7097 37.8103C53.7358 37.146 54.7673 36.4817 55.8043 35.8282C57.0842 36.6654 58.3804 37.4593 59.6928 38.2154Z" fill="#111827"/>
<path d="M64.7316 34.6347C63.7559 35.3116 62.7856 35.9921 61.8206 36.6761C60.5029 35.9957 59.2175 35.2828 57.9321 34.5159C58.8935 33.938 59.8656 33.3655 60.8377 32.8038C62.1123 33.4735 63.4084 34.0838 64.7316 34.6347Z" fill="#111827"/>
<path d="M69.6035 31.3565C68.653 31.9775 67.7132 32.6094 66.7735 33.2413C65.4503 32.7714 64.1434 32.253 62.8634 31.6805C63.7869 31.1404 64.7212 30.6544 65.6556 30.1521C66.9517 30.5842 68.2695 31.0162 69.6035 31.3565Z" fill="#111827"/>
<path d="M74.464 28.2294C73.5135 28.8289 72.563 29.4338 71.6233 30.0441C70.2785 29.7902 68.9229 29.4716 67.6321 29.0989C68.5557 28.6129 69.4846 28.1376 70.4081 27.6624C71.7529 27.9162 73.1031 28.0998 74.464 28.2294Z" fill="#111827"/>
<path d="M79.4433 25.0916L76.5107 26.9278C75.139 26.9278 73.7672 26.8036 72.4062 26.6416L75.247 25.1834C76.662 25.2266 78.0607 25.196 79.4433 25.0916Z" fill="#111827"/>
<path d="M84.6877 21.7917L81.5877 23.7468C80.1673 23.9304 78.7523 24.0762 77.3211 24.1465C78.3256 23.6388 79.3194 23.1257 80.3239 22.6073C81.7875 22.402 83.2403 22.1158 84.6877 21.7917Z" fill="#111827"/>
<path d="M90.3312 18.1626L86.9773 20.3229C85.5083 20.7477 84.0267 21.1222 82.5325 21.4462C83.6127 20.8792 84.6928 20.3013 85.773 19.7234C87.3104 19.2625 88.8298 18.7423 90.3312 18.1626Z" fill="#111827"/>
</svg>
