<svg width="22" height="31" viewBox="0 0 22 31" fill="none" xmlns="http://www.w3.org/2000/svg">
<path d="M11 0C4.91857 0 0 4.8515 0 10.85C0 18.9875 11 31 11 31C11 31 22 18.9875 22 10.85C22 4.8515 17.0814 0 11 0ZM11 14.725C8.83143 14.725 7.07143 12.989 7.07143 10.85C7.07143 8.711 8.83143 6.975 11 6.975C13.1686 6.975 14.9286 8.711 14.9286 10.85C14.9286 12.989 13.1686 14.725 11 14.725Z" fill="#D46B2B"/>
</svg>
