<svg width="87" height="87" viewBox="0 0 87 87" fill="none" xmlns="http://www.w3.org/2000/svg">
<rect width="87" height="87" rx="5" fill="#E7F4EE"/>
<path d="M41.5312 68.9992C40.5826 68.872 39.6288 68.7778 38.6889 68.6105C32.9241 67.5839 28.0992 64.8579 24.2281 60.4779C20.6953 56.4831 18.6377 51.805 18.1285 46.5047C17.5007 39.9651 19.1712 34.0217 23.1871 28.8033C26.9065 23.9701 31.768 20.8363 37.749 19.59C45.221 18.0318 52.0721 19.5604 58.156 24.1688C63.0472 27.8725 66.1302 32.7911 67.4362 38.7939C67.6664 39.8536 67.7553 40.9447 67.9123 42.0201C67.9367 42.1944 67.9715 42.3652 68.0029 42.5377C68.0029 43.5138 68.0029 44.4898 68.0029 45.4676C67.9628 45.8197 67.9227 46.17 67.8826 46.5221C67.2845 51.9008 65.2286 56.6452 61.6034 60.6679C57.7532 64.9399 52.9824 67.6048 47.3065 68.6105C46.3666 68.7778 45.4128 68.872 44.4642 68.9992C43.4842 68.9992 42.5077 68.9992 41.5312 68.9992ZM42.9994 67.0663C55.734 67.0628 66.0709 56.7271 66.0656 44.0001C66.0621 31.2678 55.7235 20.9356 42.9925 20.9408C30.2579 20.9443 19.921 31.28 19.9263 44.007C19.9298 56.7375 30.2684 67.0715 42.9994 67.0663Z" fill="#109155"/>
<path d="M40.0042 50.3671C41.9676 48.1588 43.9032 45.9836 45.837 43.8084C48.7542 40.5264 51.6733 37.2444 54.5888 33.959C54.8992 33.6104 55.2409 33.3541 55.7327 33.4762C56.1111 33.5703 56.3447 33.83 56.4284 34.2134C56.5243 34.6509 56.282 34.9559 56.0169 35.2522C53.7902 37.7568 51.5651 40.2615 49.3384 42.7661C46.5815 45.865 43.8247 48.964 41.0661 52.063C40.4174 52.7933 39.9954 52.8316 39.2404 52.2268C36.2167 49.8111 33.1931 47.3936 30.1712 44.9744C30.0195 44.8524 29.8695 44.7234 29.7492 44.5718C29.4702 44.2249 29.4737 43.7317 29.7632 43.404C30.0613 43.0676 30.4362 42.9439 30.86 43.1391C31.064 43.2332 31.2471 43.3761 31.4232 43.5173C34.1696 45.7082 36.9125 47.9043 39.6554 50.0987C39.7565 50.1788 39.8612 50.2573 40.0042 50.3671Z" fill="#109155"/>
</svg>
