<svg width="46" height="46" viewBox="0 0 46 46" fill="none" xmlns="http://www.w3.org/2000/svg">
<path d="M40.25 17.75V40.3497C40.25 40.933 39.4211 41.0441 39.2676 40.4813L37.4755 33.9101C37.4162 33.6926 37.2186 33.5417 36.9931 33.5417H25.875H15.8333C15.5572 33.5417 15.3333 33.3178 15.3333 33.0417V17.75C15.3333 17.4739 15.5572 17.25 15.8333 17.25H39.75C40.0261 17.25 40.25 17.4739 40.25 17.75Z" stroke="white" stroke-width="0.6" stroke-linecap="round"/>
<path d="M34.5 14.3751V8.16675C34.5 7.89061 34.2761 7.66675 34 7.66675H6.25C5.97386 7.66675 5.75 7.89061 5.75 8.16675V28.784C5.75 29.2967 6.42974 29.4772 6.68412 29.032L9.43937 24.2103C9.52839 24.0546 9.69407 23.9584 9.87349 23.9584H12.4583" stroke="white" stroke-width="0.6" stroke-linecap="round"/>
</svg>
