<svg width="45" height="46" viewBox="0 0 45 46" fill="none" xmlns="http://www.w3.org/2000/svg">
<path d="M31.575 5.75016C31.575 6.64927 30.8637 7.36683 30 7.36683C29.1363 7.36683 28.425 6.64927 28.425 5.75016C28.425 4.85105 29.1363 4.1335 30 4.1335C30.8637 4.1335 31.575 4.85105 31.575 5.75016Z" stroke="black" stroke-width="0.6"/>
<path d="M19.8369 18.2933L27.9719 22.9132C28.0394 22.9515 28.0394 23.0488 27.9719 23.0871L19.8369 27.707C19.7702 27.7449 19.6875 27.6967 19.6875 27.62V18.3803C19.6875 18.3036 19.7702 18.2555 19.8369 18.2933Z" stroke="black" stroke-width="0.6" stroke-linecap="round"/>
<path d="M12.25 1.91675H32.75C33.3023 1.91675 33.75 2.36446 33.75 2.91675V43.0834C33.75 43.6357 33.3023 44.0834 32.75 44.0834H12.25C11.6977 44.0834 11.25 43.6357 11.25 43.0834V2.91675C11.25 2.36446 11.6977 1.91675 12.25 1.91675Z" stroke="black" stroke-width="0.6"/>
</svg>
