<svg width="42" height="25" viewBox="0 0 42 25" fill="none" xmlns="http://www.w3.org/2000/svg">
<path fill-rule="evenodd" clip-rule="evenodd" d="M9.14546 6.87903C8.1387 6.87903 7.17279 7.05487 6.27517 7.37514C6.27517 7.37514 5.68207 5.22721 7.675 1.16832L4.97055 0.0395107C4.97055 0.0395107 4.87266 0.00265503 4.87236 0.00265503C4.45511 -0.154152 1.63498 6.72886 1.44703 7.29837C0.263847 10.8787 -0.842297 15.9358 0.918594 19.4674C2.47397 22.5864 5.75977 24.2457 9.14526 24.2457C13.9 24.2457 17.754 20.3581 17.754 15.5619C17.754 10.7658 13.8997 6.87892 9.14526 6.87892" fill="white"/>
<path fill-rule="evenodd" clip-rule="evenodd" d="M33.3915 6.87903C32.3847 6.87903 31.4188 7.05487 30.5212 7.37514C30.5212 7.37514 29.9281 5.22721 31.921 1.16832L29.2166 0.0395107C29.2166 0.0395107 29.1187 0.00265503 29.1184 0.00265503C28.7011 -0.154152 25.881 6.72886 25.693 7.29837C24.5098 10.8787 23.4037 15.9358 25.1646 19.4674C26.72 22.5864 30.0058 24.2457 33.3913 24.2457C38.146 24.2457 42 20.3581 42 15.5619C42 10.7658 38.1457 6.87892 33.3913 6.87892" fill="white"/>
</svg>
