<svg width="28" height="27" viewBox="0 0 28 27" fill="none" xmlns="http://www.w3.org/2000/svg">
<path d="M26.8 10.6093H1.2C0.0959998 10.6093 0 11.7789 0 13.2259C0 14.6729 0.0959998 15.8425 1.2 15.8425H26.8C27.904 15.8425 28 14.6729 28 13.2259C28 11.7789 27.904 10.6093 26.8 10.6093ZM26.8 21.0757H1.2C0.0959998 21.0757 0 22.2453 0 23.6923C0 25.1393 0.0959998 26.3089 1.2 26.3089H26.8C27.904 26.3089 28 25.1393 28 23.6923C28 22.2453 27.904 21.0757 26.8 21.0757ZM1.2 5.37604H26.8C27.904 5.37604 28 4.20642 28 2.75943C28 1.31245 27.904 0.142822 26.8 0.142822H1.2C0.0959998 0.142822 0 1.31245 0 2.75943C0 4.20642 0.0959998 5.37604 1.2 5.37604Z" fill="#F4F9FF"/>
</svg>
