<svg width="46" height="46" viewBox="0 0 46 46" fill="none" xmlns="http://www.w3.org/2000/svg">
<path d="M36.4166 19.1666V4.83325C36.4166 4.28097 35.9689 3.83325 35.4166 3.83325H10.5833C10.031 3.83325 9.58325 4.28097 9.58325 4.83325V41.1666C9.58325 41.7189 10.031 42.1666 10.5833 42.1666H35.4166C35.9689 42.1666 36.4166 41.7189 36.4166 41.1666V33.5416" stroke="black" stroke-linecap="round"/>
<path d="M30.7752 29.7922L39.285 19.2447C39.4515 19.0382 39.6932 18.9064 39.9569 18.8782L41.5722 18.7055C42.1214 18.6468 42.6142 19.0444 42.6729 19.5935L42.8456 21.2088C42.8738 21.4725 42.7961 21.7367 42.6296 21.9431L34.1198 32.4906" stroke="black" stroke-linecap="round"/>
<path d="M30.7737 29.7922L30.4222 33.6499" stroke="black" stroke-linecap="round"/>
<path d="M30.4232 33.6498L34.1193 32.4906" stroke="black" stroke-linecap="round"/>
<path d="M38.1958 20.5945L41.5404 23.2929" stroke="black" stroke-linecap="round"/>
<path d="M16.2498 9.58325H13.5165C13.4613 9.58325 13.4165 9.62802 13.4165 9.68325V12.4166C13.4165 12.9689 13.8642 13.4166 14.4165 13.4166H16.2498C16.8021 13.4166 17.2498 12.9689 17.2498 12.4166V10.5833C17.2498 10.031 16.8021 9.58325 16.2498 9.58325Z" stroke="black" stroke-linecap="round"/>
<path d="M16.2498 17.25H13.5165C13.4613 17.25 13.4165 17.2948 13.4165 17.35V20.0833C13.4165 20.6356 13.8642 21.0833 14.4165 21.0833H16.2498C16.8021 21.0833 17.2498 20.6356 17.2498 20.0833V18.25C17.2498 17.6977 16.8021 17.25 16.2498 17.25Z" stroke="black" stroke-linecap="round"/>
<path d="M16.2498 24.9165H13.5165C13.4613 24.9165 13.4165 24.9613 13.4165 25.0165V27.7498C13.4165 28.3021 13.8642 28.7498 14.4165 28.7498H16.2498C16.8021 28.7498 17.2498 28.3021 17.2498 27.7498V25.9165C17.2498 25.3642 16.8021 24.9165 16.2498 24.9165Z" stroke="black" stroke-linecap="round"/>
<path d="M16.2498 32.5833H13.5165C13.4613 32.5833 13.4165 32.628 13.4165 32.6833V35.4166C13.4165 35.9689 13.8642 36.4166 14.4165 36.4166H16.2498C16.8021 36.4166 17.2498 35.9689 17.2498 35.4166V33.5833C17.2498 33.031 16.8021 32.5833 16.2498 32.5833Z" stroke="black" stroke-linecap="round"/>
<path d="M19.1665 10.5415H24.9165" stroke="black" stroke-linecap="round"/>
<path d="M19.1665 12.4583H28.7498" stroke="black" stroke-linecap="round"/>
<path d="M19.1665 18.2083H24.9165" stroke="black" stroke-linecap="round"/>
<path d="M19.1665 20.125H28.7498" stroke="black" stroke-linecap="round"/>
<path d="M19.1665 25.875H28.7498" stroke="black" stroke-linecap="round"/>
<path d="M19.1665 27.7915H24.9165" stroke="black" stroke-linecap="round"/>
<path d="M19.1665 33.5415H24.9165" stroke="black" stroke-linecap="round"/>
<path d="M19.1665 35.4583H28.7498" stroke="black" stroke-linecap="round"/>
</svg>
